--- /srv/rebuilderd/tmp/rebuilderdk8usxc/inputs/openjdk-21-jdk_21.0.13~8ea-1_amd64.deb +++ /srv/rebuilderd/tmp/rebuilderdk8usxc/out/openjdk-21-jdk_21.0.13~8ea-1_amd64.deb ├── file list │ @@ -1,3 +1,3 @@ │ -rw-r--r-- 0 0 0 4 2026-10-08 06:37:43.000000 debian-binary │ --rw-r--r-- 0 0 0 1840 2026-10-08 06:37:43.000000 control.tar.xz │ --rw-r--r-- 0 0 0 3612076 2026-10-08 06:37:43.000000 data.tar.xz │ +-rw-r--r-- 0 0 0 1844 2026-10-08 06:37:43.000000 control.tar.xz │ +-rw-r--r-- 0 0 0 3559044 2026-10-08 06:37:43.000000 data.tar.xz ├── control.tar.xz │ ├── control.tar │ │ ├── ./control │ │ │ @@ -1,13 +1,13 @@ │ │ │ Package: openjdk-21-jdk │ │ │ Source: openjdk-21 │ │ │ Version: 21.0.13~8ea-1 │ │ │ Architecture: amd64 │ │ │ Maintainer: OpenJDK Team │ │ │ -Installed-Size: 3726 │ │ │ +Installed-Size: 3745 │ │ │ Depends: openjdk-21-jre (= 21.0.13~8ea-1), openjdk-21-jdk-headless (= 21.0.13~8ea-1), libc6 (>= 2.34), zlib1g (>= 1:1.1.4) │ │ │ Recommends: libxt-dev │ │ │ Suggests: openjdk-21-demo, openjdk-21-source, visualvm │ │ │ Provides: java-compiler, java-sdk (= 21), java10-sdk, java11-sdk, java12-sdk, java13-sdk, java14-sdk, java15-sdk, java16-sdk, java17-sdk, java18-sdk, java19-sdk, java2-sdk, java20-sdk, java21-sdk, java5-sdk, java6-sdk, java7-sdk, java8-sdk, java9-sdk │ │ │ Section: java │ │ │ Priority: optional │ │ │ Multi-Arch: same │ │ ├── ./md5sums │ │ │ ├── ./md5sums │ │ │ │┄ Files differ ├── data.tar.xz │ ├── data.tar │ │ ├── file list │ │ │ @@ -13,17 +13,17 @@ │ │ │ drwxr-xr-x 0 root (0) root (0) 0 2026-10-08 06:37:43.000000 ./usr/lib/jvm/java-21-openjdk-amd64/man/man1/ │ │ │ -rw-r--r-- 0 root (0) root (0) 1723 2026-10-08 06:37:43.000000 ./usr/lib/jvm/java-21-openjdk-amd64/man/man1/jconsole.1.gz │ │ │ drwxr-xr-x 0 root (0) root (0) 0 2026-10-08 06:37:43.000000 ./usr/lib/jvm/openjdk-21/ │ │ │ drwxr-xr-x 0 root (0) root (0) 0 2026-10-08 06:37:43.000000 ./usr/share/ │ │ │ drwxr-xr-x 0 root (0) root (0) 0 2026-10-08 06:37:43.000000 ./usr/share/doc/ │ │ │ drwxr-xr-x 0 root (0) root (0) 0 2026-10-08 06:37:43.000000 ./usr/share/doc/openjdk-21-jre-headless/ │ │ │ drwxr-xr-x 0 root (0) root (0) 0 2026-10-08 06:37:43.000000 ./usr/share/doc/openjdk-21-jre-headless/test-amd64/ │ │ │ --rw-r--r-- 0 root (0) root (0) 28907 2026-10-08 06:37:43.000000 ./usr/share/doc/openjdk-21-jre-headless/test-amd64/check-hotspot-hotspot.log.gz │ │ │ +-rw-r--r-- 0 root (0) root (0) 28982 2026-10-08 06:37:43.000000 ./usr/share/doc/openjdk-21-jre-headless/test-amd64/check-hotspot-hotspot.log.gz │ │ │ -rw-r--r-- 0 root (0) root (0) 3922 2026-10-08 06:37:43.000000 ./usr/share/doc/openjdk-21-jre-headless/test-amd64/check-jaxp-hotspot.log.gz │ │ │ --rw-r--r-- 0 root (0) root (0) 55732 2026-10-08 06:37:43.000000 ./usr/share/doc/openjdk-21-jre-headless/test-amd64/check-jdk-hotspot.log.gz │ │ │ +-rw-r--r-- 0 root (0) root (0) 55743 2026-10-08 06:37:43.000000 ./usr/share/doc/openjdk-21-jre-headless/test-amd64/check-jdk-hotspot.log.gz │ │ │ -rw-r--r-- 0 root (0) root (0) 35230 2026-10-08 06:37:43.000000 ./usr/share/doc/openjdk-21-jre-headless/test-amd64/check-langtools-hotspot.log.gz │ │ │ --rw-r--r-- 0 root (0) root (0) 8596 2026-10-08 06:37:43.000000 ./usr/share/doc/openjdk-21-jre-headless/test-amd64/failed_tests-hotspot.tar.gz │ │ │ --rw-r--r-- 0 root (0) root (0) 3398 2026-10-08 06:37:43.000000 ./usr/share/doc/openjdk-21-jre-headless/test-amd64/jtreg-summary-hotspot.log │ │ │ --rw-r--r-- 0 root (0) root (0) 128125 2026-10-08 06:37:43.000000 ./usr/share/doc/openjdk-21-jre-headless/test-amd64/jtreg_output-hotspot.log.gz │ │ │ --rw-r--r-- 0 root (0) root (0) 3492199 2026-10-08 06:37:43.000000 ./usr/share/doc/openjdk-21-jre-headless/test-amd64/jtreport-hotspot.tar.gz │ │ │ +-rw-r--r-- 0 root (0) root (0) 8573 2026-10-08 06:37:43.000000 ./usr/share/doc/openjdk-21-jre-headless/test-amd64/failed_tests-hotspot.tar.gz │ │ │ +-rw-r--r-- 0 root (0) root (0) 3397 2026-10-08 06:37:43.000000 ./usr/share/doc/openjdk-21-jre-headless/test-amd64/jtreg-summary-hotspot.log │ │ │ +-rw-r--r-- 0 root (0) root (0) 128259 2026-10-08 06:37:43.000000 ./usr/share/doc/openjdk-21-jre-headless/test-amd64/jtreg_output-hotspot.log.gz │ │ │ +-rw-r--r-- 0 root (0) root (0) 3512029 2026-10-08 06:37:43.000000 ./usr/share/doc/openjdk-21-jre-headless/test-amd64/jtreport-hotspot.tar.gz │ │ │ lrwxrwxrwx 0 root (0) root (0) 0 2026-10-08 06:37:43.000000 ./usr/lib/jvm/openjdk-21/src.zip -> lib/src.zip │ │ │ lrwxrwxrwx 0 root (0) root (0) 0 2026-10-08 06:37:43.000000 ./usr/share/doc/openjdk-21-jdk -> openjdk-21-jre │ │ ├── ./usr/share/doc/openjdk-21-jre-headless/test-amd64/check-hotspot-hotspot.log.gz │ │ │ ├── check-hotspot-hotspot.log │ │ │ │ @@ -274,14 +274,16 @@ │ │ │ │ Passed: compiler/intrinsics/Test8005419.java │ │ │ │ Passed: compiler/intrinsics/Test8215792.java │ │ │ │ Passed: compiler/intrinsics/Test8237524.java │ │ │ │ Passed: compiler/intrinsics/TestArraysHashCode.java │ │ │ │ Passed: compiler/intrinsics/TestBitShuffleOpers.java │ │ │ │ Passed: compiler/intrinsics/TestCheckIndex.java │ │ │ │ Passed: compiler/intrinsics/TestCompareUnsigned.java │ │ │ │ +Passed: compiler/intrinsics/TestDoubleIsInfinite.java │ │ │ │ +Passed: compiler/intrinsics/TestFloatIsInfinite.java │ │ │ │ Passed: compiler/intrinsics/TestIntegerUnsignedDivMod.java │ │ │ │ Passed: compiler/intrinsics/TestLongUnsignedDivMod.java │ │ │ │ Passed: compiler/intrinsics/TestReferenceGetWithNull.java │ │ │ │ Passed: compiler/intrinsics/TestReferenceRefersTo.java │ │ │ │ Passed: compiler/intrinsics/TestRotate.java │ │ │ │ Passed: compiler/intrinsics/VectorizedMismatchTest.java │ │ │ │ Passed: compiler/intrinsics/zip/TestAdler32.java │ │ │ │ @@ -1526,18 +1528,21 @@ │ │ │ │ Passed: compiler/intrinsics/sha/sanity/TestSHA3Intrinsics.java │ │ │ │ Passed: compiler/intrinsics/sha/sanity/TestSHA3MultiBlockIntrinsics.java │ │ │ │ Passed: compiler/intrinsics/sha/sanity/TestSHA512Intrinsics.java │ │ │ │ Passed: compiler/intrinsics/sha/sanity/TestSHA512MultiBlockIntrinsics.java │ │ │ │ Passed: compiler/intrinsics/sha/TestDigest.java │ │ │ │ Passed: compiler/intrinsics/string/TestCopyValueOf.java │ │ │ │ Passed: compiler/intrinsics/string/TestCountPositives.java#id0 │ │ │ │ +Passed: compiler/intrinsics/string/TestCountPositives.java#id1 │ │ │ │ Passed: compiler/intrinsics/string/TestEncodeIntrinsics.java │ │ │ │ Passed: compiler/intrinsics/string/TestHasNegatives.java#id0 │ │ │ │ +Passed: compiler/intrinsics/string/TestHasNegatives.java#id1 │ │ │ │ Passed: compiler/intrinsics/string/TestStringConstruction.java │ │ │ │ Passed: compiler/intrinsics/string/TestStringConstructionIntrinsics.java#id0 │ │ │ │ +Passed: compiler/intrinsics/string/TestStringConstructionIntrinsics.java#id1 │ │ │ │ Passed: compiler/intrinsics/string/TestStringEqualsBadLength.java │ │ │ │ Passed: compiler/intrinsics/string/TestStringIndexOfCharIntrinsics.java │ │ │ │ Passed: compiler/intrinsics/string/TestStringIntrinsicMemoryFlow.java │ │ │ │ Passed: compiler/intrinsics/string/TestStringIntrinsicRangeChecks.java │ │ │ │ Passed: compiler/intrinsics/string/TestStringIntrinsics.java │ │ │ │ Passed: compiler/intrinsics/string/TestStringIntrinsics2.java │ │ │ │ Passed: compiler/intrinsics/string/TestStringLatin1IndexOfChar.java │ │ │ │ @@ -1700,14 +1705,22 @@ │ │ │ │ Passed: compiler/loopopts/superword/TestDependencyOffsets.java#avx1-v016-U │ │ │ │ Passed: compiler/loopopts/superword/TestDependencyOffsets.java#avx1-v032-A │ │ │ │ Passed: compiler/loopopts/superword/TestDependencyOffsets.java#avx1-v032-U │ │ │ │ Passed: compiler/loopopts/superword/TestDependencyOffsets.java#avx2-v016-A │ │ │ │ Passed: compiler/loopopts/superword/TestDependencyOffsets.java#avx2-v016-U │ │ │ │ Passed: compiler/loopopts/superword/TestDependencyOffsets.java#avx2-v032-A │ │ │ │ Passed: compiler/loopopts/superword/TestDependencyOffsets.java#avx2-v032-U │ │ │ │ +Passed: compiler/loopopts/superword/TestDependencyOffsets.java#avx512bw-v032-A │ │ │ │ +Passed: compiler/loopopts/superword/TestDependencyOffsets.java#avx512bw-v032-U │ │ │ │ +Passed: compiler/loopopts/superword/TestDependencyOffsets.java#avx512bw-v064-A │ │ │ │ +Passed: compiler/loopopts/superword/TestDependencyOffsets.java#avx512bw-v064-U │ │ │ │ +Passed: compiler/loopopts/superword/TestDependencyOffsets.java#avx512-v032-A │ │ │ │ +Passed: compiler/loopopts/superword/TestDependencyOffsets.java#avx512-v032-U │ │ │ │ +Passed: compiler/loopopts/superword/TestDependencyOffsets.java#avx512-v064-A │ │ │ │ +Passed: compiler/loopopts/superword/TestDependencyOffsets.java#avx512-v064-U │ │ │ │ Passed: compiler/loopopts/superword/TestDependencyOffsets.java#sse4-v002-A │ │ │ │ Passed: compiler/loopopts/superword/TestDependencyOffsets.java#sse4-v002-U │ │ │ │ Passed: compiler/loopopts/superword/TestDependencyOffsets.java#sse4-v004-A │ │ │ │ Passed: compiler/loopopts/superword/TestDependencyOffsets.java#sse4-v004-U │ │ │ │ Passed: compiler/loopopts/superword/TestDependencyOffsets.java#sse4-v008-A │ │ │ │ Passed: compiler/loopopts/superword/TestDependencyOffsets.java#sse4-v008-U │ │ │ │ Passed: compiler/loopopts/superword/TestDependencyOffsets.java#sse4-v016-A │ │ │ │ @@ -2001,19 +2014,21 @@ │ │ │ │ Passed: compiler/vectorization/TestNaNVector.java │ │ │ │ Passed: compiler/vectorization/TestNarrowedIntegerReverseBytes.java │ │ │ │ Passed: compiler/vectorization/TestNumberOfContinuousZeros.java │ │ │ │ Passed: compiler/vectorization/TestOptionVectorize.java │ │ │ │ Passed: compiler/vectorization/TestOptionVectorizeIR.java │ │ │ │ Passed: compiler/vectorization/TestOverlappingMismatchedAccesses.java │ │ │ │ Passed: compiler/vectorization/TestPopCountVector.java │ │ │ │ +Passed: compiler/vectorization/TestPopCountVectorLong.java │ │ │ │ Passed: compiler/vectorization/TestPopulateIndex.java │ │ │ │ Passed: compiler/vectorization/TestReplicateLoopIV.java │ │ │ │ Passed: compiler/vectorization/TestReverseBitsVector.java │ │ │ │ Passed: compiler/vectorization/TestReverseBytes.java │ │ │ │ Passed: compiler/vectorization/TestRotateByteAndShortVector.java │ │ │ │ +Passed: compiler/vectorization/TestRoundVectDouble.java │ │ │ │ Passed: compiler/vectorization/TestRoundVectFloat.java │ │ │ │ Passed: compiler/vectorization/TestSignumVector.java │ │ │ │ Passed: compiler/vectorization/TestSmallVectorPopIndex.java │ │ │ │ Passed: compiler/vectorization/TestSubwordReverseBytes.java │ │ │ │ Passed: compiler/vectorization/TestUnexpectedLoadOrdering.java │ │ │ │ Passed: compiler/vectorization/TestVectorsNotSavedAtSafepoint.java │ │ │ │ Passed: compiler/vectorization/TestVectorUnalignedOffset.java │ │ │ │ @@ -3144,14 +3159,14 @@ │ │ │ │ Passed: serviceability/tmtools/jstat/GcCapacityTest.java │ │ │ │ Passed: serviceability/tmtools/jstat/GcCauseTest01.java │ │ │ │ Passed: serviceability/tmtools/jstat/GcCauseTest02.java │ │ │ │ Passed: serviceability/tmtools/jstat/GcCauseTest03.java │ │ │ │ Passed: serviceability/tmtools/jstat/GcNewTest.java │ │ │ │ Passed: serviceability/tmtools/jstat/GcTest01.java │ │ │ │ Passed: serviceability/tmtools/jstat/GcTest02.java │ │ │ │ -Test results: passed: 3,148; skipped: 4; excluded: 42; did not match keywords: 75; did not meet platform requirements: 179 │ │ │ │ +Test results: passed: 3,163; skipped: 4; excluded: 42; did not match keywords: 75; did not meet platform requirements: 164 │ │ │ │ Framework-based tests: 2,176 = 1,909 TestNG + 267 JUnit │ │ │ │ Report written to /build/reproducible-path/openjdk-21-21.0.13~8ea/jtreg-test-output/hotspot/0/JTreport/html/report.html │ │ │ │ Results written to /tmp/hotspot/JTwork │ │ │ │ [debian/tests/jtreg-autopkgtest.sh] nothing to cleanup │ │ │ │ Unable to compare jtreg results: no build jtreport found for hotspot/amd64. │ │ │ │ Reason: '/usr/share/doc/openjdk-21-jre-headless//test-amd64/jtreport-hotspot.tar.gz' does not exist. │ │ ├── ./usr/share/doc/openjdk-21-jre-headless/test-amd64/check-jdk-hotspot.log.gz │ │ │ ├── check-jdk-hotspot.log │ │ │ │ @@ -666,14 +666,15 @@ │ │ │ │ Passed: java/io/File/ListRoots.java │ │ │ │ Passed: java/io/File/ListSpace.java │ │ │ │ Passed: java/io/File/MaxPathLength.java │ │ │ │ Passed: java/io/File/Mkdir.java │ │ │ │ Passed: java/io/File/NulFile.java │ │ │ │ Passed: java/io/File/NullArgs.java │ │ │ │ Passed: java/io/File/SetAccess.java │ │ │ │ +Passed: java/io/File/SetLastModified.java │ │ │ │ Passed: java/io/File/SetReadOnly.java │ │ │ │ Passed: java/io/File/SymLinks.java │ │ │ │ Passed: java/io/File/TempDirDoesNotExist.java │ │ │ │ Passed: java/io/File/TimeZoneLastModified.java │ │ │ │ Passed: java/io/File/ToURI.java │ │ │ │ Passed: java/io/File/ToURL.java │ │ │ │ Passed: java/io/File/Unicode.java │ │ │ │ @@ -2669,14 +2670,15 @@ │ │ │ │ Passed: java/nio/channels/AsynchronousSocketChannel/StressLoopback.java │ │ │ │ Passed: java/nio/channels/Channels/Basic.java │ │ │ │ Passed: java/nio/channels/Channels/Basic2.java │ │ │ │ Passed: java/nio/channels/Channels/CloseWriterOnFailedFlush.java │ │ │ │ Passed: java/nio/channels/Channels/EncodingTest.java │ │ │ │ Passed: java/nio/channels/Channels/ReadByte.java │ │ │ │ Passed: java/nio/channels/Channels/ReadOffset.java │ │ │ │ +Passed: java/nio/channels/Channels/ReadXBytes.java │ │ │ │ Passed: java/nio/channels/Channels/ShortWrite.java │ │ │ │ Passed: java/nio/channels/Channels/SocketChannelStreams.java │ │ │ │ Passed: java/nio/channels/Channels/TinyBuffers.java │ │ │ │ Passed: java/nio/channels/Channels/TransferTo_2GB_transferFrom.java │ │ │ │ Passed: java/nio/channels/Channels/TransferTo_2GB_transferTo.java │ │ │ │ Passed: java/nio/channels/Channels/TransferTo.java │ │ │ │ Passed: java/nio/channels/Channels/TransferTo2.java │ │ │ │ @@ -6505,16 +6507,16 @@ │ │ │ │ Passed: tools/launcher/TestXcheckJNIWarnings.java#jdwp-agent │ │ │ │ Passed: tools/launcher/TestXcheckJNIWarnings.java#noagent │ │ │ │ Passed: tools/launcher/ToolsOpts.java │ │ │ │ Passed: tools/launcher/TooSmallStackSize.java │ │ │ │ Passed: tools/launcher/UnicodeTest.java │ │ │ │ Passed: tools/launcher/UnresolvedExceptions.java │ │ │ │ Passed: tools/launcher/VersionCheck.java │ │ │ │ -Test results: passed: 6,500; failed: 9; skipped: 115; excluded: 38; did not match keywords: 37; did not meet module requirements: 3; did not meet platform requirements: 101 │ │ │ │ -Framework-based tests: 335,201 = 164,231 TestNG + 170,970 JUnit │ │ │ │ +Test results: passed: 6,502; failed: 9; skipped: 115; excluded: 38; did not match keywords: 37; did not meet module requirements: 3; did not meet platform requirements: 99 │ │ │ │ +Framework-based tests: 335,220 = 164,250 TestNG + 170,970 JUnit │ │ │ │ Report written to /build/reproducible-path/openjdk-21-21.0.13~8ea/jtreg-test-output/jdk/0/JTreport/html/report.html │ │ │ │ Results written to /tmp/jdk/JTwork │ │ │ │ Directory "jtreg-test-output/jdk/1/JTreport" not found: creating │ │ │ │ FAILED: java/net/MulticastSocket/B6427403.java │ │ │ │ FAILED: java/net/MulticastSocket/NoLoopbackPackets.java │ │ │ │ FAILED: java/net/MulticastSocket/Promiscuous.java │ │ │ │ FAILED: java/net/MulticastSocket/SetLoopbackMode.java │ │ ├── ./usr/share/doc/openjdk-21-jre-headless/test-amd64/failed_tests-hotspot.tar.gz │ │ │ ├── failed_tests-hotspot.tar │ │ │ │ ├── file list │ │ │ │ │ @@ -1,9 +1,9 @@ │ │ │ │ │ --rw-r--r-- 0 sbuild (999) sbuild (999) 6806 2026-10-08 20:09:08.000000 jtreg-test-output/jdk/JTwork/java/net/MulticastSocket/B6427403.jtr │ │ │ │ │ --rw-r--r-- 0 sbuild (999) sbuild (999) 7833 2026-10-08 20:09:08.000000 jtreg-test-output/jdk/JTwork/java/net/MulticastSocket/NoLoopbackPackets.jtr │ │ │ │ │ --rw-r--r-- 0 sbuild (999) sbuild (999) 7839 2026-10-08 20:09:08.000000 jtreg-test-output/jdk/JTwork/java/net/MulticastSocket/Promiscuous.jtr │ │ │ │ │ --rw-r--r-- 0 sbuild (999) sbuild (999) 8452 2026-10-08 20:09:08.000000 jtreg-test-output/jdk/JTwork/java/net/MulticastSocket/SetLoopbackMode.jtr │ │ │ │ │ --rw-r--r-- 0 sbuild (999) sbuild (999) 8873 2026-10-08 20:09:09.000000 jtreg-test-output/jdk/JTwork/java/net/MulticastSocket/SetLoopbackModeIPv4.jtr │ │ │ │ │ --rw-r--r-- 0 sbuild (999) sbuild (999) 9727 2026-10-08 20:09:09.000000 jtreg-test-output/jdk/JTwork/java/net/MulticastSocket/Test.jtr │ │ │ │ │ --rw-r--r-- 0 sbuild (999) sbuild (999) 7476 2026-10-08 20:09:09.000000 jtreg-test-output/jdk/JTwork/java/net/SocketOption/OptionsTest.jtr │ │ │ │ │ --rw-r--r-- 0 sbuild (999) sbuild (999) 15160 2026-10-08 20:09:10.000000 jtreg-test-output/jdk/JTwork/java/net/SocketPermission/SocketPermissionTest.jtr │ │ │ │ │ --rw-r--r-- 0 sbuild (999) sbuild (999) 25784 2026-10-08 20:09:13.000000 jtreg-test-output/jdk/JTwork/sun/security/krb5/auto/Addresses.jtr │ │ │ │ │ +-rw-r--r-- 0 sbuild (999) sbuild (999) 6805 2026-10-10 00:11:09.000000 jtreg-test-output/jdk/JTwork/java/net/MulticastSocket/B6427403.jtr │ │ │ │ │ +-rw-r--r-- 0 sbuild (999) sbuild (999) 7832 2026-10-10 00:11:09.000000 jtreg-test-output/jdk/JTwork/java/net/MulticastSocket/NoLoopbackPackets.jtr │ │ │ │ │ +-rw-r--r-- 0 sbuild (999) sbuild (999) 7838 2026-10-10 00:11:09.000000 jtreg-test-output/jdk/JTwork/java/net/MulticastSocket/Promiscuous.jtr │ │ │ │ │ +-rw-r--r-- 0 sbuild (999) sbuild (999) 8453 2026-10-10 00:11:09.000000 jtreg-test-output/jdk/JTwork/java/net/MulticastSocket/SetLoopbackMode.jtr │ │ │ │ │ +-rw-r--r-- 0 sbuild (999) sbuild (999) 8870 2026-10-10 00:11:09.000000 jtreg-test-output/jdk/JTwork/java/net/MulticastSocket/SetLoopbackModeIPv4.jtr │ │ │ │ │ +-rw-r--r-- 0 sbuild (999) sbuild (999) 9726 2026-10-10 00:11:09.000000 jtreg-test-output/jdk/JTwork/java/net/MulticastSocket/Test.jtr │ │ │ │ │ +-rw-r--r-- 0 sbuild (999) sbuild (999) 7477 2026-10-10 00:11:09.000000 jtreg-test-output/jdk/JTwork/java/net/SocketOption/OptionsTest.jtr │ │ │ │ │ +-rw-r--r-- 0 sbuild (999) sbuild (999) 15156 2026-10-10 00:11:11.000000 jtreg-test-output/jdk/JTwork/java/net/SocketPermission/SocketPermissionTest.jtr │ │ │ │ │ +-rw-r--r-- 0 sbuild (999) sbuild (999) 25781 2026-10-10 00:11:13.000000 jtreg-test-output/jdk/JTwork/sun/security/krb5/auto/Addresses.jtr │ │ │ │ ├── jtreg-test-output/jdk/JTwork/java/net/MulticastSocket/B6427403.jtr │ │ │ │ │ @@ -1,70 +1,70 @@ │ │ │ │ │ #Test Results (version 2) │ │ │ │ │ -#Thu Oct 08 20:09:08 UTC 2026 │ │ │ │ │ +#Sat Oct 10 00:11:09 UTC 2026 │ │ │ │ │ #-----testdescription----- │ │ │ │ │ $file=/build/reproducible-path/openjdk-21-21.0.13~8ea/test/jdk/java/net/MulticastSocket/B6427403.java │ │ │ │ │ $root=/build/reproducible-path/openjdk-21-21.0.13~8ea/test/jdk │ │ │ │ │ keywords=bug6427403 │ │ │ │ │ run=USER_SPECIFIED main B6427403\n │ │ │ │ │ source=B6427403.java │ │ │ │ │ title=java.net.MulticastSocket.joinGroup() reports 'socket closed' │ │ │ │ │ │ │ │ │ │ #-----environment----- │ │ │ │ │ │ │ │ │ │ #-----testresult----- │ │ │ │ │ description=file\:/build/reproducible-path/openjdk-21-21.0.13~8ea/test/jdk/java/net/MulticastSocket/B6427403.java │ │ │ │ │ -elapsed=767 0\:00\:00.767 │ │ │ │ │ -end=Thu Oct 08 20\:09\:08 UTC 2026 │ │ │ │ │ +elapsed=471 0\:00\:00.471 │ │ │ │ │ +end=Sat Oct 10 00\:11\:09 UTC 2026 │ │ │ │ │ environment=regtest │ │ │ │ │ execStatus=Failed. Execution failed\: `main' threw exception\: java.net.SocketException\: No such device (setsockopt failed) │ │ │ │ │ harnessLoaderMode=Classpath Loader │ │ │ │ │ harnessVariety=Full Bundle │ │ │ │ │ hostname=sbuild │ │ │ │ │ javatestOS=Linux 6.12.111+deb13-amd64 (amd64) │ │ │ │ │ javatestVersion=6.0-ea+b26-2026-03-18-${BUILT_FROM_COMMIT} │ │ │ │ │ jtregVersion=jtreg 8.3 src 1 │ │ │ │ │ script=com.sun.javatest.regtest.exec.RegressionScript │ │ │ │ │ sections=script_messages build main │ │ │ │ │ -start=Thu Oct 08 20\:09\:07 UTC 2026 │ │ │ │ │ +start=Sat Oct 10 00\:11\:08 UTC 2026 │ │ │ │ │ test=java/net/MulticastSocket/B6427403.java │ │ │ │ │ testJDK=/build/reproducible-path/openjdk-21-21.0.13~8ea/build/bootcycle-build/images/jdk │ │ │ │ │ -testJDK_OS=[name\:Linux,arch\:amd64,version\:6.12.111+deb13-amd64,family\:linux,simple_arch\:x64,simple_version\:6.12,processors\:6,maxMemory\:16775884800,maxSwap\:182536105984] │ │ │ │ │ +testJDK_OS=[name\:Linux,arch\:amd64,version\:6.12.111+deb13-amd64,family\:linux,simple_arch\:x64,simple_version\:6.12,processors\:4,maxMemory\:33662713856,maxSwap\:34359734272] │ │ │ │ │ testJDK_os.arch=amd64 │ │ │ │ │ testJDK_os.name=Linux │ │ │ │ │ testJDK_os.version=6.12.111+deb13-amd64 │ │ │ │ │ -totalTime=773 │ │ │ │ │ +totalTime=474 │ │ │ │ │ user.name=sbuild │ │ │ │ │ work=/tmp/jdk/JTwork/java/net/MulticastSocket │ │ │ │ │ │ │ │ │ │ #section:script_messages │ │ │ │ │ ----------messages:(4/271)---------- │ │ │ │ │ JDK under test: /build/reproducible-path/openjdk-21-21.0.13~8ea/build/bootcycle-build/images/jdk │ │ │ │ │ openjdk version "21.0.13-ea" 2026-10-20 │ │ │ │ │ OpenJDK Runtime Environment (build 21.0.13-ea+8-1-Debian) │ │ │ │ │ OpenJDK 64-Bit Server VM (build 21.0.13-ea+8-1-Debian, mixed mode, sharing) │ │ │ │ │ │ │ │ │ │ #section:build │ │ │ │ │ ----------messages:(5/178)---------- │ │ │ │ │ command: build B6427403 │ │ │ │ │ reason: Named class compiled on demand │ │ │ │ │ -started: Thu Oct 08 20:09:07.841 UTC 2026 │ │ │ │ │ -finished: Thu Oct 08 20:09:07.859 UTC 2026 │ │ │ │ │ -elapsed time (seconds): 0.018 │ │ │ │ │ +started: Sat Oct 10 00:11:08.674 UTC 2026 │ │ │ │ │ +finished: Sat Oct 10 00:11:08.685 UTC 2026 │ │ │ │ │ +elapsed time (seconds): 0.011 │ │ │ │ │ result: Passed. All files up to date │ │ │ │ │ │ │ │ │ │ #section:main │ │ │ │ │ ----------messages:(8/234)---------- │ │ │ │ │ command: main B6427403 │ │ │ │ │ reason: User specified action: run main B6427403 │ │ │ │ │ -started: Thu Oct 08 20:09:07.861 UTC 2026 │ │ │ │ │ +started: Sat Oct 10 00:11:08.691 UTC 2026 │ │ │ │ │ Mode: agentvm │ │ │ │ │ Agent id: 1 │ │ │ │ │ -Process id: 3401104 │ │ │ │ │ -finished: Thu Oct 08 20:09:08.483 UTC 2026 │ │ │ │ │ -elapsed time (seconds): 0.622 │ │ │ │ │ +Process id: 1140761 │ │ │ │ │ +finished: Sat Oct 10 00:11:09.058 UTC 2026 │ │ │ │ │ +elapsed time (seconds): 0.367 │ │ │ │ │ ----------configuration:(15/668)---------- │ │ │ │ │ Boot Layer │ │ │ │ │ class path: /usr/share/jtreg/lib/javatest.jar │ │ │ │ │ /usr/share/jtreg/lib/jtreg.jar │ │ │ │ │ /usr/share/jtreg/lib/junit-platform-console-standalone.jar │ │ │ │ │ /usr/share/jtreg/lib/testng.jar │ │ │ │ │ /usr/share/jtreg/lib/guice.jar │ │ │ │ ├── jtreg-test-output/jdk/JTwork/java/net/MulticastSocket/NoLoopbackPackets.jtr │ │ │ │ │ @@ -1,9 +1,9 @@ │ │ │ │ │ #Test Results (version 2) │ │ │ │ │ -#Thu Oct 08 20:09:08 UTC 2026 │ │ │ │ │ +#Sat Oct 10 00:11:09 UTC 2026 │ │ │ │ │ #-----testdescription----- │ │ │ │ │ $file=/build/reproducible-path/openjdk-21-21.0.13~8ea/test/jdk/java/net/MulticastSocket/NoLoopbackPackets.java │ │ │ │ │ $root=/build/reproducible-path/openjdk-21-21.0.13~8ea/test/jdk │ │ │ │ │ keywords=bug4742177 │ │ │ │ │ library=/test/lib │ │ │ │ │ requires=os.family \!\= "windows" │ │ │ │ │ run=ASSUMED_ACTION main NoLoopbackPackets\n │ │ │ │ │ @@ -11,33 +11,33 @@ │ │ │ │ │ title=Re-test IPv6 (and specifically MulticastSocket) with latest Linux & USAGI code │ │ │ │ │ │ │ │ │ │ #-----environment----- │ │ │ │ │ │ │ │ │ │ #-----testresult----- │ │ │ │ │ description=file\:/build/reproducible-path/openjdk-21-21.0.13~8ea/test/jdk/java/net/MulticastSocket/NoLoopbackPackets.java │ │ │ │ │ elapsed=95 0\:00\:00.095 │ │ │ │ │ -end=Thu Oct 08 20\:09\:08 UTC 2026 │ │ │ │ │ +end=Sat Oct 10 00\:11\:09 UTC 2026 │ │ │ │ │ environment=regtest │ │ │ │ │ execStatus=Failed. Execution failed\: `main' threw exception\: java.net.SocketException\: No such device (setsockopt failed) │ │ │ │ │ harnessLoaderMode=Classpath Loader │ │ │ │ │ harnessVariety=Full Bundle │ │ │ │ │ hostname=sbuild │ │ │ │ │ javatestOS=Linux 6.12.111+deb13-amd64 (amd64) │ │ │ │ │ javatestVersion=6.0-ea+b26-2026-03-18-${BUILT_FROM_COMMIT} │ │ │ │ │ jtregVersion=jtreg 8.3 src 1 │ │ │ │ │ script=com.sun.javatest.regtest.exec.RegressionScript │ │ │ │ │ sections=script_messages build main │ │ │ │ │ -start=Thu Oct 08 20\:09\:08 UTC 2026 │ │ │ │ │ +start=Sat Oct 10 00\:11\:09 UTC 2026 │ │ │ │ │ test=java/net/MulticastSocket/NoLoopbackPackets.java │ │ │ │ │ testJDK=/build/reproducible-path/openjdk-21-21.0.13~8ea/build/bootcycle-build/images/jdk │ │ │ │ │ -testJDK_OS=[name\:Linux,arch\:amd64,version\:6.12.111+deb13-amd64,family\:linux,simple_arch\:x64,simple_version\:6.12,processors\:6,maxMemory\:16775884800,maxSwap\:182536105984] │ │ │ │ │ +testJDK_OS=[name\:Linux,arch\:amd64,version\:6.12.111+deb13-amd64,family\:linux,simple_arch\:x64,simple_version\:6.12,processors\:4,maxMemory\:33662713856,maxSwap\:34359734272] │ │ │ │ │ testJDK_os.arch=amd64 │ │ │ │ │ testJDK_os.name=Linux │ │ │ │ │ testJDK_os.version=6.12.111+deb13-amd64 │ │ │ │ │ -totalTime=96 │ │ │ │ │ +totalTime=97 │ │ │ │ │ user.name=sbuild │ │ │ │ │ work=/tmp/jdk/JTwork/java/net/MulticastSocket │ │ │ │ │ │ │ │ │ │ #section:script_messages │ │ │ │ │ ----------messages:(7/481)---------- │ │ │ │ │ JDK under test: /build/reproducible-path/openjdk-21-21.0.13~8ea/build/bootcycle-build/images/jdk │ │ │ │ │ openjdk version "21.0.13-ea" 2026-10-20 │ │ │ │ │ @@ -47,29 +47,29 @@ │ │ │ │ │ source directory: /build/reproducible-path/openjdk-21-21.0.13~8ea/test/lib │ │ │ │ │ class directory: /tmp/jdk/JTwork/classes/java/net/MulticastSocket/NoLoopbackPackets.d/test/lib │ │ │ │ │ │ │ │ │ │ #section:build │ │ │ │ │ ----------messages:(5/187)---------- │ │ │ │ │ command: build NoLoopbackPackets │ │ │ │ │ reason: Named class compiled on demand │ │ │ │ │ -started: Thu Oct 08 20:09:08.499 UTC 2026 │ │ │ │ │ -finished: Thu Oct 08 20:09:08.500 UTC 2026 │ │ │ │ │ -elapsed time (seconds): 0.001 │ │ │ │ │ +started: Sat Oct 10 00:11:09.073 UTC 2026 │ │ │ │ │ +finished: Sat Oct 10 00:11:09.078 UTC 2026 │ │ │ │ │ +elapsed time (seconds): 0.005 │ │ │ │ │ result: Passed. All files up to date │ │ │ │ │ │ │ │ │ │ #section:main │ │ │ │ │ ----------messages:(8/264)---------- │ │ │ │ │ command: main NoLoopbackPackets │ │ │ │ │ reason: Assumed action based on file name: run main NoLoopbackPackets │ │ │ │ │ -started: Thu Oct 08 20:09:08.500 UTC 2026 │ │ │ │ │ +started: Sat Oct 10 00:11:09.078 UTC 2026 │ │ │ │ │ Mode: agentvm │ │ │ │ │ Agent id: 1 │ │ │ │ │ -Process id: 3401104 │ │ │ │ │ -finished: Thu Oct 08 20:09:08.589 UTC 2026 │ │ │ │ │ -elapsed time (seconds): 0.089 │ │ │ │ │ +Process id: 1140761 │ │ │ │ │ +finished: Sat Oct 10 00:11:09.166 UTC 2026 │ │ │ │ │ +elapsed time (seconds): 0.088 │ │ │ │ │ ----------configuration:(17/840)---------- │ │ │ │ │ Boot Layer │ │ │ │ │ class path: /usr/share/jtreg/lib/javatest.jar │ │ │ │ │ /usr/share/jtreg/lib/jtreg.jar │ │ │ │ │ /usr/share/jtreg/lib/junit-platform-console-standalone.jar │ │ │ │ │ /usr/share/jtreg/lib/testng.jar │ │ │ │ │ /usr/share/jtreg/lib/guice.jar │ │ │ │ │ @@ -113,15 +113,15 @@ │ │ │ │ │ -Dtest.class.path=/tmp/jdk/JTwork/classes/java/net/MulticastSocket/NoLoopbackPackets.d:/tmp/jdk/JTwork/classes/java/net/MulticastSocket/NoLoopbackPackets.d/test/lib \\ │ │ │ │ │ -Dtest.class.path.prefix=/tmp/jdk/JTwork/classes/java/net/MulticastSocket/NoLoopbackPackets.d:/build/reproducible-path/openjdk-21-21.0.13~8ea/test/jdk/java/net/MulticastSocket:/tmp/jdk/JTwork/classes/java/net/MulticastSocket/NoLoopbackPackets.d/test/lib \\ │ │ │ │ │ -classpath /tmp/jdk/JTwork/classes/java/net/MulticastSocket/NoLoopbackPackets.d:/build/reproducible-path/openjdk-21-21.0.13~8ea/test/jdk/java/net/MulticastSocket:/tmp/jdk/JTwork/classes/java/net/MulticastSocket/NoLoopbackPackets.d/test/lib:/build/reproducible-path/openjdk-21-21.0.13~8ea/test/lib:/usr/share/jtreg/lib/javatest.jar:/usr/share/jtreg/lib/jtreg.jar \\ │ │ │ │ │ NoLoopbackPackets │ │ │ │ │ ----------stdout:(0/0)---------- │ │ │ │ │ ----------stderr:(0/0)---------- │ │ │ │ │ ----------System.out:(1/32)---------- │ │ │ │ │ -joining group: /224.1.1.1:42784 │ │ │ │ │ +joining group: /224.1.1.1:54777 │ │ │ │ │ ----------System.err:(17/1050)---------- │ │ │ │ │ java.net.SocketException: No such device (setsockopt failed) │ │ │ │ │ at java.base/sun.nio.ch.Net.joinOrDrop4(Native Method) │ │ │ │ │ at java.base/sun.nio.ch.Net.join4(Net.java:720) │ │ │ │ │ at java.base/sun.nio.ch.DatagramChannelImpl.innerJoin(DatagramChannelImpl.java:1676) │ │ │ │ │ at java.base/sun.nio.ch.DatagramChannelImpl.join(DatagramChannelImpl.java:1694) │ │ │ │ │ at java.base/sun.nio.ch.DatagramSocketAdaptor.joinGroup(DatagramSocketAdaptor.java:494) │ │ │ │ ├── jtreg-test-output/jdk/JTwork/java/net/MulticastSocket/Promiscuous.jtr │ │ │ │ │ @@ -1,42 +1,42 @@ │ │ │ │ │ #Test Results (version 2) │ │ │ │ │ -#Thu Oct 08 20:09:08 UTC 2026 │ │ │ │ │ +#Sat Oct 10 00:11:09 UTC 2026 │ │ │ │ │ #-----testdescription----- │ │ │ │ │ $file=/build/reproducible-path/openjdk-21-21.0.13~8ea/test/jdk/java/net/MulticastSocket/Promiscuous.java │ │ │ │ │ $root=/build/reproducible-path/openjdk-21-21.0.13~8ea/test/jdk │ │ │ │ │ keywords=bug8014499 bug8219804 othervm │ │ │ │ │ library=/test/lib │ │ │ │ │ run=USER_SPECIFIED main Promiscuous\nUSER_SPECIFIED main/othervm -Djava.net.preferIPv4Stack\=true Promiscuous\n │ │ │ │ │ source=Promiscuous.java │ │ │ │ │ title=Test for interference when two sockets are bound to the same port but joined to different multicast groups │ │ │ │ │ │ │ │ │ │ #-----environment----- │ │ │ │ │ │ │ │ │ │ #-----testresult----- │ │ │ │ │ description=file\:/build/reproducible-path/openjdk-21-21.0.13~8ea/test/jdk/java/net/MulticastSocket/Promiscuous.java │ │ │ │ │ -elapsed=122 0\:00\:00.122 │ │ │ │ │ -end=Thu Oct 08 20\:09\:08 UTC 2026 │ │ │ │ │ +elapsed=109 0\:00\:00.109 │ │ │ │ │ +end=Sat Oct 10 00\:11\:09 UTC 2026 │ │ │ │ │ environment=regtest │ │ │ │ │ execStatus=Failed. Execution failed\: `main' threw exception\: java.net.SocketException\: Network is unreachable │ │ │ │ │ harnessLoaderMode=Classpath Loader │ │ │ │ │ harnessVariety=Full Bundle │ │ │ │ │ hostname=sbuild │ │ │ │ │ javatestOS=Linux 6.12.111+deb13-amd64 (amd64) │ │ │ │ │ javatestVersion=6.0-ea+b26-2026-03-18-${BUILT_FROM_COMMIT} │ │ │ │ │ jtregVersion=jtreg 8.3 src 1 │ │ │ │ │ script=com.sun.javatest.regtest.exec.RegressionScript │ │ │ │ │ sections=script_messages build main │ │ │ │ │ -start=Thu Oct 08 20\:09\:08 UTC 2026 │ │ │ │ │ +start=Sat Oct 10 00\:11\:09 UTC 2026 │ │ │ │ │ test=java/net/MulticastSocket/Promiscuous.java │ │ │ │ │ testJDK=/build/reproducible-path/openjdk-21-21.0.13~8ea/build/bootcycle-build/images/jdk │ │ │ │ │ -testJDK_OS=[name\:Linux,arch\:amd64,version\:6.12.111+deb13-amd64,family\:linux,simple_arch\:x64,simple_version\:6.12,processors\:6,maxMemory\:16775884800,maxSwap\:182536105984] │ │ │ │ │ +testJDK_OS=[name\:Linux,arch\:amd64,version\:6.12.111+deb13-amd64,family\:linux,simple_arch\:x64,simple_version\:6.12,processors\:4,maxMemory\:33662713856,maxSwap\:34359734272] │ │ │ │ │ testJDK_os.arch=amd64 │ │ │ │ │ testJDK_os.name=Linux │ │ │ │ │ testJDK_os.version=6.12.111+deb13-amd64 │ │ │ │ │ -totalTime=124 │ │ │ │ │ +totalTime=109 │ │ │ │ │ user.name=sbuild │ │ │ │ │ work=/tmp/jdk/JTwork/java/net/MulticastSocket │ │ │ │ │ │ │ │ │ │ #section:script_messages │ │ │ │ │ ----------messages:(7/475)---------- │ │ │ │ │ JDK under test: /build/reproducible-path/openjdk-21-21.0.13~8ea/build/bootcycle-build/images/jdk │ │ │ │ │ openjdk version "21.0.13-ea" 2026-10-20 │ │ │ │ │ @@ -46,29 +46,29 @@ │ │ │ │ │ source directory: /build/reproducible-path/openjdk-21-21.0.13~8ea/test/lib │ │ │ │ │ class directory: /tmp/jdk/JTwork/classes/java/net/MulticastSocket/Promiscuous.d/test/lib │ │ │ │ │ │ │ │ │ │ #section:build │ │ │ │ │ ----------messages:(5/179)---------- │ │ │ │ │ command: build Promiscuous │ │ │ │ │ reason: Named class compiled on demand │ │ │ │ │ -started: Thu Oct 08 20:09:08.598 UTC 2026 │ │ │ │ │ -finished: Thu Oct 08 20:09:08.598 UTC 2026 │ │ │ │ │ +started: Sat Oct 10 00:11:09.176 UTC 2026 │ │ │ │ │ +finished: Sat Oct 10 00:11:09.176 UTC 2026 │ │ │ │ │ elapsed time (seconds): 0.0 │ │ │ │ │ result: Passed. All files up to date │ │ │ │ │ │ │ │ │ │ #section:main │ │ │ │ │ ----------messages:(8/240)---------- │ │ │ │ │ command: main Promiscuous │ │ │ │ │ reason: User specified action: run main Promiscuous │ │ │ │ │ -started: Thu Oct 08 20:09:08.599 UTC 2026 │ │ │ │ │ +started: Sat Oct 10 00:11:09.176 UTC 2026 │ │ │ │ │ Mode: agentvm │ │ │ │ │ Agent id: 1 │ │ │ │ │ -Process id: 3401104 │ │ │ │ │ -finished: Thu Oct 08 20:09:08.717 UTC 2026 │ │ │ │ │ -elapsed time (seconds): 0.118 │ │ │ │ │ +Process id: 1140761 │ │ │ │ │ +finished: Sat Oct 10 00:11:09.282 UTC 2026 │ │ │ │ │ +elapsed time (seconds): 0.106 │ │ │ │ │ ----------configuration:(17/828)---------- │ │ │ │ │ Boot Layer │ │ │ │ │ class path: /usr/share/jtreg/lib/javatest.jar │ │ │ │ │ /usr/share/jtreg/lib/jtreg.jar │ │ │ │ │ /usr/share/jtreg/lib/junit-platform-console-standalone.jar │ │ │ │ │ /usr/share/jtreg/lib/testng.jar │ │ │ │ │ /usr/share/jtreg/lib/guice.jar │ │ │ │ │ @@ -112,16 +112,16 @@ │ │ │ │ │ -Dtest.class.path=/tmp/jdk/JTwork/classes/java/net/MulticastSocket/Promiscuous.d:/tmp/jdk/JTwork/classes/java/net/MulticastSocket/Promiscuous.d/test/lib \\ │ │ │ │ │ -Dtest.class.path.prefix=/tmp/jdk/JTwork/classes/java/net/MulticastSocket/Promiscuous.d:/build/reproducible-path/openjdk-21-21.0.13~8ea/test/jdk/java/net/MulticastSocket:/tmp/jdk/JTwork/classes/java/net/MulticastSocket/Promiscuous.d/test/lib \\ │ │ │ │ │ -classpath /tmp/jdk/JTwork/classes/java/net/MulticastSocket/Promiscuous.d:/build/reproducible-path/openjdk-21-21.0.13~8ea/test/jdk/java/net/MulticastSocket:/tmp/jdk/JTwork/classes/java/net/MulticastSocket/Promiscuous.d/test/lib:/build/reproducible-path/openjdk-21-21.0.13~8ea/test/lib:/usr/share/jtreg/lib/javatest.jar:/usr/share/jtreg/lib/jtreg.jar \\ │ │ │ │ │ Promiscuous │ │ │ │ │ ----------stdout:(0/0)---------- │ │ │ │ │ ----------stderr:(0/0)---------- │ │ │ │ │ ----------System.out:(2/58)---------- │ │ │ │ │ -Using port: 53944 │ │ │ │ │ -Sending datagram to: /224.1.1.120/53944 │ │ │ │ │ +Using port: 53214 │ │ │ │ │ +Sending datagram to: /224.1.1.120/53214 │ │ │ │ │ ----------System.err:(18/1123)---------- │ │ │ │ │ java.net.SocketException: Network is unreachable │ │ │ │ │ at java.base/sun.nio.ch.DatagramChannelImpl.send0(Native Method) │ │ │ │ │ at java.base/sun.nio.ch.DatagramChannelImpl.sendFromNativeBuffer(DatagramChannelImpl.java:1005) │ │ │ │ │ at java.base/sun.nio.ch.DatagramChannelImpl.send(DatagramChannelImpl.java:966) │ │ │ │ │ at java.base/sun.nio.ch.DatagramChannelImpl.send(DatagramChannelImpl.java:889) │ │ │ │ │ at java.base/sun.nio.ch.DatagramChannelImpl.blockingSend(DatagramChannelImpl.java:952) │ │ │ │ ├── jtreg-test-output/jdk/JTwork/java/net/MulticastSocket/SetLoopbackMode.jtr │ │ │ │ │ @@ -1,85 +1,85 @@ │ │ │ │ │ #Test Results (version 2) │ │ │ │ │ -#Thu Oct 08 20:09:08 UTC 2026 │ │ │ │ │ +#Sat Oct 10 00:11:09 UTC 2026 │ │ │ │ │ #-----testdescription----- │ │ │ │ │ $file=/build/reproducible-path/openjdk-21-21.0.13~8ea/test/jdk/java/net/MulticastSocket/SetLoopbackMode.java │ │ │ │ │ $root=/build/reproducible-path/openjdk-21-21.0.13~8ea/test/jdk │ │ │ │ │ keywords=bug4686717 othervm │ │ │ │ │ library=/test/lib │ │ │ │ │ modules=java.base/java.net\:+open │ │ │ │ │ run=USER_SPECIFIED build jdk.test.lib.NetworkConfiguration jdk.test.lib.Platform\nUSER_SPECIFIED main/othervm SetLoopbackMode\n │ │ │ │ │ source=SetLoopbackMode.java │ │ │ │ │ title=Test MulticastSocket.setLoopbackMode │ │ │ │ │ │ │ │ │ │ #-----environment----- │ │ │ │ │ │ │ │ │ │ #-----testresult----- │ │ │ │ │ description=file\:/build/reproducible-path/openjdk-21-21.0.13~8ea/test/jdk/java/net/MulticastSocket/SetLoopbackMode.java │ │ │ │ │ -elapsed=237 0\:00\:00.237 │ │ │ │ │ -end=Thu Oct 08 20\:09\:08 UTC 2026 │ │ │ │ │ +elapsed=162 0\:00\:00.162 │ │ │ │ │ +end=Sat Oct 10 00\:11\:09 UTC 2026 │ │ │ │ │ environment=regtest │ │ │ │ │ execStatus=Failed. Execution failed\: `main' threw exception\: java.net.SocketException\: No such device (setsockopt failed) │ │ │ │ │ harnessLoaderMode=Classpath Loader │ │ │ │ │ harnessVariety=Full Bundle │ │ │ │ │ hostname=sbuild │ │ │ │ │ javatestOS=Linux 6.12.111+deb13-amd64 (amd64) │ │ │ │ │ javatestVersion=6.0-ea+b26-2026-03-18-${BUILT_FROM_COMMIT} │ │ │ │ │ jtregVersion=jtreg 8.3 src 1 │ │ │ │ │ modules=java.base/java.net\:+open │ │ │ │ │ script=com.sun.javatest.regtest.exec.RegressionScript │ │ │ │ │ sections=script_messages build build main │ │ │ │ │ -start=Thu Oct 08 20\:09\:08 UTC 2026 │ │ │ │ │ +start=Sat Oct 10 00\:11\:09 UTC 2026 │ │ │ │ │ test=java/net/MulticastSocket/SetLoopbackMode.java │ │ │ │ │ testJDK=/build/reproducible-path/openjdk-21-21.0.13~8ea/build/bootcycle-build/images/jdk │ │ │ │ │ -testJDK_OS=[name\:Linux,arch\:amd64,version\:6.12.111+deb13-amd64,family\:linux,simple_arch\:x64,simple_version\:6.12,processors\:6,maxMemory\:16775884800,maxSwap\:182536105984] │ │ │ │ │ +testJDK_OS=[name\:Linux,arch\:amd64,version\:6.12.111+deb13-amd64,family\:linux,simple_arch\:x64,simple_version\:6.12,processors\:4,maxMemory\:33662713856,maxSwap\:34359734272] │ │ │ │ │ testJDK_os.arch=amd64 │ │ │ │ │ testJDK_os.name=Linux │ │ │ │ │ testJDK_os.version=6.12.111+deb13-amd64 │ │ │ │ │ -totalTime=239 │ │ │ │ │ +totalTime=164 │ │ │ │ │ user.name=sbuild │ │ │ │ │ work=/tmp/jdk/JTwork/java/net/MulticastSocket │ │ │ │ │ │ │ │ │ │ #section:script_messages │ │ │ │ │ ----------messages:(7/479)---------- │ │ │ │ │ JDK under test: /build/reproducible-path/openjdk-21-21.0.13~8ea/build/bootcycle-build/images/jdk │ │ │ │ │ openjdk version "21.0.13-ea" 2026-10-20 │ │ │ │ │ OpenJDK Runtime Environment (build 21.0.13-ea+8-1-Debian) │ │ │ │ │ OpenJDK 64-Bit Server VM (build 21.0.13-ea+8-1-Debian, mixed mode, sharing) │ │ │ │ │ Library /test/lib; kind: packages │ │ │ │ │ source directory: /build/reproducible-path/openjdk-21-21.0.13~8ea/test/lib │ │ │ │ │ class directory: /tmp/jdk/JTwork/classes/java/net/MulticastSocket/SetLoopbackMode.d/test/lib │ │ │ │ │ │ │ │ │ │ #section:build │ │ │ │ │ -----------messages:(5/282)---------- │ │ │ │ │ +----------messages:(5/284)---------- │ │ │ │ │ command: build jdk.test.lib.NetworkConfiguration jdk.test.lib.Platform │ │ │ │ │ reason: User specified action: run build jdk.test.lib.NetworkConfiguration jdk.test.lib.Platform │ │ │ │ │ -started: Thu Oct 08 20:09:08.726 UTC 2026 │ │ │ │ │ -finished: Thu Oct 08 20:09:08.726 UTC 2026 │ │ │ │ │ -elapsed time (seconds): 0.0 │ │ │ │ │ +started: Sat Oct 10 00:11:09.288 UTC 2026 │ │ │ │ │ +finished: Sat Oct 10 00:11:09.289 UTC 2026 │ │ │ │ │ +elapsed time (seconds): 0.001 │ │ │ │ │ result: Passed. All files up to date │ │ │ │ │ │ │ │ │ │ #section:build │ │ │ │ │ ----------messages:(5/183)---------- │ │ │ │ │ command: build SetLoopbackMode │ │ │ │ │ reason: Named class compiled on demand │ │ │ │ │ -started: Thu Oct 08 20:09:08.727 UTC 2026 │ │ │ │ │ -finished: Thu Oct 08 20:09:08.727 UTC 2026 │ │ │ │ │ +started: Sat Oct 10 00:11:09.289 UTC 2026 │ │ │ │ │ +finished: Sat Oct 10 00:11:09.289 UTC 2026 │ │ │ │ │ elapsed time (seconds): 0.0 │ │ │ │ │ result: Passed. All files up to date │ │ │ │ │ │ │ │ │ │ #section:main │ │ │ │ │ ----------messages:(8/411)---------- │ │ │ │ │ command: main SetLoopbackMode │ │ │ │ │ reason: User specified action: run main/othervm SetLoopbackMode │ │ │ │ │ -started: Thu Oct 08 20:09:08.727 UTC 2026 │ │ │ │ │ +started: Sat Oct 10 00:11:09.289 UTC 2026 │ │ │ │ │ Mode: othervm [/othervm specified] │ │ │ │ │ Additional options from @modules: --add-modules java.base --add-exports java.base/java.net=ALL-UNNAMED --add-opens java.base/java.net=ALL-UNNAMED │ │ │ │ │ -Process id: 3401131 │ │ │ │ │ -finished: Thu Oct 08 20:09:08.959 UTC 2026 │ │ │ │ │ -elapsed time (seconds): 0.232 │ │ │ │ │ +Process id: 1140788 │ │ │ │ │ +finished: Sat Oct 10 00:11:09.448 UTC 2026 │ │ │ │ │ +elapsed time (seconds): 0.159 │ │ │ │ │ ----------configuration:(5/139)---------- │ │ │ │ │ Boot Layer │ │ │ │ │ add modules: java.base │ │ │ │ │ add exports: java.base/java.net ALL-UNNAMED │ │ │ │ │ add opens: java.base/java.net ALL-UNNAMED │ │ │ │ │ │ │ │ │ │ ----------System.out:(5/155)---------- │ │ │ │ ├── jtreg-test-output/jdk/JTwork/java/net/MulticastSocket/SetLoopbackModeIPv4.jtr │ │ │ │ │ @@ -1,44 +1,44 @@ │ │ │ │ │ #Test Results (version 2) │ │ │ │ │ -#Thu Oct 08 20:09:09 UTC 2026 │ │ │ │ │ +#Sat Oct 10 00:11:09 UTC 2026 │ │ │ │ │ #-----testdescription----- │ │ │ │ │ $file=/build/reproducible-path/openjdk-21-21.0.13~8ea/test/jdk/java/net/MulticastSocket/SetLoopbackModeIPv4.java │ │ │ │ │ $root=/build/reproducible-path/openjdk-21-21.0.13~8ea/test/jdk │ │ │ │ │ keywords=bug4686717 bug8241786 othervm │ │ │ │ │ library=/test/lib │ │ │ │ │ modules=java.base/java.net\:+open │ │ │ │ │ run=USER_SPECIFIED build jdk.test.lib.NetworkConfiguration jdk.test.lib.Platform SetLoopbackMode SetLoopbackModeIPv4\nUSER_SPECIFIED main/othervm -Djava.net.preferIPv4Stack\=true SetLoopbackModeIPv4\n │ │ │ │ │ source=SetLoopbackModeIPv4.java │ │ │ │ │ title=Test MulticastSocket.setLoopbackMode with IPv4 addresses │ │ │ │ │ │ │ │ │ │ #-----environment----- │ │ │ │ │ │ │ │ │ │ #-----testresult----- │ │ │ │ │ description=file\:/build/reproducible-path/openjdk-21-21.0.13~8ea/test/jdk/java/net/MulticastSocket/SetLoopbackModeIPv4.java │ │ │ │ │ -elapsed=261 0\:00\:00.261 │ │ │ │ │ -end=Thu Oct 08 20\:09\:09 UTC 2026 │ │ │ │ │ +elapsed=182 0\:00\:00.182 │ │ │ │ │ +end=Sat Oct 10 00\:11\:09 UTC 2026 │ │ │ │ │ environment=regtest │ │ │ │ │ execStatus=Failed. Execution failed\: `main' threw exception\: java.net.SocketException\: No such device (setsockopt failed) │ │ │ │ │ harnessLoaderMode=Classpath Loader │ │ │ │ │ harnessVariety=Full Bundle │ │ │ │ │ hostname=sbuild │ │ │ │ │ javatestOS=Linux 6.12.111+deb13-amd64 (amd64) │ │ │ │ │ javatestVersion=6.0-ea+b26-2026-03-18-${BUILT_FROM_COMMIT} │ │ │ │ │ jtregVersion=jtreg 8.3 src 1 │ │ │ │ │ modules=java.base/java.net\:+open │ │ │ │ │ script=com.sun.javatest.regtest.exec.RegressionScript │ │ │ │ │ sections=script_messages build build main │ │ │ │ │ -start=Thu Oct 08 20\:09\:08 UTC 2026 │ │ │ │ │ +start=Sat Oct 10 00\:11\:09 UTC 2026 │ │ │ │ │ test=java/net/MulticastSocket/SetLoopbackModeIPv4.java │ │ │ │ │ testJDK=/build/reproducible-path/openjdk-21-21.0.13~8ea/build/bootcycle-build/images/jdk │ │ │ │ │ -testJDK_OS=[name\:Linux,arch\:amd64,version\:6.12.111+deb13-amd64,family\:linux,simple_arch\:x64,simple_version\:6.12,processors\:6,maxMemory\:16775884800,maxSwap\:182536105984] │ │ │ │ │ +testJDK_OS=[name\:Linux,arch\:amd64,version\:6.12.111+deb13-amd64,family\:linux,simple_arch\:x64,simple_version\:6.12,processors\:4,maxMemory\:33662713856,maxSwap\:34359734272] │ │ │ │ │ testJDK_os.arch=amd64 │ │ │ │ │ testJDK_os.name=Linux │ │ │ │ │ testJDK_os.version=6.12.111+deb13-amd64 │ │ │ │ │ -totalTime=263 │ │ │ │ │ +totalTime=183 │ │ │ │ │ user.name=sbuild │ │ │ │ │ work=/tmp/jdk/JTwork/java/net/MulticastSocket │ │ │ │ │ │ │ │ │ │ #section:script_messages │ │ │ │ │ ----------messages:(7/483)---------- │ │ │ │ │ JDK under test: /build/reproducible-path/openjdk-21-21.0.13~8ea/build/bootcycle-build/images/jdk │ │ │ │ │ openjdk version "21.0.13-ea" 2026-10-20 │ │ │ │ │ @@ -48,38 +48,38 @@ │ │ │ │ │ source directory: /build/reproducible-path/openjdk-21-21.0.13~8ea/test/lib │ │ │ │ │ class directory: /tmp/jdk/JTwork/classes/java/net/MulticastSocket/SetLoopbackModeIPv4.d/test/lib │ │ │ │ │ │ │ │ │ │ #section:build │ │ │ │ │ ----------messages:(5/356)---------- │ │ │ │ │ command: build jdk.test.lib.NetworkConfiguration jdk.test.lib.Platform SetLoopbackMode SetLoopbackModeIPv4 │ │ │ │ │ reason: User specified action: run build jdk.test.lib.NetworkConfiguration jdk.test.lib.Platform SetLoopbackMode SetLoopbackModeIPv4 │ │ │ │ │ -started: Thu Oct 08 20:09:08.967 UTC 2026 │ │ │ │ │ -finished: Thu Oct 08 20:09:08.968 UTC 2026 │ │ │ │ │ +started: Sat Oct 10 00:11:09.453 UTC 2026 │ │ │ │ │ +finished: Sat Oct 10 00:11:09.454 UTC 2026 │ │ │ │ │ elapsed time (seconds): 0.001 │ │ │ │ │ result: Passed. All files up to date │ │ │ │ │ │ │ │ │ │ #section:build │ │ │ │ │ -----------messages:(5/189)---------- │ │ │ │ │ +----------messages:(5/187)---------- │ │ │ │ │ command: build SetLoopbackModeIPv4 │ │ │ │ │ reason: Named class compiled on demand │ │ │ │ │ -started: Thu Oct 08 20:09:08.968 UTC 2026 │ │ │ │ │ -finished: Thu Oct 08 20:09:08.969 UTC 2026 │ │ │ │ │ -elapsed time (seconds): 0.001 │ │ │ │ │ +started: Sat Oct 10 00:11:09.454 UTC 2026 │ │ │ │ │ +finished: Sat Oct 10 00:11:09.454 UTC 2026 │ │ │ │ │ +elapsed time (seconds): 0.0 │ │ │ │ │ result: Passed. All files up to date │ │ │ │ │ │ │ │ │ │ #section:main │ │ │ │ │ ----------messages:(8/483)---------- │ │ │ │ │ command: main -Djava.net.preferIPv4Stack=true SetLoopbackModeIPv4 │ │ │ │ │ reason: User specified action: run main/othervm -Djava.net.preferIPv4Stack=true SetLoopbackModeIPv4 │ │ │ │ │ -started: Thu Oct 08 20:09:08.969 UTC 2026 │ │ │ │ │ +started: Sat Oct 10 00:11:09.454 UTC 2026 │ │ │ │ │ Mode: othervm [/othervm specified] │ │ │ │ │ Additional options from @modules: --add-modules java.base --add-exports java.base/java.net=ALL-UNNAMED --add-opens java.base/java.net=ALL-UNNAMED │ │ │ │ │ -Process id: 3401153 │ │ │ │ │ -finished: Thu Oct 08 20:09:09.226 UTC 2026 │ │ │ │ │ -elapsed time (seconds): 0.257 │ │ │ │ │ +Process id: 1140810 │ │ │ │ │ +finished: Sat Oct 10 00:11:09.633 UTC 2026 │ │ │ │ │ +elapsed time (seconds): 0.179 │ │ │ │ │ ----------configuration:(5/139)---------- │ │ │ │ │ Boot Layer │ │ │ │ │ add modules: java.base │ │ │ │ │ add exports: java.base/java.net ALL-UNNAMED │ │ │ │ │ add opens: java.base/java.net ALL-UNNAMED │ │ │ │ │ │ │ │ │ │ ----------System.out:(5/155)---------- │ │ │ │ ├── jtreg-test-output/jdk/JTwork/java/net/MulticastSocket/Test.jtr │ │ │ │ │ @@ -1,83 +1,83 @@ │ │ │ │ │ #Test Results (version 2) │ │ │ │ │ -#Thu Oct 08 20:09:09 UTC 2026 │ │ │ │ │ +#Sat Oct 10 00:11:09 UTC 2026 │ │ │ │ │ #-----testdescription----- │ │ │ │ │ $file=/build/reproducible-path/openjdk-21-21.0.13~8ea/test/jdk/java/net/MulticastSocket/Test.java │ │ │ │ │ $root=/build/reproducible-path/openjdk-21-21.0.13~8ea/test/jdk │ │ │ │ │ keywords=bug4488458 othervm │ │ │ │ │ library=/test/lib │ │ │ │ │ run=USER_SPECIFIED build jdk.test.lib.NetworkConfiguration jdk.test.lib.Platform\nUSER_SPECIFIED main Test\nUSER_SPECIFIED main/othervm -Djava.net.preferIPv4Stack\=true Test\n │ │ │ │ │ source=Test.java │ │ │ │ │ title=IPv4 and IPv6 multicasting broken on Linux │ │ │ │ │ │ │ │ │ │ #-----environment----- │ │ │ │ │ │ │ │ │ │ #-----testresult----- │ │ │ │ │ description=file\:/build/reproducible-path/openjdk-21-21.0.13~8ea/test/jdk/java/net/MulticastSocket/Test.java │ │ │ │ │ -elapsed=86 0\:00\:00.086 │ │ │ │ │ -end=Thu Oct 08 20\:09\:09 UTC 2026 │ │ │ │ │ +elapsed=91 0\:00\:00.091 │ │ │ │ │ +end=Sat Oct 10 00\:11\:09 UTC 2026 │ │ │ │ │ environment=regtest │ │ │ │ │ execStatus=Failed. Execution failed\: `main' threw exception\: java.lang.Exception\: Test failed - see log file for details │ │ │ │ │ harnessLoaderMode=Classpath Loader │ │ │ │ │ harnessVariety=Full Bundle │ │ │ │ │ hostname=sbuild │ │ │ │ │ javatestOS=Linux 6.12.111+deb13-amd64 (amd64) │ │ │ │ │ javatestVersion=6.0-ea+b26-2026-03-18-${BUILT_FROM_COMMIT} │ │ │ │ │ jtregVersion=jtreg 8.3 src 1 │ │ │ │ │ script=com.sun.javatest.regtest.exec.RegressionScript │ │ │ │ │ sections=script_messages build build main │ │ │ │ │ -start=Thu Oct 08 20\:09\:09 UTC 2026 │ │ │ │ │ +start=Sat Oct 10 00\:11\:09 UTC 2026 │ │ │ │ │ test=java/net/MulticastSocket/Test.java │ │ │ │ │ testJDK=/build/reproducible-path/openjdk-21-21.0.13~8ea/build/bootcycle-build/images/jdk │ │ │ │ │ -testJDK_OS=[name\:Linux,arch\:amd64,version\:6.12.111+deb13-amd64,family\:linux,simple_arch\:x64,simple_version\:6.12,processors\:6,maxMemory\:16775884800,maxSwap\:182536105984] │ │ │ │ │ +testJDK_OS=[name\:Linux,arch\:amd64,version\:6.12.111+deb13-amd64,family\:linux,simple_arch\:x64,simple_version\:6.12,processors\:4,maxMemory\:33662713856,maxSwap\:34359734272] │ │ │ │ │ testJDK_os.arch=amd64 │ │ │ │ │ testJDK_os.name=Linux │ │ │ │ │ testJDK_os.version=6.12.111+deb13-amd64 │ │ │ │ │ -totalTime=87 │ │ │ │ │ +totalTime=93 │ │ │ │ │ user.name=sbuild │ │ │ │ │ work=/tmp/jdk/JTwork/java/net/MulticastSocket │ │ │ │ │ │ │ │ │ │ #section:script_messages │ │ │ │ │ ----------messages:(7/468)---------- │ │ │ │ │ JDK under test: /build/reproducible-path/openjdk-21-21.0.13~8ea/build/bootcycle-build/images/jdk │ │ │ │ │ openjdk version "21.0.13-ea" 2026-10-20 │ │ │ │ │ OpenJDK Runtime Environment (build 21.0.13-ea+8-1-Debian) │ │ │ │ │ OpenJDK 64-Bit Server VM (build 21.0.13-ea+8-1-Debian, mixed mode, sharing) │ │ │ │ │ Library /test/lib; kind: packages │ │ │ │ │ source directory: /build/reproducible-path/openjdk-21-21.0.13~8ea/test/lib │ │ │ │ │ class directory: /tmp/jdk/JTwork/classes/java/net/MulticastSocket/Test.d/test/lib │ │ │ │ │ │ │ │ │ │ #section:build │ │ │ │ │ -----------messages:(5/282)---------- │ │ │ │ │ +----------messages:(5/284)---------- │ │ │ │ │ command: build jdk.test.lib.NetworkConfiguration jdk.test.lib.Platform │ │ │ │ │ reason: User specified action: run build jdk.test.lib.NetworkConfiguration jdk.test.lib.Platform │ │ │ │ │ -started: Thu Oct 08 20:09:09.234 UTC 2026 │ │ │ │ │ -finished: Thu Oct 08 20:09:09.234 UTC 2026 │ │ │ │ │ -elapsed time (seconds): 0.0 │ │ │ │ │ +started: Sat Oct 10 00:11:09.642 UTC 2026 │ │ │ │ │ +finished: Sat Oct 10 00:11:09.643 UTC 2026 │ │ │ │ │ +elapsed time (seconds): 0.001 │ │ │ │ │ result: Passed. All files up to date │ │ │ │ │ │ │ │ │ │ #section:build │ │ │ │ │ -----------messages:(5/174)---------- │ │ │ │ │ +----------messages:(5/172)---------- │ │ │ │ │ command: build Test │ │ │ │ │ reason: Named class compiled on demand │ │ │ │ │ -started: Thu Oct 08 20:09:09.234 UTC 2026 │ │ │ │ │ -finished: Thu Oct 08 20:09:09.235 UTC 2026 │ │ │ │ │ -elapsed time (seconds): 0.001 │ │ │ │ │ +started: Sat Oct 10 00:11:09.643 UTC 2026 │ │ │ │ │ +finished: Sat Oct 10 00:11:09.643 UTC 2026 │ │ │ │ │ +elapsed time (seconds): 0.0 │ │ │ │ │ result: Passed. All files up to date │ │ │ │ │ │ │ │ │ │ #section:main │ │ │ │ │ ----------messages:(8/226)---------- │ │ │ │ │ command: main Test │ │ │ │ │ reason: User specified action: run main Test │ │ │ │ │ -started: Thu Oct 08 20:09:09.235 UTC 2026 │ │ │ │ │ +started: Sat Oct 10 00:11:09.643 UTC 2026 │ │ │ │ │ Mode: agentvm │ │ │ │ │ Agent id: 1 │ │ │ │ │ -Process id: 3401104 │ │ │ │ │ -finished: Thu Oct 08 20:09:09.316 UTC 2026 │ │ │ │ │ -elapsed time (seconds): 0.081 │ │ │ │ │ +Process id: 1140761 │ │ │ │ │ +finished: Sat Oct 10 00:11:09.730 UTC 2026 │ │ │ │ │ +elapsed time (seconds): 0.087 │ │ │ │ │ ----------configuration:(17/814)---------- │ │ │ │ │ Boot Layer │ │ │ │ │ class path: /usr/share/jtreg/lib/javatest.jar │ │ │ │ │ /usr/share/jtreg/lib/jtreg.jar │ │ │ │ │ /usr/share/jtreg/lib/junit-platform-console-standalone.jar │ │ │ │ │ /usr/share/jtreg/lib/testng.jar │ │ │ │ │ /usr/share/jtreg/lib/guice.jar │ │ │ │ ├── jtreg-test-output/jdk/JTwork/java/net/SocketOption/OptionsTest.jtr │ │ │ │ │ @@ -1,74 +1,74 @@ │ │ │ │ │ #Test Results (version 2) │ │ │ │ │ -#Thu Oct 08 20:09:09 UTC 2026 │ │ │ │ │ +#Sat Oct 10 00:11:09 UTC 2026 │ │ │ │ │ #-----testdescription----- │ │ │ │ │ $file=/build/reproducible-path/openjdk-21-21.0.13~8ea/test/jdk/java/net/SocketOption/OptionsTest.java │ │ │ │ │ $root=/build/reproducible-path/openjdk-21-21.0.13~8ea/test/jdk │ │ │ │ │ keywords=bug8036979 bug8072384 bug8044773 bug8225214 bug8233296 bug8234083 othervm │ │ │ │ │ library=/test/lib │ │ │ │ │ requires=\!vm.graal.enabled │ │ │ │ │ run=USER_SPECIFIED main/othervm -Xcheck\:jni OptionsTest\nUSER_SPECIFIED main/othervm -Xcheck\:jni -Djava.net.preferIPv4Stack\=true OptionsTest\nUSER_SPECIFIED main/othervm --limit-modules\=java.base OptionsTest\nUSER_SPECIFIED main/othervm/policy\=options.policy OptionsTest\n │ │ │ │ │ source=OptionsTest.java │ │ │ │ │ title=\ │ │ │ │ │ │ │ │ │ │ #-----environment----- │ │ │ │ │ │ │ │ │ │ #-----testresult----- │ │ │ │ │ description=file\:/build/reproducible-path/openjdk-21-21.0.13~8ea/test/jdk/java/net/SocketOption/OptionsTest.java │ │ │ │ │ -elapsed=247 0\:00\:00.247 │ │ │ │ │ -end=Thu Oct 08 20\:09\:09 UTC 2026 │ │ │ │ │ +elapsed=180 0\:00\:00.180 │ │ │ │ │ +end=Sat Oct 10 00\:11\:09 UTC 2026 │ │ │ │ │ environment=regtest │ │ │ │ │ execStatus=Failed. Execution failed\: `main' threw exception\: java.lang.IllegalArgumentException\: Invalid value 'null' │ │ │ │ │ harnessLoaderMode=Classpath Loader │ │ │ │ │ harnessVariety=Full Bundle │ │ │ │ │ hostname=sbuild │ │ │ │ │ javatestOS=Linux 6.12.111+deb13-amd64 (amd64) │ │ │ │ │ javatestVersion=6.0-ea+b26-2026-03-18-${BUILT_FROM_COMMIT} │ │ │ │ │ jtregVersion=jtreg 8.3 src 1 │ │ │ │ │ script=com.sun.javatest.regtest.exec.RegressionScript │ │ │ │ │ sections=script_messages build main │ │ │ │ │ -start=Thu Oct 08 20\:09\:09 UTC 2026 │ │ │ │ │ +start=Sat Oct 10 00\:11\:09 UTC 2026 │ │ │ │ │ test=java/net/SocketOption/OptionsTest.java │ │ │ │ │ testJDK=/build/reproducible-path/openjdk-21-21.0.13~8ea/build/bootcycle-build/images/jdk │ │ │ │ │ -testJDK_OS=[name\:Linux,arch\:amd64,version\:6.12.111+deb13-amd64,family\:linux,simple_arch\:x64,simple_version\:6.12,processors\:6,maxMemory\:16775884800,maxSwap\:182536105984] │ │ │ │ │ +testJDK_OS=[name\:Linux,arch\:amd64,version\:6.12.111+deb13-amd64,family\:linux,simple_arch\:x64,simple_version\:6.12,processors\:4,maxMemory\:33662713856,maxSwap\:34359734272] │ │ │ │ │ testJDK_os.arch=amd64 │ │ │ │ │ testJDK_os.name=Linux │ │ │ │ │ testJDK_os.version=6.12.111+deb13-amd64 │ │ │ │ │ -totalTime=249 │ │ │ │ │ +totalTime=182 │ │ │ │ │ user.name=sbuild │ │ │ │ │ work=/tmp/jdk/JTwork/java/net/SocketOption │ │ │ │ │ │ │ │ │ │ #section:script_messages │ │ │ │ │ ----------messages:(7/472)---------- │ │ │ │ │ JDK under test: /build/reproducible-path/openjdk-21-21.0.13~8ea/build/bootcycle-build/images/jdk │ │ │ │ │ openjdk version "21.0.13-ea" 2026-10-20 │ │ │ │ │ OpenJDK Runtime Environment (build 21.0.13-ea+8-1-Debian) │ │ │ │ │ OpenJDK 64-Bit Server VM (build 21.0.13-ea+8-1-Debian, mixed mode, sharing) │ │ │ │ │ Library /test/lib; kind: packages │ │ │ │ │ source directory: /build/reproducible-path/openjdk-21-21.0.13~8ea/test/lib │ │ │ │ │ class directory: /tmp/jdk/JTwork/classes/java/net/SocketOption/OptionsTest.d/test/lib │ │ │ │ │ │ │ │ │ │ #section:build │ │ │ │ │ -----------messages:(5/179)---------- │ │ │ │ │ +----------messages:(5/181)---------- │ │ │ │ │ command: build OptionsTest │ │ │ │ │ reason: Named class compiled on demand │ │ │ │ │ -started: Thu Oct 08 20:09:09.325 UTC 2026 │ │ │ │ │ -finished: Thu Oct 08 20:09:09.325 UTC 2026 │ │ │ │ │ -elapsed time (seconds): 0.0 │ │ │ │ │ +started: Sat Oct 10 00:11:09.735 UTC 2026 │ │ │ │ │ +finished: Sat Oct 10 00:11:09.736 UTC 2026 │ │ │ │ │ +elapsed time (seconds): 0.001 │ │ │ │ │ result: Passed. All files up to date │ │ │ │ │ │ │ │ │ │ #section:main │ │ │ │ │ ----------messages:(7/281)---------- │ │ │ │ │ command: main -Xcheck:jni OptionsTest │ │ │ │ │ reason: User specified action: run main/othervm -Xcheck:jni OptionsTest │ │ │ │ │ -started: Thu Oct 08 20:09:09.325 UTC 2026 │ │ │ │ │ +started: Sat Oct 10 00:11:09.736 UTC 2026 │ │ │ │ │ Mode: othervm [/othervm specified] │ │ │ │ │ -Process id: 3401175 │ │ │ │ │ -finished: Thu Oct 08 20:09:09.569 UTC 2026 │ │ │ │ │ -elapsed time (seconds): 0.244 │ │ │ │ │ +Process id: 1140833 │ │ │ │ │ +finished: Sat Oct 10 00:11:09.914 UTC 2026 │ │ │ │ │ +elapsed time (seconds): 0.178 │ │ │ │ │ ----------configuration:(0/0)---------- │ │ │ │ │ ----------System.out:(7/201)---------- │ │ │ │ │ Testing SO_LINGER with:-1 │ │ │ │ │ Testing SO_LINGER with:-2 │ │ │ │ │ Testing SO_LINGER with:-100 │ │ │ │ │ Testing SO_LINGER with:-65534 │ │ │ │ │ Testing SO_LINGER with:-65535 │ │ │ │ ├── jtreg-test-output/jdk/JTwork/java/net/SocketPermission/SocketPermissionTest.jtr │ │ │ │ │ @@ -1,92 +1,92 @@ │ │ │ │ │ #Test Results (version 2) │ │ │ │ │ -#Thu Oct 08 20:09:10 UTC 2026 │ │ │ │ │ +#Sat Oct 10 00:11:11 UTC 2026 │ │ │ │ │ #-----testdescription----- │ │ │ │ │ $file=/build/reproducible-path/openjdk-21-21.0.13~8ea/test/jdk/java/net/SocketPermission/SocketPermissionTest.java │ │ │ │ │ $root=/build/reproducible-path/openjdk-21-21.0.13~8ea/test/jdk │ │ │ │ │ keywords=bug8047031 intermittent othervm testng │ │ │ │ │ library=/test/lib │ │ │ │ │ run=USER_SPECIFIED build jdk.test.lib.NetworkConfiguration jdk.test.lib.Platform\nUSER_SPECIFIED testng/othervm -Djava.security.manager\=allow SocketPermissionTest\n │ │ │ │ │ source=SocketPermissionTest.java │ │ │ │ │ title=SocketPermission tests for legacy socket types. │ │ │ │ │ │ │ │ │ │ #-----environment----- │ │ │ │ │ │ │ │ │ │ #-----testresult----- │ │ │ │ │ description=file\:/build/reproducible-path/openjdk-21-21.0.13~8ea/test/jdk/java/net/SocketPermission/SocketPermissionTest.java │ │ │ │ │ -elapsed=748 0\:00\:00.748 │ │ │ │ │ -end=Thu Oct 08 20\:09\:10 UTC 2026 │ │ │ │ │ +elapsed=464 0\:00\:00.464 │ │ │ │ │ +end=Sat Oct 10 00\:11\:11 UTC 2026 │ │ │ │ │ environment=regtest │ │ │ │ │ execStatus=Failed. Execution failed\: `main' threw exception\: java.lang.Exception\: config failures\: 0, test failures\: 2 │ │ │ │ │ harnessLoaderMode=Classpath Loader │ │ │ │ │ harnessVariety=Full Bundle │ │ │ │ │ hostname=sbuild │ │ │ │ │ javatestOS=Linux 6.12.111+deb13-amd64 (amd64) │ │ │ │ │ javatestVersion=6.0-ea+b26-2026-03-18-${BUILT_FROM_COMMIT} │ │ │ │ │ jtregVersion=jtreg 8.3 src 1 │ │ │ │ │ script=com.sun.javatest.regtest.exec.RegressionScript │ │ │ │ │ sections=script_messages build build testng │ │ │ │ │ -start=Thu Oct 08 20\:09\:09 UTC 2026 │ │ │ │ │ +start=Sat Oct 10 00\:11\:10 UTC 2026 │ │ │ │ │ test=java/net/SocketPermission/SocketPermissionTest.java │ │ │ │ │ testJDK=/build/reproducible-path/openjdk-21-21.0.13~8ea/build/bootcycle-build/images/jdk │ │ │ │ │ -testJDK_OS=[name\:Linux,arch\:amd64,version\:6.12.111+deb13-amd64,family\:linux,simple_arch\:x64,simple_version\:6.12,processors\:6,maxMemory\:16775884800,maxSwap\:182536105984] │ │ │ │ │ +testJDK_OS=[name\:Linux,arch\:amd64,version\:6.12.111+deb13-amd64,family\:linux,simple_arch\:x64,simple_version\:6.12,processors\:4,maxMemory\:33662713856,maxSwap\:34359734272] │ │ │ │ │ testJDK_os.arch=amd64 │ │ │ │ │ testJDK_os.name=Linux │ │ │ │ │ testJDK_os.version=6.12.111+deb13-amd64 │ │ │ │ │ -totalTime=749 │ │ │ │ │ +totalTime=465 │ │ │ │ │ user.name=sbuild │ │ │ │ │ work=/tmp/jdk/JTwork/java/net/SocketPermission │ │ │ │ │ │ │ │ │ │ #section:script_messages │ │ │ │ │ ----------messages:(7/485)---------- │ │ │ │ │ JDK under test: /build/reproducible-path/openjdk-21-21.0.13~8ea/build/bootcycle-build/images/jdk │ │ │ │ │ openjdk version "21.0.13-ea" 2026-10-20 │ │ │ │ │ OpenJDK Runtime Environment (build 21.0.13-ea+8-1-Debian) │ │ │ │ │ OpenJDK 64-Bit Server VM (build 21.0.13-ea+8-1-Debian, mixed mode, sharing) │ │ │ │ │ Library /test/lib; kind: packages │ │ │ │ │ source directory: /build/reproducible-path/openjdk-21-21.0.13~8ea/test/lib │ │ │ │ │ class directory: /tmp/jdk/JTwork/classes/java/net/SocketPermission/SocketPermissionTest.d/test/lib │ │ │ │ │ │ │ │ │ │ #section:build │ │ │ │ │ -----------messages:(5/284)---------- │ │ │ │ │ +----------messages:(5/282)---------- │ │ │ │ │ command: build jdk.test.lib.NetworkConfiguration jdk.test.lib.Platform │ │ │ │ │ reason: User specified action: run build jdk.test.lib.NetworkConfiguration jdk.test.lib.Platform │ │ │ │ │ -started: Thu Oct 08 20:09:09.623 UTC 2026 │ │ │ │ │ -finished: Thu Oct 08 20:09:09.624 UTC 2026 │ │ │ │ │ -elapsed time (seconds): 0.001 │ │ │ │ │ +started: Sat Oct 10 00:11:10.867 UTC 2026 │ │ │ │ │ +finished: Sat Oct 10 00:11:10.867 UTC 2026 │ │ │ │ │ +elapsed time (seconds): 0.0 │ │ │ │ │ result: Passed. All files up to date │ │ │ │ │ │ │ │ │ │ #section:build │ │ │ │ │ ----------messages:(5/188)---------- │ │ │ │ │ command: build SocketPermissionTest │ │ │ │ │ reason: Named class compiled on demand │ │ │ │ │ -started: Thu Oct 08 20:09:09.624 UTC 2026 │ │ │ │ │ -finished: Thu Oct 08 20:09:09.624 UTC 2026 │ │ │ │ │ +started: Sat Oct 10 00:11:10.868 UTC 2026 │ │ │ │ │ +finished: Sat Oct 10 00:11:10.868 UTC 2026 │ │ │ │ │ elapsed time (seconds): 0.0 │ │ │ │ │ result: Passed. All files up to date │ │ │ │ │ │ │ │ │ │ #section:testng │ │ │ │ │ ----------messages:(7/339)---------- │ │ │ │ │ command: testng -Djava.security.manager=allow SocketPermissionTest │ │ │ │ │ reason: User specified action: run testng/othervm -Djava.security.manager=allow SocketPermissionTest │ │ │ │ │ -started: Thu Oct 08 20:09:09.624 UTC 2026 │ │ │ │ │ +started: Sat Oct 10 00:11:10.868 UTC 2026 │ │ │ │ │ Mode: othervm [/othervm specified] │ │ │ │ │ -Process id: 3401196 │ │ │ │ │ -finished: Thu Oct 08 20:09:10.361 UTC 2026 │ │ │ │ │ -elapsed time (seconds): 0.737 │ │ │ │ │ +Process id: 1140854 │ │ │ │ │ +finished: Sat Oct 10 00:11:11.325 UTC 2026 │ │ │ │ │ +elapsed time (seconds): 0.457 │ │ │ │ │ ----------configuration:(0/0)---------- │ │ │ │ │ -----------System.out:(97/6918)---------- │ │ │ │ │ -[20:09:10.161] config SocketPermissionTest.setupSecurityManager(): success [0ms] │ │ │ │ │ -[20:09:10.198] test SocketPermissionTest.acceptServerSocketTest(): success [29ms] │ │ │ │ │ -[20:09:10.200] config SocketPermissionTest.setupSecurityManager(): success [0ms] │ │ │ │ │ -[20:09:10.216] test SocketPermissionTest.connectDatagramSocketTest(): success [15ms] │ │ │ │ │ -[20:09:10.217] config SocketPermissionTest.setupSecurityManager(): success [0ms] │ │ │ │ │ -[20:09:10.220] test SocketPermissionTest.connectSocketTest(): success [2ms] │ │ │ │ │ -[20:09:10.221] config SocketPermissionTest.setupSecurityManager(): success [0ms] │ │ │ │ │ -[20:09:10.231] test SocketPermissionTest.joinGroupMulticastTest(): failure [10ms] │ │ │ │ │ +----------System.out:(97/6917)---------- │ │ │ │ │ +[00:11:11.189] config SocketPermissionTest.setupSecurityManager(): success [0ms] │ │ │ │ │ +[00:11:11.214] test SocketPermissionTest.acceptServerSocketTest(): success [20ms] │ │ │ │ │ +[00:11:11.215] config SocketPermissionTest.setupSecurityManager(): success [0ms] │ │ │ │ │ +[00:11:11.227] test SocketPermissionTest.connectDatagramSocketTest(): success [11ms] │ │ │ │ │ +[00:11:11.228] config SocketPermissionTest.setupSecurityManager(): success [0ms] │ │ │ │ │ +[00:11:11.230] test SocketPermissionTest.connectSocketTest(): success [1ms] │ │ │ │ │ +[00:11:11.231] config SocketPermissionTest.setupSecurityManager(): success [0ms] │ │ │ │ │ +[00:11:11.237] test SocketPermissionTest.joinGroupMulticastTest(): failure [7ms] │ │ │ │ │ java.util.NoSuchElementException: No value present │ │ │ │ │ at java.base/java.util.Optional.get(Optional.java:143) │ │ │ │ │ at SocketPermissionTest.joinGroupMulticastTest(SocketPermissionTest.java:227) │ │ │ │ │ at java.base/jdk.internal.reflect.DirectMethodHandleAccessor.invoke(DirectMethodHandleAccessor.java:103) │ │ │ │ │ at java.base/java.lang.reflect.Method.invoke(Method.java:580) │ │ │ │ │ at org.testng.internal.invokers.MethodInvocationHelper.invokeMethod(MethodInvocationHelper.java:136) │ │ │ │ │ at org.testng.internal.invokers.TestInvoker.invokeMethod(TestInvoker.java:658) │ │ │ │ │ @@ -111,22 +111,22 @@ │ │ │ │ │ at org.testng.TestNG.run(TestNG.java:1060) │ │ │ │ │ at com.sun.javatest.regtest.agent.TestNGRunner.main(TestNGRunner.java:109) │ │ │ │ │ at com.sun.javatest.regtest.agent.TestNGRunner.main(TestNGRunner.java:65) │ │ │ │ │ at java.base/jdk.internal.reflect.DirectMethodHandleAccessor.invoke(DirectMethodHandleAccessor.java:103) │ │ │ │ │ at java.base/java.lang.reflect.Method.invoke(Method.java:580) │ │ │ │ │ at com.sun.javatest.regtest.agent.MainWrapper$MainTask.run(MainWrapper.java:143) │ │ │ │ │ at java.base/java.lang.Thread.run(Thread.java:1583) │ │ │ │ │ -[20:09:10.234] config SocketPermissionTest.setupSecurityManager(): success [0ms] │ │ │ │ │ -[20:09:10.236] test SocketPermissionTest.listenDatagramSocketTest(): success [2ms] │ │ │ │ │ -[20:09:10.237] config SocketPermissionTest.setupSecurityManager(): success [0ms] │ │ │ │ │ -[20:09:10.239] test SocketPermissionTest.listenMulticastSocketTest(): success [1ms] │ │ │ │ │ -[20:09:10.240] config SocketPermissionTest.setupSecurityManager(): success [0ms] │ │ │ │ │ -[20:09:10.242] test SocketPermissionTest.listenServerSocketTest(): success [1ms] │ │ │ │ │ -[20:09:10.243] config SocketPermissionTest.setupSecurityManager(): success [0ms] │ │ │ │ │ -[20:09:10.244] test SocketPermissionTest.sendDatagramPacketTest(): failure [2ms] │ │ │ │ │ +[00:11:11.240] config SocketPermissionTest.setupSecurityManager(): success [0ms] │ │ │ │ │ +[00:11:11.241] test SocketPermissionTest.listenDatagramSocketTest(): success [1ms] │ │ │ │ │ +[00:11:11.242] config SocketPermissionTest.setupSecurityManager(): success [0ms] │ │ │ │ │ +[00:11:11.243] test SocketPermissionTest.listenMulticastSocketTest(): success [1ms] │ │ │ │ │ +[00:11:11.244] config SocketPermissionTest.setupSecurityManager(): success [0ms] │ │ │ │ │ +[00:11:11.245] test SocketPermissionTest.listenServerSocketTest(): success [0ms] │ │ │ │ │ +[00:11:11.246] config SocketPermissionTest.setupSecurityManager(): success [0ms] │ │ │ │ │ +[00:11:11.247] test SocketPermissionTest.sendDatagramPacketTest(): failure [1ms] │ │ │ │ │ java.security.PrivilegedActionException: java.net.SocketException: Network is unreachable │ │ │ │ │ at java.base/java.security.AccessController.doPrivileged(AccessController.java:718) │ │ │ │ │ at SocketPermissionTest.sendDatagramPacketTest(SocketPermissionTest.java:195) │ │ │ │ │ at java.base/jdk.internal.reflect.DirectMethodHandleAccessor.invoke(DirectMethodHandleAccessor.java:103) │ │ │ │ │ at java.base/java.lang.reflect.Method.invoke(Method.java:580) │ │ │ │ │ at org.testng.internal.invokers.MethodInvocationHelper.invokeMethod(MethodInvocationHelper.java:136) │ │ │ │ │ at org.testng.internal.invokers.TestInvoker.invokeMethod(TestInvoker.java:658) │ │ │ │ ├── jtreg-test-output/jdk/JTwork/sun/security/krb5/auto/Addresses.jtr │ │ │ │ │ @@ -1,44 +1,44 @@ │ │ │ │ │ #Test Results (version 2) │ │ │ │ │ -#Thu Oct 08 20:09:13 UTC 2026 │ │ │ │ │ +#Sat Oct 10 00:11:13 UTC 2026 │ │ │ │ │ #-----testdescription----- │ │ │ │ │ $file=/build/reproducible-path/openjdk-21-21.0.13~8ea/test/jdk/sun/security/krb5/auto/Addresses.java │ │ │ │ │ $root=/build/reproducible-path/openjdk-21-21.0.13~8ea/test/jdk │ │ │ │ │ keywords=bug8031111 bug8194486 othervm │ │ │ │ │ library=/test/lib │ │ │ │ │ modules=java.base/jdk.internal.misc java.base/sun.security.util java.security.jgss/sun.security.jgss java.security.jgss/sun.security.jgss.krb5 java.security.jgss/sun.security.krb5\:+open java.security.jgss/sun.security.krb5.internal\:+open java.security.jgss/sun.security.krb5.internal.ccache java.security.jgss/sun.security.krb5.internal.rcache java.security.jgss/sun.security.krb5.internal.crypto java.security.jgss/sun.security.krb5.internal.ktab jdk.security.auth jdk.security.jgss │ │ │ │ │ run=USER_SPECIFIED compile -XDignore.symbol.file Addresses.java\nUSER_SPECIFIED main jdk.test.lib.FileInstaller TestHosts TestHosts\nUSER_SPECIFIED main/othervm -Djdk.net.hosts.file\=TestHosts Addresses\n │ │ │ │ │ source=Addresses.java │ │ │ │ │ title=fix krb5 caddr │ │ │ │ │ │ │ │ │ │ #-----environment----- │ │ │ │ │ │ │ │ │ │ #-----testresult----- │ │ │ │ │ description=file\:/build/reproducible-path/openjdk-21-21.0.13~8ea/test/jdk/sun/security/krb5/auto/Addresses.java │ │ │ │ │ -elapsed=3064 0\:00\:03.064 │ │ │ │ │ -end=Thu Oct 08 20\:09\:13 UTC 2026 │ │ │ │ │ +elapsed=2345 0\:00\:02.345 │ │ │ │ │ +end=Sat Oct 10 00\:11\:13 UTC 2026 │ │ │ │ │ environment=regtest │ │ │ │ │ execStatus=Failed. Execution failed\: `main' threw exception\: java.lang.Exception │ │ │ │ │ harnessLoaderMode=Classpath Loader │ │ │ │ │ harnessVariety=Full Bundle │ │ │ │ │ hostname=sbuild │ │ │ │ │ javatestOS=Linux 6.12.111+deb13-amd64 (amd64) │ │ │ │ │ javatestVersion=6.0-ea+b26-2026-03-18-${BUILT_FROM_COMMIT} │ │ │ │ │ jtregVersion=jtreg 8.3 src 1 │ │ │ │ │ modules=java.base/jdk.internal.misc java.base/sun.security.util java.security.jgss/sun.security.jgss java.security.jgss/sun.security.jgss.krb5 java.security.jgss/sun.security.krb5\:+open java.security.jgss/sun.security.krb5.internal\:+open java.security.jgss/sun.security.krb5.internal.ccache java.security.jgss/sun.security.krb5.internal.rcache java.security.jgss/sun.security.krb5.internal.crypto java.security.jgss/sun.security.krb5.internal.ktab jdk.security.auth jdk.security.jgss │ │ │ │ │ script=com.sun.javatest.regtest.exec.RegressionScript │ │ │ │ │ sections=script_messages compile build main build main │ │ │ │ │ -start=Thu Oct 08 20\:09\:10 UTC 2026 │ │ │ │ │ +start=Sat Oct 10 00\:11\:11 UTC 2026 │ │ │ │ │ test=sun/security/krb5/auto/Addresses.java │ │ │ │ │ testJDK=/build/reproducible-path/openjdk-21-21.0.13~8ea/build/bootcycle-build/images/jdk │ │ │ │ │ -testJDK_OS=[name\:Linux,arch\:amd64,version\:6.12.111+deb13-amd64,family\:linux,simple_arch\:x64,simple_version\:6.12,processors\:6,maxMemory\:16775884800,maxSwap\:182536105984] │ │ │ │ │ +testJDK_OS=[name\:Linux,arch\:amd64,version\:6.12.111+deb13-amd64,family\:linux,simple_arch\:x64,simple_version\:6.12,processors\:4,maxMemory\:33662713856,maxSwap\:34359734272] │ │ │ │ │ testJDK_os.arch=amd64 │ │ │ │ │ testJDK_os.name=Linux │ │ │ │ │ testJDK_os.version=6.12.111+deb13-amd64 │ │ │ │ │ -totalTime=3067 │ │ │ │ │ +totalTime=2347 │ │ │ │ │ user.name=sbuild │ │ │ │ │ work=/tmp/jdk/JTwork/sun/security/krb5/auto │ │ │ │ │ │ │ │ │ │ #section:script_messages │ │ │ │ │ ----------messages:(7/471)---------- │ │ │ │ │ JDK under test: /build/reproducible-path/openjdk-21-21.0.13~8ea/build/bootcycle-build/images/jdk │ │ │ │ │ openjdk version "21.0.13-ea" 2026-10-20 │ │ │ │ │ @@ -48,21 +48,21 @@ │ │ │ │ │ source directory: /build/reproducible-path/openjdk-21-21.0.13~8ea/test/lib │ │ │ │ │ class directory: /tmp/jdk/JTwork/classes/sun/security/krb5/auto/Addresses.d/test/lib │ │ │ │ │ │ │ │ │ │ #section:compile │ │ │ │ │ ----------messages:(9/1177)---------- │ │ │ │ │ command: compile -XDignore.symbol.file /build/reproducible-path/openjdk-21-21.0.13~8ea/test/jdk/sun/security/krb5/auto/Addresses.java │ │ │ │ │ reason: User specified action: run compile -XDignore.symbol.file Addresses.java │ │ │ │ │ -started: Thu Oct 08 20:09:10.377 UTC 2026 │ │ │ │ │ +started: Sat Oct 10 00:11:11.337 UTC 2026 │ │ │ │ │ Additional options from @modules: --add-modules java.base,java.security.jgss,jdk.security.auth,jdk.security.jgss --add-exports java.base/jdk.internal.misc=ALL-UNNAMED --add-exports java.base/sun.security.util=ALL-UNNAMED --add-exports java.security.jgss/sun.security.jgss=ALL-UNNAMED --add-exports java.security.jgss/sun.security.jgss.krb5=ALL-UNNAMED --add-exports java.security.jgss/sun.security.krb5=ALL-UNNAMED --add-exports java.security.jgss/sun.security.krb5.internal=ALL-UNNAMED --add-exports java.security.jgss/sun.security.krb5.internal.ccache=ALL-UNNAMED --add-exports java.security.jgss/sun.security.krb5.internal.rcache=ALL-UNNAMED --add-exports java.security.jgss/sun.security.krb5.internal.crypto=ALL-UNNAMED --add-exports java.security.jgss/sun.security.krb5.internal.ktab=ALL-UNNAMED │ │ │ │ │ Mode: agentvm │ │ │ │ │ Agent id: 2 │ │ │ │ │ -Process id: 3401223 │ │ │ │ │ -finished: Thu Oct 08 20:09:11.472 UTC 2026 │ │ │ │ │ -elapsed time (seconds): 1.095 │ │ │ │ │ +Process id: 1140879 │ │ │ │ │ +finished: Sat Oct 10 00:11:12.090 UTC 2026 │ │ │ │ │ +elapsed time (seconds): 0.753 │ │ │ │ │ ----------configuration:(23/1529)---------- │ │ │ │ │ Boot Layer (javac runtime environment) │ │ │ │ │ class path: /usr/share/jtreg/lib/javatest.jar │ │ │ │ │ /usr/share/jtreg/lib/jtreg.jar │ │ │ │ │ patch: java.base /tmp/jdk/JTwork/patches/java.base │ │ │ │ │ │ │ │ │ │ javac compilation environment │ │ │ │ │ @@ -132,34 +132,34 @@ │ │ │ │ │ -classpath /build/reproducible-path/openjdk-21-21.0.13~8ea/test/jdk/sun/security/krb5/auto:/tmp/jdk/JTwork/classes/sun/security/krb5/auto/Addresses.d:/tmp/jdk/JTwork/classes/sun/security/krb5/auto/Addresses.d/test/lib \\ │ │ │ │ │ -XDignore.symbol.file /build/reproducible-path/openjdk-21-21.0.13~8ea/test/jdk/sun/security/krb5/auto/Addresses.java │ │ │ │ │ ----------stdout:(0/0)---------- │ │ │ │ │ ----------stderr:(0/0)---------- │ │ │ │ │ result: Passed. Compilation successful │ │ │ │ │ │ │ │ │ │ #section:build │ │ │ │ │ -----------messages:(5/196)---------- │ │ │ │ │ +----------messages:(5/194)---------- │ │ │ │ │ command: build jdk.test.lib.FileInstaller │ │ │ │ │ reason: Named class compiled on demand │ │ │ │ │ -started: Thu Oct 08 20:09:11.472 UTC 2026 │ │ │ │ │ -finished: Thu Oct 08 20:09:11.473 UTC 2026 │ │ │ │ │ -elapsed time (seconds): 0.001 │ │ │ │ │ +started: Sat Oct 10 00:11:12.090 UTC 2026 │ │ │ │ │ +finished: Sat Oct 10 00:11:12.090 UTC 2026 │ │ │ │ │ +elapsed time (seconds): 0.0 │ │ │ │ │ result: Passed. All files up to date │ │ │ │ │ │ │ │ │ │ #section:main │ │ │ │ │ ----------messages:(10/925)---------- │ │ │ │ │ command: main jdk.test.lib.FileInstaller TestHosts TestHosts │ │ │ │ │ reason: User specified action: run main jdk.test.lib.FileInstaller TestHosts TestHosts │ │ │ │ │ -started: Thu Oct 08 20:09:11.473 UTC 2026 │ │ │ │ │ +started: Sat Oct 10 00:11:12.090 UTC 2026 │ │ │ │ │ Mode: agentvm │ │ │ │ │ Agent id: 1 │ │ │ │ │ -Process id: 3401104 │ │ │ │ │ +Process id: 1140761 │ │ │ │ │ Additional exports to unnamed modules from @modules: java.base/jdk.internal.misc java.base/sun.security.util java.security.jgss/sun.security.jgss java.security.jgss/sun.security.jgss.krb5 java.security.jgss/sun.security.krb5 java.security.jgss/sun.security.krb5.internal java.security.jgss/sun.security.krb5.internal.ccache java.security.jgss/sun.security.krb5.internal.rcache java.security.jgss/sun.security.krb5.internal.crypto java.security.jgss/sun.security.krb5.internal.ktab │ │ │ │ │ Additional opens to unnamed modules from @modules: java.security.jgss/sun.security.krb5 java.security.jgss/sun.security.krb5.internal │ │ │ │ │ -finished: Thu Oct 08 20:09:11.540 UTC 2026 │ │ │ │ │ -elapsed time (seconds): 0.067 │ │ │ │ │ +finished: Sat Oct 10 00:11:12.156 UTC 2026 │ │ │ │ │ +elapsed time (seconds): 0.066 │ │ │ │ │ ----------configuration:(29/1786)---------- │ │ │ │ │ Boot Layer │ │ │ │ │ class path: /usr/share/jtreg/lib/javatest.jar │ │ │ │ │ /usr/share/jtreg/lib/jtreg.jar │ │ │ │ │ /usr/share/jtreg/lib/junit-platform-console-standalone.jar │ │ │ │ │ /usr/share/jtreg/lib/testng.jar │ │ │ │ │ /usr/share/jtreg/lib/guice.jar │ │ │ │ │ @@ -227,29 +227,29 @@ │ │ │ │ │ │ │ │ │ │ result: Passed. Execution successful │ │ │ │ │ │ │ │ │ │ #section:build │ │ │ │ │ ----------messages:(5/177)---------- │ │ │ │ │ command: build Addresses │ │ │ │ │ reason: Named class compiled on demand │ │ │ │ │ -started: Thu Oct 08 20:09:11.541 UTC 2026 │ │ │ │ │ -finished: Thu Oct 08 20:09:11.541 UTC 2026 │ │ │ │ │ +started: Sat Oct 10 00:11:12.156 UTC 2026 │ │ │ │ │ +finished: Sat Oct 10 00:11:12.156 UTC 2026 │ │ │ │ │ elapsed time (seconds): 0.0 │ │ │ │ │ result: Passed. All files up to date │ │ │ │ │ │ │ │ │ │ #section:main │ │ │ │ │ ----------messages:(8/1247)---------- │ │ │ │ │ command: main -Djdk.net.hosts.file=TestHosts Addresses │ │ │ │ │ reason: User specified action: run main/othervm -Djdk.net.hosts.file=TestHosts Addresses │ │ │ │ │ -started: Thu Oct 08 20:09:11.542 UTC 2026 │ │ │ │ │ +started: Sat Oct 10 00:11:12.157 UTC 2026 │ │ │ │ │ Mode: othervm [/othervm specified] │ │ │ │ │ Additional options from @modules: --add-modules java.base,java.security.jgss,jdk.security.auth,jdk.security.jgss --add-exports java.base/jdk.internal.misc=ALL-UNNAMED --add-exports java.base/sun.security.util=ALL-UNNAMED --add-exports java.security.jgss/sun.security.jgss=ALL-UNNAMED --add-exports java.security.jgss/sun.security.jgss.krb5=ALL-UNNAMED --add-exports java.security.jgss/sun.security.krb5=ALL-UNNAMED --add-opens java.security.jgss/sun.security.krb5=ALL-UNNAMED --add-exports java.security.jgss/sun.security.krb5.internal=ALL-UNNAMED --add-opens java.security.jgss/sun.security.krb5.internal=ALL-UNNAMED --add-exports java.security.jgss/sun.security.krb5.internal.ccache=ALL-UNNAMED --add-exports java.security.jgss/sun.security.krb5.internal.rcache=ALL-UNNAMED --add-exports java.security.jgss/sun.security.krb5.internal.crypto=ALL-UNNAMED --add-exports java.security.jgss/sun.security.krb5.internal.ktab=ALL-UNNAMED │ │ │ │ │ -Process id: 3401252 │ │ │ │ │ -finished: Thu Oct 08 20:09:13.436 UTC 2026 │ │ │ │ │ -elapsed time (seconds): 1.894 │ │ │ │ │ +Process id: 1140905 │ │ │ │ │ +finished: Sat Oct 10 00:11:13.678 UTC 2026 │ │ │ │ │ +elapsed time (seconds): 1.521 │ │ │ │ │ ----------configuration:(15/1053)---------- │ │ │ │ │ Boot Layer │ │ │ │ │ add modules: java.base java.security.jgss jdk.security.auth jdk.security.jgss │ │ │ │ │ add exports: java.base/jdk.internal.misc ALL-UNNAMED │ │ │ │ │ java.base/sun.security.util ALL-UNNAMED │ │ │ │ │ java.security.jgss/sun.security.jgss ALL-UNNAMED │ │ │ │ │ java.security.jgss/sun.security.jgss.krb5 ALL-UNNAMED │ │ │ │ │ @@ -259,27 +259,27 @@ │ │ │ │ │ java.security.jgss/sun.security.krb5.internal.crypto ALL-UNNAMED │ │ │ │ │ java.security.jgss/sun.security.krb5.internal.ktab ALL-UNNAMED │ │ │ │ │ java.security.jgss/sun.security.krb5.internal.rcache ALL-UNNAMED │ │ │ │ │ add opens: java.security.jgss/sun.security.krb5 ALL-UNNAMED │ │ │ │ │ java.security.jgss/sun.security.krb5.internal ALL-UNNAMED │ │ │ │ │ │ │ │ │ │ ----------System.out:(24/852)---------- │ │ │ │ │ -Start KDC on 15707 │ │ │ │ │ +Start KDC on 17800 │ │ │ │ │ ----------------------------------------------- │ │ │ │ │ >>>>> UDP packet received │ │ │ │ │ -RABBIT.HOLE:15707> dummy@RABBIT.HOLE sends AS-REQ for krbtgt/RABBIT.HOLE@RABBIT.HOLE, KDCOptions: │ │ │ │ │ +RABBIT.HOLE:17800> dummy@RABBIT.HOLE sends AS-REQ for krbtgt/RABBIT.HOLE@RABBIT.HOLE, KDCOptions: │ │ │ │ │ KrbException: Additional pre-authentication required (25) │ │ │ │ │ at KDC.processAsReq(KDC.java:1335) │ │ │ │ │ at KDC.processMessage(KDC.java:809) │ │ │ │ │ at KDC$1.run(KDC.java:1565) │ │ │ │ │ Error 25 Additional pre-authentication required │ │ │ │ │ >>>>> UDP request honored │ │ │ │ │ ----------------------------------------------- │ │ │ │ │ >>>>> UDP packet received │ │ │ │ │ -RABBIT.HOLE:15707> dummy@RABBIT.HOLE sends AS-REQ for krbtgt/RABBIT.HOLE@RABBIT.HOLE, KDCOptions: │ │ │ │ │ +RABBIT.HOLE:17800> dummy@RABBIT.HOLE sends AS-REQ for krbtgt/RABBIT.HOLE@RABBIT.HOLE, KDCOptions: │ │ │ │ │ Return dummy@RABBIT.HOLE ticket for krbtgt/RABBIT.HOLE@RABBIT.HOLE, flags INITIAL;PRE-AUTHENT │ │ │ │ │ >>>>> UDP request honored │ │ │ │ │ /10.0.0.10 │ │ │ │ │ extra1 found │ │ │ │ │ /10.0.0.11 │ │ │ │ │ extra2 found │ │ │ │ │ /10.0.0.12 │ │ ├── ./usr/share/doc/openjdk-21-jre-headless/test-amd64/jtreg-summary-hotspot.log │ │ │ @@ -1,9 +1,9 @@ │ │ │ --------------- jtreg console summary for hotspot --------------- │ │ │ -Test results: passed: 3,148; skipped: 4; excluded: 42; did not match keywords: 75; did not meet platform requirements: 179 │ │ │ +Test results: passed: 3,163; skipped: 4; excluded: 42; did not match keywords: 75; did not meet platform requirements: 164 │ │ │ Framework-based tests: 2,176 = 1,909 TestNG + 267 JUnit │ │ │ [debian/tests/jtreg-autopkgtest.sh] nothing to cleanup │ │ │ Unable to compare jtreg results: no build jtreport found for hotspot/amd64. │ │ │ Reason: '/usr/share/doc/openjdk-21-jre-headless//test-amd64/jtreport-hotspot.tar.gz' does not exist. │ │ │ --------------- jtreg console summary for langtools --------------- │ │ │ Test results: passed: 4,433; skipped: 1; excluded: 12; did not match keywords: 1; did not meet platform requirements: 1 │ │ │ Framework-based tests: 4,126 = 3,147 TestNG + 979 JUnit │ │ │ @@ -22,16 +22,16 @@ │ │ │ FAILED: java/net/MulticastSocket/Promiscuous.java │ │ │ FAILED: java/net/MulticastSocket/SetLoopbackMode.java │ │ │ FAILED: java/net/MulticastSocket/SetLoopbackModeIPv4.java │ │ │ FAILED: java/net/MulticastSocket/Test.java │ │ │ FAILED: java/net/SocketOption/OptionsTest.java │ │ │ FAILED: java/net/SocketPermission/SocketPermissionTest.java │ │ │ FAILED: sun/security/krb5/auto/Addresses.java │ │ │ -Test results: passed: 6,500; failed: 9; skipped: 115; excluded: 38; did not match keywords: 37; did not meet module requirements: 3; did not meet platform requirements: 101 │ │ │ -Framework-based tests: 335,201 = 164,231 TestNG + 170,970 JUnit │ │ │ +Test results: passed: 6,502; failed: 9; skipped: 115; excluded: 38; did not match keywords: 37; did not meet module requirements: 3; did not meet platform requirements: 99 │ │ │ +Framework-based tests: 335,220 = 164,250 TestNG + 170,970 JUnit │ │ │ FAILED: java/net/MulticastSocket/B6427403.java │ │ │ FAILED: java/net/MulticastSocket/NoLoopbackPackets.java │ │ │ FAILED: java/net/MulticastSocket/Promiscuous.java │ │ │ FAILED: java/net/MulticastSocket/SetLoopbackMode.java │ │ │ FAILED: java/net/MulticastSocket/SetLoopbackModeIPv4.java │ │ │ FAILED: java/net/MulticastSocket/Test.java │ │ │ FAILED: java/net/SocketOption/OptionsTest.java │ │ ├── ./usr/share/doc/openjdk-21-jre-headless/test-amd64/jtreg_output-hotspot.log.gz │ │ │ ├── jtreg_output-hotspot.log │ │ │ │ @@ -289,14 +289,16 @@ │ │ │ │ Passed: compiler/intrinsics/Test8005419.java │ │ │ │ Passed: compiler/intrinsics/Test8215792.java │ │ │ │ Passed: compiler/intrinsics/Test8237524.java │ │ │ │ Passed: compiler/intrinsics/TestArraysHashCode.java │ │ │ │ Passed: compiler/intrinsics/TestBitShuffleOpers.java │ │ │ │ Passed: compiler/intrinsics/TestCheckIndex.java │ │ │ │ Passed: compiler/intrinsics/TestCompareUnsigned.java │ │ │ │ +Passed: compiler/intrinsics/TestDoubleIsInfinite.java │ │ │ │ +Passed: compiler/intrinsics/TestFloatIsInfinite.java │ │ │ │ Passed: compiler/intrinsics/TestIntegerUnsignedDivMod.java │ │ │ │ Passed: compiler/intrinsics/TestLongUnsignedDivMod.java │ │ │ │ Passed: compiler/intrinsics/TestReferenceGetWithNull.java │ │ │ │ Passed: compiler/intrinsics/TestReferenceRefersTo.java │ │ │ │ Passed: compiler/intrinsics/TestRotate.java │ │ │ │ Passed: compiler/intrinsics/VectorizedMismatchTest.java │ │ │ │ Passed: compiler/intrinsics/zip/TestAdler32.java │ │ │ │ @@ -1541,18 +1543,21 @@ │ │ │ │ Passed: compiler/intrinsics/sha/sanity/TestSHA3Intrinsics.java │ │ │ │ Passed: compiler/intrinsics/sha/sanity/TestSHA3MultiBlockIntrinsics.java │ │ │ │ Passed: compiler/intrinsics/sha/sanity/TestSHA512Intrinsics.java │ │ │ │ Passed: compiler/intrinsics/sha/sanity/TestSHA512MultiBlockIntrinsics.java │ │ │ │ Passed: compiler/intrinsics/sha/TestDigest.java │ │ │ │ Passed: compiler/intrinsics/string/TestCopyValueOf.java │ │ │ │ Passed: compiler/intrinsics/string/TestCountPositives.java#id0 │ │ │ │ +Passed: compiler/intrinsics/string/TestCountPositives.java#id1 │ │ │ │ Passed: compiler/intrinsics/string/TestEncodeIntrinsics.java │ │ │ │ Passed: compiler/intrinsics/string/TestHasNegatives.java#id0 │ │ │ │ +Passed: compiler/intrinsics/string/TestHasNegatives.java#id1 │ │ │ │ Passed: compiler/intrinsics/string/TestStringConstruction.java │ │ │ │ Passed: compiler/intrinsics/string/TestStringConstructionIntrinsics.java#id0 │ │ │ │ +Passed: compiler/intrinsics/string/TestStringConstructionIntrinsics.java#id1 │ │ │ │ Passed: compiler/intrinsics/string/TestStringEqualsBadLength.java │ │ │ │ Passed: compiler/intrinsics/string/TestStringIndexOfCharIntrinsics.java │ │ │ │ Passed: compiler/intrinsics/string/TestStringIntrinsicMemoryFlow.java │ │ │ │ Passed: compiler/intrinsics/string/TestStringIntrinsicRangeChecks.java │ │ │ │ Passed: compiler/intrinsics/string/TestStringIntrinsics.java │ │ │ │ Passed: compiler/intrinsics/string/TestStringIntrinsics2.java │ │ │ │ Passed: compiler/intrinsics/string/TestStringLatin1IndexOfChar.java │ │ │ │ @@ -1715,14 +1720,22 @@ │ │ │ │ Passed: compiler/loopopts/superword/TestDependencyOffsets.java#avx1-v016-U │ │ │ │ Passed: compiler/loopopts/superword/TestDependencyOffsets.java#avx1-v032-A │ │ │ │ Passed: compiler/loopopts/superword/TestDependencyOffsets.java#avx1-v032-U │ │ │ │ Passed: compiler/loopopts/superword/TestDependencyOffsets.java#avx2-v016-A │ │ │ │ Passed: compiler/loopopts/superword/TestDependencyOffsets.java#avx2-v016-U │ │ │ │ Passed: compiler/loopopts/superword/TestDependencyOffsets.java#avx2-v032-A │ │ │ │ Passed: compiler/loopopts/superword/TestDependencyOffsets.java#avx2-v032-U │ │ │ │ +Passed: compiler/loopopts/superword/TestDependencyOffsets.java#avx512bw-v032-A │ │ │ │ +Passed: compiler/loopopts/superword/TestDependencyOffsets.java#avx512bw-v032-U │ │ │ │ +Passed: compiler/loopopts/superword/TestDependencyOffsets.java#avx512bw-v064-A │ │ │ │ +Passed: compiler/loopopts/superword/TestDependencyOffsets.java#avx512bw-v064-U │ │ │ │ +Passed: compiler/loopopts/superword/TestDependencyOffsets.java#avx512-v032-A │ │ │ │ +Passed: compiler/loopopts/superword/TestDependencyOffsets.java#avx512-v032-U │ │ │ │ +Passed: compiler/loopopts/superword/TestDependencyOffsets.java#avx512-v064-A │ │ │ │ +Passed: compiler/loopopts/superword/TestDependencyOffsets.java#avx512-v064-U │ │ │ │ Passed: compiler/loopopts/superword/TestDependencyOffsets.java#sse4-v002-A │ │ │ │ Passed: compiler/loopopts/superword/TestDependencyOffsets.java#sse4-v002-U │ │ │ │ Passed: compiler/loopopts/superword/TestDependencyOffsets.java#sse4-v004-A │ │ │ │ Passed: compiler/loopopts/superword/TestDependencyOffsets.java#sse4-v004-U │ │ │ │ Passed: compiler/loopopts/superword/TestDependencyOffsets.java#sse4-v008-A │ │ │ │ Passed: compiler/loopopts/superword/TestDependencyOffsets.java#sse4-v008-U │ │ │ │ Passed: compiler/loopopts/superword/TestDependencyOffsets.java#sse4-v016-A │ │ │ │ @@ -2016,19 +2029,21 @@ │ │ │ │ Passed: compiler/vectorization/TestNaNVector.java │ │ │ │ Passed: compiler/vectorization/TestNarrowedIntegerReverseBytes.java │ │ │ │ Passed: compiler/vectorization/TestNumberOfContinuousZeros.java │ │ │ │ Passed: compiler/vectorization/TestOptionVectorize.java │ │ │ │ Passed: compiler/vectorization/TestOptionVectorizeIR.java │ │ │ │ Passed: compiler/vectorization/TestOverlappingMismatchedAccesses.java │ │ │ │ Passed: compiler/vectorization/TestPopCountVector.java │ │ │ │ +Passed: compiler/vectorization/TestPopCountVectorLong.java │ │ │ │ Passed: compiler/vectorization/TestPopulateIndex.java │ │ │ │ Passed: compiler/vectorization/TestReplicateLoopIV.java │ │ │ │ Passed: compiler/vectorization/TestReverseBitsVector.java │ │ │ │ Passed: compiler/vectorization/TestReverseBytes.java │ │ │ │ Passed: compiler/vectorization/TestRotateByteAndShortVector.java │ │ │ │ +Passed: compiler/vectorization/TestRoundVectDouble.java │ │ │ │ Passed: compiler/vectorization/TestRoundVectFloat.java │ │ │ │ Passed: compiler/vectorization/TestSignumVector.java │ │ │ │ Passed: compiler/vectorization/TestSmallVectorPopIndex.java │ │ │ │ Passed: compiler/vectorization/TestSubwordReverseBytes.java │ │ │ │ Passed: compiler/vectorization/TestUnexpectedLoadOrdering.java │ │ │ │ Passed: compiler/vectorization/TestVectorsNotSavedAtSafepoint.java │ │ │ │ Passed: compiler/vectorization/TestVectorUnalignedOffset.java │ │ │ │ @@ -3159,41 +3174,41 @@ │ │ │ │ Passed: serviceability/tmtools/jstat/GcCapacityTest.java │ │ │ │ Passed: serviceability/tmtools/jstat/GcCauseTest01.java │ │ │ │ Passed: serviceability/tmtools/jstat/GcCauseTest02.java │ │ │ │ Passed: serviceability/tmtools/jstat/GcCauseTest03.java │ │ │ │ Passed: serviceability/tmtools/jstat/GcNewTest.java │ │ │ │ Passed: serviceability/tmtools/jstat/GcTest01.java │ │ │ │ Passed: serviceability/tmtools/jstat/GcTest02.java │ │ │ │ -Test results: passed: 3,148; skipped: 4; excluded: 42; did not match keywords: 75; did not meet platform requirements: 179 │ │ │ │ +Test results: passed: 3,163; skipped: 4; excluded: 42; did not match keywords: 75; did not meet platform requirements: 164 │ │ │ │ Framework-based tests: 2,176 = 1,909 TestNG + 267 JUnit │ │ │ │ Report written to /build/reproducible-path/openjdk-21-21.0.13~8ea/jtreg-test-output/hotspot/0/JTreport/html/report.html │ │ │ │ Results written to /tmp/hotspot/JTwork │ │ │ │ [debian/tests/jtreg-autopkgtest.sh] nothing to cleanup │ │ │ │ grep: debian/tests/hotspot-archs: No such file or directory │ │ │ │ Unable to compare jtreg results: no build jtreport found for hotspot/amd64. │ │ │ │ Reason: '/usr/share/doc/openjdk-21-jre-headless//test-amd64/jtreport-hotspot.tar.gz' does not exist. │ │ │ │ Command exited with non-zero status 77 │ │ │ │ Command being timed: "debian/tests/hotspot" │ │ │ │ - User time (seconds): 13746.03 │ │ │ │ - System time (seconds): 1971.70 │ │ │ │ - Percent of CPU this job got: 131% │ │ │ │ - Elapsed (wall clock) time (h:mm:ss or m:ss): 3:19:33 │ │ │ │ + User time (seconds): 10399.31 │ │ │ │ + System time (seconds): 1339.80 │ │ │ │ + Percent of CPU this job got: 114% │ │ │ │ + Elapsed (wall clock) time (h:mm:ss or m:ss): 2:51:29 │ │ │ │ Average shared text size (kbytes): 0 │ │ │ │ Average unshared data size (kbytes): 0 │ │ │ │ Average stack size (kbytes): 0 │ │ │ │ Average total size (kbytes): 0 │ │ │ │ - Maximum resident set size (kbytes): 3934808 │ │ │ │ + Maximum resident set size (kbytes): 7172620 │ │ │ │ Average resident set size (kbytes): 0 │ │ │ │ - Major (requiring I/O) page faults: 8346 │ │ │ │ - Minor (reclaiming a frame) page faults: 130359037 │ │ │ │ - Voluntary context switches: 50113176 │ │ │ │ - Involuntary context switches: 7784734 │ │ │ │ + Major (requiring I/O) page faults: 267 │ │ │ │ + Minor (reclaiming a frame) page faults: 133692492 │ │ │ │ + Voluntary context switches: 67552073 │ │ │ │ + Involuntary context switches: 33065447 │ │ │ │ Swaps: 0 │ │ │ │ - File system inputs: 1816128 │ │ │ │ - File system outputs: 0 │ │ │ │ + File system inputs: 247432 │ │ │ │ + File system outputs: 26254936 │ │ │ │ Socket messages sent: 0 │ │ │ │ Socket messages received: 0 │ │ │ │ Signals delivered: 0 │ │ │ │ Page size (bytes): 4096 │ │ │ │ Exit status: 77 │ │ │ │ ===== END check-hotspot ===== │ │ │ │ ===== START check-langtools ===== │ │ │ │ @@ -7651,31 +7666,31 @@ │ │ │ │ Results written to /tmp/langtools/JTwork │ │ │ │ [debian/tests/jtreg-autopkgtest.sh] nothing to cleanup │ │ │ │ grep: debian/tests/hotspot-archs: No such file or directory │ │ │ │ Unable to compare jtreg results: no build jtreport found for hotspot/amd64. │ │ │ │ Reason: '/usr/share/doc/openjdk-21-jre-headless//test-amd64/jtreport-hotspot.tar.gz' does not exist. │ │ │ │ Command exited with non-zero status 77 │ │ │ │ Command being timed: "debian/tests/langtools" │ │ │ │ - User time (seconds): 3970.52 │ │ │ │ - System time (seconds): 320.60 │ │ │ │ - Percent of CPU this job got: 155% │ │ │ │ - Elapsed (wall clock) time (h:mm:ss or m:ss): 45:51.78 │ │ │ │ + User time (seconds): 2782.75 │ │ │ │ + System time (seconds): 183.71 │ │ │ │ + Percent of CPU this job got: 126% │ │ │ │ + Elapsed (wall clock) time (h:mm:ss or m:ss): 39:00.46 │ │ │ │ Average shared text size (kbytes): 0 │ │ │ │ Average unshared data size (kbytes): 0 │ │ │ │ Average stack size (kbytes): 0 │ │ │ │ Average total size (kbytes): 0 │ │ │ │ - Maximum resident set size (kbytes): 3333636 │ │ │ │ + Maximum resident set size (kbytes): 7633080 │ │ │ │ Average resident set size (kbytes): 0 │ │ │ │ - Major (requiring I/O) page faults: 279 │ │ │ │ - Minor (reclaiming a frame) page faults: 17114637 │ │ │ │ - Voluntary context switches: 3831853 │ │ │ │ - Involuntary context switches: 145812 │ │ │ │ + Major (requiring I/O) page faults: 0 │ │ │ │ + Minor (reclaiming a frame) page faults: 17997555 │ │ │ │ + Voluntary context switches: 3594162 │ │ │ │ + Involuntary context switches: 974306 │ │ │ │ Swaps: 0 │ │ │ │ - File system inputs: 200048 │ │ │ │ - File system outputs: 0 │ │ │ │ + File system inputs: 81752 │ │ │ │ + File system outputs: 3166520 │ │ │ │ Socket messages sent: 0 │ │ │ │ Socket messages received: 0 │ │ │ │ Signals delivered: 0 │ │ │ │ Page size (bytes): 4096 │ │ │ │ Exit status: 77 │ │ │ │ ===== END check-langtools ===== │ │ │ │ ===== START check-jaxp ===== │ │ │ │ @@ -8201,62 +8216,62 @@ │ │ │ │ Results written to /tmp/jaxp/JTwork │ │ │ │ [debian/tests/jtreg-autopkgtest.sh] nothing to cleanup │ │ │ │ grep: debian/tests/hotspot-archs: No such file or directory │ │ │ │ Unable to compare jtreg results: no build jtreport found for hotspot/amd64. │ │ │ │ Reason: '/usr/share/doc/openjdk-21-jre-headless//test-amd64/jtreport-hotspot.tar.gz' does not exist. │ │ │ │ Command exited with non-zero status 77 │ │ │ │ Command being timed: "debian/tests/jaxp" │ │ │ │ - User time (seconds): 3389.32 │ │ │ │ - System time (seconds): 199.29 │ │ │ │ - Percent of CPU this job got: 253% │ │ │ │ - Elapsed (wall clock) time (h:mm:ss or m:ss): 23:33.11 │ │ │ │ + User time (seconds): 2125.65 │ │ │ │ + System time (seconds): 136.70 │ │ │ │ + Percent of CPU this job got: 238% │ │ │ │ + Elapsed (wall clock) time (h:mm:ss or m:ss): 15:50.20 │ │ │ │ Average shared text size (kbytes): 0 │ │ │ │ Average unshared data size (kbytes): 0 │ │ │ │ Average stack size (kbytes): 0 │ │ │ │ Average total size (kbytes): 0 │ │ │ │ - Maximum resident set size (kbytes): 296892 │ │ │ │ + Maximum resident set size (kbytes): 455056 │ │ │ │ Average resident set size (kbytes): 0 │ │ │ │ - Major (requiring I/O) page faults: 9 │ │ │ │ - Minor (reclaiming a frame) page faults: 21858193 │ │ │ │ - Voluntary context switches: 2663643 │ │ │ │ - Involuntary context switches: 27607 │ │ │ │ + Major (requiring I/O) page faults: 0 │ │ │ │ + Minor (reclaiming a frame) page faults: 22218252 │ │ │ │ + Voluntary context switches: 2716953 │ │ │ │ + Involuntary context switches: 199204 │ │ │ │ Swaps: 0 │ │ │ │ - File system inputs: 659280 │ │ │ │ - File system outputs: 0 │ │ │ │ + File system inputs: 19408 │ │ │ │ + File system outputs: 2967384 │ │ │ │ Socket messages sent: 0 │ │ │ │ Socket messages received: 0 │ │ │ │ Signals delivered: 0 │ │ │ │ Page size (bytes): 4096 │ │ │ │ Exit status: 77 │ │ │ │ ===== END check-jaxp ===== │ │ │ │ ===== START check-jdk ===== │ │ │ │ mkdir -p jtreg-test-output/jdk │ │ │ │ BOOTJDK_HOME=/usr/lib/jvm/java-21-openjdk-amd64 JTREG_OPTIONS= VMNAME=hotspot JDK_TO_TEST=build/bootcycle-build/images/jdk \ │ │ │ │ AUTOPKGTEST_TMP=/tmp/ AUTOPKGTEST_ARTIFACTS=jtreg-test-output/ \ │ │ │ │ /usr/bin/time -v debian/tests/jdk | tee jtreg-test-output/check-jdk.log │ │ │ │ - │ │ │ │ -(xfwm4:2926910): atspi-WARNING **: 15:45:25.497: AT-SPI: Error retrieving accessibility bus address: org.freedesktop.DBus.Error.ServiceUnknown: The name org.a11y.Bus was not provided by any .service files │ │ │ │ -dbus-daemon[2926899]: [session uid=999 pid=2926899 pidfd=5] Activating service name='org.xfce.Xfconf' requested by ':1.1' (uid=999 pid=2926910 comm="xfwm4") │ │ │ │ -dbus-daemon[2926899]: [session uid=999 pid=2926899 pidfd=5] Successfully activated service 'org.xfce.Xfconf' │ │ │ │ -WARNING: Glycin running without sandbox. Bubblewrap (bwrap) doesn't work in the environment. │ │ │ │ dpkg: error: --compare-versions takes three arguments: │ │ │ │ │ │ │ │ Type dpkg --help for help about installing and deinstalling packages [*]; │ │ │ │ Use 'apt' or 'aptitude' for user-friendly package management; │ │ │ │ Type dpkg -Dhelp for a list of dpkg debug flag values; │ │ │ │ Type dpkg --force-help for a list of forcing options; │ │ │ │ Type dpkg-deb --help for help about manipulating *.deb files; │ │ │ │ │ │ │ │ Options marked [*] produce a lot of output - pipe it through 'less' or 'more' ! │ │ │ │ - │ │ │ │ -(xfwm4:2926910): xfwm4-WARNING **: 15:45:28.473: Another compositing manager is running on screen 0 │ │ │ │ Directory "/tmp/jdk/JTwork" not found: creating │ │ │ │ Directory "jtreg-test-output/jdk/0/JTreport" not found: creating │ │ │ │ │ │ │ │ -(xfwm4:2926910): xfwm4-WARNING **: 15:45:28.481: Failed to connect to session manager: Failed to connect to the session manager: SESSION_MANAGER environment variable not defined │ │ │ │ +(xfwm4:676355): atspi-WARNING **: 20:25:27.314: AT-SPI: Error retrieving accessibility bus address: org.freedesktop.DBus.Error.ServiceUnknown: The name org.a11y.Bus was not provided by any .service files │ │ │ │ +dbus-daemon[676344]: [session uid=999 pid=676344 pidfd=5] Activating service name='org.xfce.Xfconf' requested by ':1.1' (uid=999 pid=676355 comm="xfwm4") │ │ │ │ +dbus-daemon[676344]: [session uid=999 pid=676344 pidfd=5] Successfully activated service 'org.xfce.Xfconf' │ │ │ │ +WARNING: Glycin running without sandbox. Bubblewrap (bwrap) doesn't work in the environment. │ │ │ │ + │ │ │ │ +(xfwm4:676355): xfwm4-WARNING **: 20:25:33.120: Another compositing manager is running on screen 0 │ │ │ │ + │ │ │ │ +(xfwm4:676355): xfwm4-WARNING **: 20:25:33.121: Failed to connect to session manager: Failed to connect to the session manager: SESSION_MANAGER environment variable not defined │ │ │ │ Passed: com/sun/jdi/AcceptTimeout.java │ │ │ │ Passed: com/sun/jdi/AccessSpecifierTest.java │ │ │ │ Passed: com/sun/jdi/AfterThreadDeathTest.java │ │ │ │ Passed: com/sun/jdi/ArrayRangeTest.java │ │ │ │ Passed: com/sun/jdi/ConstantPoolInfo.java │ │ │ │ Passed: com/sun/jdi/CountFilterTest.java │ │ │ │ Passed: com/sun/jdi/EarlyReturnNegativeTest.java │ │ │ │ @@ -8919,14 +8934,15 @@ │ │ │ │ Passed: java/io/File/ListRoots.java │ │ │ │ Passed: java/io/File/ListSpace.java │ │ │ │ Passed: java/io/File/MaxPathLength.java │ │ │ │ Passed: java/io/File/Mkdir.java │ │ │ │ Passed: java/io/File/NulFile.java │ │ │ │ Passed: java/io/File/NullArgs.java │ │ │ │ Passed: java/io/File/SetAccess.java │ │ │ │ +Passed: java/io/File/SetLastModified.java │ │ │ │ Passed: java/io/File/SetReadOnly.java │ │ │ │ Passed: java/io/File/SymLinks.java │ │ │ │ Passed: java/io/File/TempDirDoesNotExist.java │ │ │ │ Passed: java/io/File/TimeZoneLastModified.java │ │ │ │ Passed: java/io/File/ToURI.java │ │ │ │ Passed: java/io/File/ToURL.java │ │ │ │ Passed: java/io/File/Unicode.java │ │ │ │ @@ -10922,14 +10938,15 @@ │ │ │ │ Passed: java/nio/channels/AsynchronousSocketChannel/StressLoopback.java │ │ │ │ Passed: java/nio/channels/Channels/Basic.java │ │ │ │ Passed: java/nio/channels/Channels/Basic2.java │ │ │ │ Passed: java/nio/channels/Channels/CloseWriterOnFailedFlush.java │ │ │ │ Passed: java/nio/channels/Channels/EncodingTest.java │ │ │ │ Passed: java/nio/channels/Channels/ReadByte.java │ │ │ │ Passed: java/nio/channels/Channels/ReadOffset.java │ │ │ │ +Passed: java/nio/channels/Channels/ReadXBytes.java │ │ │ │ Passed: java/nio/channels/Channels/ShortWrite.java │ │ │ │ Passed: java/nio/channels/Channels/SocketChannelStreams.java │ │ │ │ Passed: java/nio/channels/Channels/TinyBuffers.java │ │ │ │ Passed: java/nio/channels/Channels/TransferTo_2GB_transferFrom.java │ │ │ │ Passed: java/nio/channels/Channels/TransferTo_2GB_transferTo.java │ │ │ │ Passed: java/nio/channels/Channels/TransferTo.java │ │ │ │ Passed: java/nio/channels/Channels/TransferTo2.java │ │ │ │ @@ -14758,82 +14775,82 @@ │ │ │ │ Passed: tools/launcher/TestXcheckJNIWarnings.java#jdwp-agent │ │ │ │ Passed: tools/launcher/TestXcheckJNIWarnings.java#noagent │ │ │ │ Passed: tools/launcher/ToolsOpts.java │ │ │ │ Passed: tools/launcher/TooSmallStackSize.java │ │ │ │ Passed: tools/launcher/UnicodeTest.java │ │ │ │ Passed: tools/launcher/UnresolvedExceptions.java │ │ │ │ Passed: tools/launcher/VersionCheck.java │ │ │ │ -Test results: passed: 6,500; failed: 9; skipped: 115; excluded: 38; did not match keywords: 37; did not meet module requirements: 3; did not meet platform requirements: 101 │ │ │ │ -Framework-based tests: 335,201 = 164,231 TestNG + 170,970 JUnit │ │ │ │ -Error: Some tests failed or other problems occurred. │ │ │ │ +Test results: passed: 6,502; failed: 9; skipped: 115; excluded: 38; did not match keywords: 37; did not meet module requirements: 3; did not meet platform requirements: 99 │ │ │ │ +Framework-based tests: 335,220 = 164,250 TestNG + 170,970 JUnit │ │ │ │ Report written to /build/reproducible-path/openjdk-21-21.0.13~8ea/jtreg-test-output/jdk/0/JTreport/html/report.html │ │ │ │ Results written to /tmp/jdk/JTwork │ │ │ │ +Error: Some tests failed or other problems occurred. │ │ │ │ Directory "jtreg-test-output/jdk/1/JTreport" not found: creating │ │ │ │ FAILED: java/net/MulticastSocket/B6427403.java │ │ │ │ FAILED: java/net/MulticastSocket/NoLoopbackPackets.java │ │ │ │ FAILED: java/net/MulticastSocket/Promiscuous.java │ │ │ │ FAILED: java/net/MulticastSocket/SetLoopbackMode.java │ │ │ │ FAILED: java/net/MulticastSocket/SetLoopbackModeIPv4.java │ │ │ │ FAILED: java/net/MulticastSocket/Test.java │ │ │ │ FAILED: java/net/SocketOption/OptionsTest.java │ │ │ │ FAILED: java/net/SocketPermission/SocketPermissionTest.java │ │ │ │ FAILED: sun/security/krb5/auto/Addresses.java │ │ │ │ Test results: failed: 9; excluded: 38; did not match keywords: 37; did not match prior status: 6,604 │ │ │ │ Framework-based tests: 8 = 8 TestNG + 0 JUnit │ │ │ │ -Error: Some tests failed or other problems occurred. │ │ │ │ Report written to /build/reproducible-path/openjdk-21-21.0.13~8ea/jtreg-test-output/jdk/1/JTreport/html/report.html │ │ │ │ Results written to /tmp/jdk/JTwork │ │ │ │ +Error: Some tests failed or other problems occurred. │ │ │ │ Directory "jtreg-test-output/jdk/2/JTreport" not found: creating │ │ │ │ FAILED: java/net/MulticastSocket/B6427403.java │ │ │ │ FAILED: java/net/MulticastSocket/NoLoopbackPackets.java │ │ │ │ FAILED: java/net/MulticastSocket/Promiscuous.java │ │ │ │ FAILED: java/net/MulticastSocket/SetLoopbackMode.java │ │ │ │ FAILED: java/net/MulticastSocket/SetLoopbackModeIPv4.java │ │ │ │ FAILED: java/net/MulticastSocket/Test.java │ │ │ │ FAILED: java/net/SocketOption/OptionsTest.java │ │ │ │ FAILED: java/net/SocketPermission/SocketPermissionTest.java │ │ │ │ FAILED: sun/security/krb5/auto/Addresses.java │ │ │ │ Test results: failed: 9; excluded: 38; did not match keywords: 37; did not match prior status: 6,604 │ │ │ │ Framework-based tests: 8 = 8 TestNG + 0 JUnit │ │ │ │ -Error: Some tests failed or other problems occurred. │ │ │ │ Report written to /build/reproducible-path/openjdk-21-21.0.13~8ea/jtreg-test-output/jdk/2/JTreport/html/report.html │ │ │ │ Results written to /tmp/jdk/JTwork │ │ │ │ +Error: Some tests failed or other problems occurred. │ │ │ │ [debian/tests/jtreg-autopkgtest.sh] nothing to cleanup │ │ │ │ Command exited with non-zero status 2 │ │ │ │ Command being timed: "debian/tests/jdk" │ │ │ │ - User time (seconds): 22392.31 │ │ │ │ - System time (seconds): 1763.10 │ │ │ │ - Percent of CPU this job got: 152% │ │ │ │ - Elapsed (wall clock) time (h:mm:ss or m:ss): 4:24:15 │ │ │ │ + User time (seconds): 15085.12 │ │ │ │ + System time (seconds): 1152.00 │ │ │ │ + Percent of CPU this job got: 119% │ │ │ │ + Elapsed (wall clock) time (h:mm:ss or m:ss): 3:46:08 │ │ │ │ Average shared text size (kbytes): 0 │ │ │ │ Average unshared data size (kbytes): 0 │ │ │ │ Average stack size (kbytes): 0 │ │ │ │ Average total size (kbytes): 0 │ │ │ │ - Maximum resident set size (kbytes): 8431920 │ │ │ │ + Maximum resident set size (kbytes): 14991572 │ │ │ │ Average resident set size (kbytes): 0 │ │ │ │ - Major (requiring I/O) page faults: 3163 │ │ │ │ - Minor (reclaiming a frame) page faults: 136075802 │ │ │ │ - Voluntary context switches: 33746413 │ │ │ │ - Involuntary context switches: 1823045 │ │ │ │ + Major (requiring I/O) page faults: 153 │ │ │ │ + Minor (reclaiming a frame) page faults: 133200487 │ │ │ │ + Voluntary context switches: 36772521 │ │ │ │ + Involuntary context switches: 5313744 │ │ │ │ Swaps: 0 │ │ │ │ - File system inputs: 3017456 │ │ │ │ - File system outputs: 0 │ │ │ │ + File system inputs: 1213016 │ │ │ │ + File system outputs: 86400352 │ │ │ │ Socket messages sent: 0 │ │ │ │ Socket messages received: 0 │ │ │ │ Signals delivered: 0 │ │ │ │ Page size (bytes): 4096 │ │ │ │ Exit status: 2 │ │ │ │ Killed │ │ │ │ ===== END check-jdk ===== │ │ │ │ for i in hotspot langtools jaxp jdk; do \ │ │ │ │ echo "--------------- jtreg console summary for $i ---------------"; \ │ │ │ │ egrep -v '^(Passed:|Directory|Re[a-z]+\ written\ to)' jtreg-test-output/check-$i.log; \ │ │ │ │ done | tee jtreg-test-output/jtreg-summary.log │ │ │ │ --------------- jtreg console summary for hotspot --------------- │ │ │ │ -Test results: passed: 3,148; skipped: 4; excluded: 42; did not match keywords: 75; did not meet platform requirements: 179 │ │ │ │ +Test results: passed: 3,163; skipped: 4; excluded: 42; did not match keywords: 75; did not meet platform requirements: 164 │ │ │ │ Framework-based tests: 2,176 = 1,909 TestNG + 267 JUnit │ │ │ │ [debian/tests/jtreg-autopkgtest.sh] nothing to cleanup │ │ │ │ Unable to compare jtreg results: no build jtreport found for hotspot/amd64. │ │ │ │ Reason: '/usr/share/doc/openjdk-21-jre-headless//test-amd64/jtreport-hotspot.tar.gz' does not exist. │ │ │ │ --------------- jtreg console summary for langtools --------------- │ │ │ │ Test results: passed: 4,433; skipped: 1; excluded: 12; did not match keywords: 1; did not meet platform requirements: 1 │ │ │ │ Framework-based tests: 4,126 = 3,147 TestNG + 979 JUnit │ │ │ │ @@ -14852,16 +14869,16 @@ │ │ │ │ FAILED: java/net/MulticastSocket/Promiscuous.java │ │ │ │ FAILED: java/net/MulticastSocket/SetLoopbackMode.java │ │ │ │ FAILED: java/net/MulticastSocket/SetLoopbackModeIPv4.java │ │ │ │ FAILED: java/net/MulticastSocket/Test.java │ │ │ │ FAILED: java/net/SocketOption/OptionsTest.java │ │ │ │ FAILED: java/net/SocketPermission/SocketPermissionTest.java │ │ │ │ FAILED: sun/security/krb5/auto/Addresses.java │ │ │ │ -Test results: passed: 6,500; failed: 9; skipped: 115; excluded: 38; did not match keywords: 37; did not meet module requirements: 3; did not meet platform requirements: 101 │ │ │ │ -Framework-based tests: 335,201 = 164,231 TestNG + 170,970 JUnit │ │ │ │ +Test results: passed: 6,502; failed: 9; skipped: 115; excluded: 38; did not match keywords: 37; did not meet module requirements: 3; did not meet platform requirements: 99 │ │ │ │ +Framework-based tests: 335,220 = 164,250 TestNG + 170,970 JUnit │ │ │ │ FAILED: java/net/MulticastSocket/B6427403.java │ │ │ │ FAILED: java/net/MulticastSocket/NoLoopbackPackets.java │ │ │ │ FAILED: java/net/MulticastSocket/Promiscuous.java │ │ │ │ FAILED: java/net/MulticastSocket/SetLoopbackMode.java │ │ │ │ FAILED: java/net/MulticastSocket/SetLoopbackModeIPv4.java │ │ │ │ FAILED: java/net/MulticastSocket/Test.java │ │ │ │ FAILED: java/net/SocketOption/OptionsTest.java │ │ │ │ @@ -14879,29 +14896,29 @@ │ │ │ │ FAILED: java/net/SocketPermission/SocketPermissionTest.java │ │ │ │ FAILED: sun/security/krb5/auto/Addresses.java │ │ │ │ Test results: failed: 9; excluded: 38; did not match keywords: 37; did not match prior status: 6,604 │ │ │ │ Framework-based tests: 8 = 8 TestNG + 0 JUnit │ │ │ │ [debian/tests/jtreg-autopkgtest.sh] nothing to cleanup │ │ │ │ make[2]: Leaving directory '/build/reproducible-path/openjdk-21-21.0.13~8ea' │ │ │ │ Command being timed: "/usr/bin/make -f debian/rules -k jtregcheck TEST_SUITES=hotspot langtools jaxp jdk JTREG_OPTIONS=" │ │ │ │ - User time (seconds): 43499.38 │ │ │ │ - System time (seconds): 4255.88 │ │ │ │ - Percent of CPU this job got: 149% │ │ │ │ - Elapsed (wall clock) time (h:mm:ss or m:ss): 8:53:14 │ │ │ │ + User time (seconds): 30393.40 │ │ │ │ + System time (seconds): 2812.95 │ │ │ │ + Percent of CPU this job got: 122% │ │ │ │ + Elapsed (wall clock) time (h:mm:ss or m:ss): 7:32:29 │ │ │ │ Average shared text size (kbytes): 0 │ │ │ │ Average unshared data size (kbytes): 0 │ │ │ │ Average stack size (kbytes): 0 │ │ │ │ Average total size (kbytes): 0 │ │ │ │ - Maximum resident set size (kbytes): 8431920 │ │ │ │ + Maximum resident set size (kbytes): 14991572 │ │ │ │ Average resident set size (kbytes): 0 │ │ │ │ - Major (requiring I/O) page faults: 11836 │ │ │ │ - Minor (reclaiming a frame) page faults: 305438978 │ │ │ │ - Voluntary context switches: 90370170 │ │ │ │ - Involuntary context switches: 9781253 │ │ │ │ + Major (requiring I/O) page faults: 421 │ │ │ │ + Minor (reclaiming a frame) page faults: 307140173 │ │ │ │ + Voluntary context switches: 110650693 │ │ │ │ + Involuntary context switches: 39556670 │ │ │ │ Swaps: 0 │ │ │ │ - File system inputs: 5694856 │ │ │ │ - File system outputs: 0 │ │ │ │ + File system inputs: 1561728 │ │ │ │ + File system outputs: 118796776 │ │ │ │ Socket messages sent: 0 │ │ │ │ Socket messages received: 0 │ │ │ │ Signals delivered: 0 │ │ │ │ Page size (bytes): 4096 │ │ │ │ Exit status: 0 │ │ ├── ./usr/share/doc/openjdk-21-jre-headless/test-amd64/jtreport-hotspot.tar.gz │ │ │ ├── jtreport-hotspot.tar │ │ │ │ ├── file list │ │ │ │ │ @@ -1,230 +1,230 @@ │ │ │ │ │ -lrwxrwxrwx 0 sbuild (999) sbuild (999) 0 2026-10-08 20:09:39.000000 jtreg-test-output/jdk/JTreport -> 2/JTreport │ │ │ │ │ -drwxr-xr-x 0 sbuild (999) sbuild (999) 0 2026-10-08 20:09:17.000000 jtreg-test-output/jdk/2/JTreport/ │ │ │ │ │ --rw-r--r-- 0 sbuild (999) sbuild (999) 712 2026-10-08 20:09:17.000000 jtreg-test-output/jdk/2/JTreport/index.html │ │ │ │ │ --rw-r--r-- 0 sbuild (999) sbuild (999) 0 2026-10-08 20:09:17.000000 jtreg-test-output/jdk/2/JTreport/reportdir.dat │ │ │ │ │ -drwxr-xr-x 0 sbuild (999) sbuild (999) 0 2026-10-08 20:09:17.000000 jtreg-test-output/jdk/2/JTreport/html/ │ │ │ │ │ --rw-r--r-- 0 sbuild (999) sbuild (999) 762638 2026-10-08 20:09:17.000000 jtreg-test-output/jdk/2/JTreport/html/notRun_gr.html │ │ │ │ │ --rw-r--r-- 0 sbuild (999) sbuild (999) 762365 2026-10-08 20:09:17.000000 jtreg-test-output/jdk/2/JTreport/html/notRun.html │ │ │ │ │ --rw-r--r-- 0 sbuild (999) sbuild (999) 520 2026-10-08 20:09:17.000000 jtreg-test-output/jdk/2/JTreport/html/error_gr.html │ │ │ │ │ --rw-r--r-- 0 sbuild (999) sbuild (999) 472 2026-10-08 20:09:17.000000 jtreg-test-output/jdk/2/JTreport/html/error.html │ │ │ │ │ --rw-r--r-- 0 sbuild (999) sbuild (999) 2749 2026-10-08 20:09:17.000000 jtreg-test-output/jdk/2/JTreport/html/failed_gr.html │ │ │ │ │ --rw-r--r-- 0 sbuild (999) sbuild (999) 2019 2026-10-08 20:09:17.000000 jtreg-test-output/jdk/2/JTreport/html/failed.html │ │ │ │ │ --rw-r--r-- 0 sbuild (999) sbuild (999) 1251113 2026-10-08 20:09:17.000000 jtreg-test-output/jdk/2/JTreport/html/passed_gr.html │ │ │ │ │ --rw-r--r-- 0 sbuild (999) sbuild (999) 1249886 2026-10-08 20:09:17.000000 jtreg-test-output/jdk/2/JTreport/html/passed.html │ │ │ │ │ --rw-r--r-- 0 sbuild (999) sbuild (999) 83173 2026-10-08 20:09:17.000000 jtreg-test-output/jdk/2/JTreport/html/excluded.html │ │ │ │ │ --rw-r--r-- 0 sbuild (999) sbuild (999) 4230 2026-10-08 20:09:17.000000 jtreg-test-output/jdk/2/JTreport/html/env.html │ │ │ │ │ --rw-r--r-- 0 sbuild (999) sbuild (999) 24358 2026-10-08 20:09:17.000000 jtreg-test-output/jdk/2/JTreport/html/config.html │ │ │ │ │ --rw-r--r-- 0 sbuild (999) sbuild (999) 307 2026-10-08 20:09:17.000000 jtreg-test-output/jdk/2/JTreport/html/report.css │ │ │ │ │ --rw-r--r-- 0 sbuild (999) sbuild (999) 1101694 2026-10-08 20:09:17.000000 jtreg-test-output/jdk/2/JTreport/html/index.html │ │ │ │ │ --rw-r--r-- 0 sbuild (999) sbuild (999) 1101694 2026-10-08 20:09:17.000000 jtreg-test-output/jdk/2/JTreport/html/report.html │ │ │ │ │ -drwxr-xr-x 0 sbuild (999) sbuild (999) 0 2026-10-08 20:09:17.000000 jtreg-test-output/jdk/2/JTreport/text/ │ │ │ │ │ --rw-r--r-- 0 sbuild (999) sbuild (999) 132 2026-10-08 20:09:17.000000 jtreg-test-output/jdk/2/JTreport/text/testng.txt │ │ │ │ │ --rw-r--r-- 0 sbuild (999) sbuild (999) 1023408 2026-10-08 20:09:17.000000 jtreg-test-output/jdk/2/JTreport/text/notRun.txt │ │ │ │ │ --rw-r--r-- 0 sbuild (999) sbuild (999) 101 2026-10-08 20:09:17.000000 jtreg-test-output/jdk/2/JTreport/text/stats.txt │ │ │ │ │ --rw-r--r-- 0 sbuild (999) sbuild (999) 116 2026-10-08 20:09:17.000000 jtreg-test-output/jdk/2/JTreport/text/timeStats.txt │ │ │ │ │ --rw-r--r-- 0 sbuild (999) sbuild (999) 21 2026-10-08 20:09:17.000000 jtreg-test-output/jdk/2/JTreport/text/tc_newfailures.txt │ │ │ │ │ --rw-r--r-- 0 sbuild (999) sbuild (999) 21 2026-10-08 20:09:17.000000 jtreg-test-output/jdk/2/JTreport/text/tc_fail2notrun.txt │ │ │ │ │ --rw-r--r-- 0 sbuild (999) sbuild (999) 20 2026-10-08 20:09:17.000000 jtreg-test-output/jdk/2/JTreport/text/tc_fail2error.txt │ │ │ │ │ --rw-r--r-- 0 sbuild (999) sbuild (999) 19 2026-10-08 20:09:17.000000 jtreg-test-output/jdk/2/JTreport/text/tc_fail2pass.txt │ │ │ │ │ --rw-r--r-- 0 sbuild (999) sbuild (999) 22 2026-10-08 20:09:17.000000 jtreg-test-output/jdk/2/JTreport/text/tc_fail2missing.txt │ │ │ │ │ --rw-r--r-- 0 sbuild (999) sbuild (999) 19 2026-10-08 20:09:17.000000 jtreg-test-output/jdk/2/JTreport/text/other_errors.txt │ │ │ │ │ --rw-r--r-- 0 sbuild (999) sbuild (999) 416 2026-10-08 20:09:17.000000 jtreg-test-output/jdk/2/JTreport/text/newfailures.txt │ │ │ │ │ --rw-r--r-- 0 sbuild (999) sbuild (999) 16 2026-10-08 20:09:17.000000 jtreg-test-output/jdk/2/JTreport/text/fail2fail.txt │ │ │ │ │ --rw-r--r-- 0 sbuild (999) sbuild (999) 18 2026-10-08 20:09:17.000000 jtreg-test-output/jdk/2/JTreport/text/fail2notrun.txt │ │ │ │ │ --rw-r--r-- 0 sbuild (999) sbuild (999) 17 2026-10-08 20:09:17.000000 jtreg-test-output/jdk/2/JTreport/text/faiL2error.txt │ │ │ │ │ --rw-r--r-- 0 sbuild (999) sbuild (999) 16 2026-10-08 20:09:17.000000 jtreg-test-output/jdk/2/JTreport/text/fail2pass.txt │ │ │ │ │ --rw-r--r-- 0 sbuild (999) sbuild (999) 19 2026-10-08 20:09:17.000000 jtreg-test-output/jdk/2/JTreport/text/fail2missing.txt │ │ │ │ │ --rw-r--r-- 0 sbuild (999) sbuild (999) 889810 2026-10-08 20:09:17.000000 jtreg-test-output/jdk/2/JTreport/text/summary.txt │ │ │ │ │ --rw-r--r-- 0 sbuild (999) sbuild (999) 550 2026-10-08 20:09:03.000000 jtreg-test-output/jdk/2/JTreport/text/cmdArgs.txt │ │ │ │ │ -drwxr-xr-x 0 sbuild (999) sbuild (999) 0 2026-10-08 20:08:42.000000 jtreg-test-output/jdk/1/JTreport/ │ │ │ │ │ --rw-r--r-- 0 sbuild (999) sbuild (999) 712 2026-10-08 20:08:42.000000 jtreg-test-output/jdk/1/JTreport/index.html │ │ │ │ │ --rw-r--r-- 0 sbuild (999) sbuild (999) 0 2026-10-08 20:08:42.000000 jtreg-test-output/jdk/1/JTreport/reportdir.dat │ │ │ │ │ -drwxr-xr-x 0 sbuild (999) sbuild (999) 0 2026-10-08 20:08:41.000000 jtreg-test-output/jdk/1/JTreport/html/ │ │ │ │ │ --rw-r--r-- 0 sbuild (999) sbuild (999) 762638 2026-10-08 20:08:41.000000 jtreg-test-output/jdk/1/JTreport/html/notRun_gr.html │ │ │ │ │ --rw-r--r-- 0 sbuild (999) sbuild (999) 762365 2026-10-08 20:08:41.000000 jtreg-test-output/jdk/1/JTreport/html/notRun.html │ │ │ │ │ --rw-r--r-- 0 sbuild (999) sbuild (999) 520 2026-10-08 20:08:41.000000 jtreg-test-output/jdk/1/JTreport/html/error_gr.html │ │ │ │ │ --rw-r--r-- 0 sbuild (999) sbuild (999) 472 2026-10-08 20:08:41.000000 jtreg-test-output/jdk/1/JTreport/html/error.html │ │ │ │ │ --rw-r--r-- 0 sbuild (999) sbuild (999) 2749 2026-10-08 20:08:41.000000 jtreg-test-output/jdk/1/JTreport/html/failed_gr.html │ │ │ │ │ --rw-r--r-- 0 sbuild (999) sbuild (999) 2019 2026-10-08 20:08:41.000000 jtreg-test-output/jdk/1/JTreport/html/failed.html │ │ │ │ │ --rw-r--r-- 0 sbuild (999) sbuild (999) 1251113 2026-10-08 20:08:41.000000 jtreg-test-output/jdk/1/JTreport/html/passed_gr.html │ │ │ │ │ --rw-r--r-- 0 sbuild (999) sbuild (999) 1249886 2026-10-08 20:08:41.000000 jtreg-test-output/jdk/1/JTreport/html/passed.html │ │ │ │ │ --rw-r--r-- 0 sbuild (999) sbuild (999) 83173 2026-10-08 20:08:41.000000 jtreg-test-output/jdk/1/JTreport/html/excluded.html │ │ │ │ │ --rw-r--r-- 0 sbuild (999) sbuild (999) 4230 2026-10-08 20:08:41.000000 jtreg-test-output/jdk/1/JTreport/html/env.html │ │ │ │ │ --rw-r--r-- 0 sbuild (999) sbuild (999) 24358 2026-10-08 20:08:41.000000 jtreg-test-output/jdk/1/JTreport/html/config.html │ │ │ │ │ --rw-r--r-- 0 sbuild (999) sbuild (999) 307 2026-10-08 20:08:41.000000 jtreg-test-output/jdk/1/JTreport/html/report.css │ │ │ │ │ --rw-r--r-- 0 sbuild (999) sbuild (999) 1101694 2026-10-08 20:08:41.000000 jtreg-test-output/jdk/1/JTreport/html/index.html │ │ │ │ │ --rw-r--r-- 0 sbuild (999) sbuild (999) 1101694 2026-10-08 20:08:41.000000 jtreg-test-output/jdk/1/JTreport/html/report.html │ │ │ │ │ -drwxr-xr-x 0 sbuild (999) sbuild (999) 0 2026-10-08 20:08:42.000000 jtreg-test-output/jdk/1/JTreport/text/ │ │ │ │ │ --rw-r--r-- 0 sbuild (999) sbuild (999) 132 2026-10-08 20:08:42.000000 jtreg-test-output/jdk/1/JTreport/text/testng.txt │ │ │ │ │ --rw-r--r-- 0 sbuild (999) sbuild (999) 1023408 2026-10-08 20:08:42.000000 jtreg-test-output/jdk/1/JTreport/text/notRun.txt │ │ │ │ │ --rw-r--r-- 0 sbuild (999) sbuild (999) 101 2026-10-08 20:08:42.000000 jtreg-test-output/jdk/1/JTreport/text/stats.txt │ │ │ │ │ --rw-r--r-- 0 sbuild (999) sbuild (999) 116 2026-10-08 20:08:42.000000 jtreg-test-output/jdk/1/JTreport/text/timeStats.txt │ │ │ │ │ --rw-r--r-- 0 sbuild (999) sbuild (999) 21 2026-10-08 20:08:41.000000 jtreg-test-output/jdk/1/JTreport/text/tc_newfailures.txt │ │ │ │ │ --rw-r--r-- 0 sbuild (999) sbuild (999) 21 2026-10-08 20:08:41.000000 jtreg-test-output/jdk/1/JTreport/text/tc_fail2notrun.txt │ │ │ │ │ --rw-r--r-- 0 sbuild (999) sbuild (999) 20 2026-10-08 20:08:41.000000 jtreg-test-output/jdk/1/JTreport/text/tc_fail2error.txt │ │ │ │ │ --rw-r--r-- 0 sbuild (999) sbuild (999) 19 2026-10-08 20:08:41.000000 jtreg-test-output/jdk/1/JTreport/text/tc_fail2pass.txt │ │ │ │ │ --rw-r--r-- 0 sbuild (999) sbuild (999) 22 2026-10-08 20:08:41.000000 jtreg-test-output/jdk/1/JTreport/text/tc_fail2missing.txt │ │ │ │ │ --rw-r--r-- 0 sbuild (999) sbuild (999) 19 2026-10-08 20:08:41.000000 jtreg-test-output/jdk/1/JTreport/text/other_errors.txt │ │ │ │ │ --rw-r--r-- 0 sbuild (999) sbuild (999) 416 2026-10-08 20:08:41.000000 jtreg-test-output/jdk/1/JTreport/text/newfailures.txt │ │ │ │ │ --rw-r--r-- 0 sbuild (999) sbuild (999) 16 2026-10-08 20:08:41.000000 jtreg-test-output/jdk/1/JTreport/text/fail2fail.txt │ │ │ │ │ --rw-r--r-- 0 sbuild (999) sbuild (999) 18 2026-10-08 20:08:41.000000 jtreg-test-output/jdk/1/JTreport/text/fail2notrun.txt │ │ │ │ │ --rw-r--r-- 0 sbuild (999) sbuild (999) 17 2026-10-08 20:08:41.000000 jtreg-test-output/jdk/1/JTreport/text/faiL2error.txt │ │ │ │ │ --rw-r--r-- 0 sbuild (999) sbuild (999) 16 2026-10-08 20:08:41.000000 jtreg-test-output/jdk/1/JTreport/text/fail2pass.txt │ │ │ │ │ --rw-r--r-- 0 sbuild (999) sbuild (999) 19 2026-10-08 20:08:41.000000 jtreg-test-output/jdk/1/JTreport/text/fail2missing.txt │ │ │ │ │ --rw-r--r-- 0 sbuild (999) sbuild (999) 889810 2026-10-08 20:08:41.000000 jtreg-test-output/jdk/1/JTreport/text/summary.txt │ │ │ │ │ --rw-r--r-- 0 sbuild (999) sbuild (999) 550 2026-10-08 20:08:26.000000 jtreg-test-output/jdk/1/JTreport/text/cmdArgs.txt │ │ │ │ │ -drwxr-xr-x 0 sbuild (999) sbuild (999) 0 2026-10-08 20:08:03.000000 jtreg-test-output/jdk/0/JTreport/ │ │ │ │ │ --rw-r--r-- 0 sbuild (999) sbuild (999) 712 2026-10-08 20:08:03.000000 jtreg-test-output/jdk/0/JTreport/index.html │ │ │ │ │ --rw-r--r-- 0 sbuild (999) sbuild (999) 0 2026-10-08 20:08:03.000000 jtreg-test-output/jdk/0/JTreport/reportdir.dat │ │ │ │ │ -drwxr-xr-x 0 sbuild (999) sbuild (999) 0 2026-10-08 20:08:03.000000 jtreg-test-output/jdk/0/JTreport/html/ │ │ │ │ │ --rw-r--r-- 0 sbuild (999) sbuild (999) 20872 2026-10-08 20:08:03.000000 jtreg-test-output/jdk/0/JTreport/html/notRun_gr.html │ │ │ │ │ --rw-r--r-- 0 sbuild (999) sbuild (999) 20527 2026-10-08 20:08:03.000000 jtreg-test-output/jdk/0/JTreport/html/notRun.html │ │ │ │ │ --rw-r--r-- 0 sbuild (999) sbuild (999) 520 2026-10-08 20:08:03.000000 jtreg-test-output/jdk/0/JTreport/html/error_gr.html │ │ │ │ │ --rw-r--r-- 0 sbuild (999) sbuild (999) 472 2026-10-08 20:08:03.000000 jtreg-test-output/jdk/0/JTreport/html/error.html │ │ │ │ │ --rw-r--r-- 0 sbuild (999) sbuild (999) 2749 2026-10-08 20:08:03.000000 jtreg-test-output/jdk/0/JTreport/html/failed_gr.html │ │ │ │ │ --rw-r--r-- 0 sbuild (999) sbuild (999) 2019 2026-10-08 20:08:03.000000 jtreg-test-output/jdk/0/JTreport/html/failed.html │ │ │ │ │ --rw-r--r-- 0 sbuild (999) sbuild (999) 1251113 2026-10-08 20:08:03.000000 jtreg-test-output/jdk/0/JTreport/html/passed_gr.html │ │ │ │ │ --rw-r--r-- 0 sbuild (999) sbuild (999) 1249886 2026-10-08 20:08:03.000000 jtreg-test-output/jdk/0/JTreport/html/passed.html │ │ │ │ │ --rw-r--r-- 0 sbuild (999) sbuild (999) 83173 2026-10-08 20:08:03.000000 jtreg-test-output/jdk/0/JTreport/html/excluded.html │ │ │ │ │ --rw-r--r-- 0 sbuild (999) sbuild (999) 4211 2026-10-08 20:08:03.000000 jtreg-test-output/jdk/0/JTreport/html/env.html │ │ │ │ │ --rw-r--r-- 0 sbuild (999) sbuild (999) 23926 2026-10-08 20:08:03.000000 jtreg-test-output/jdk/0/JTreport/html/config.html │ │ │ │ │ --rw-r--r-- 0 sbuild (999) sbuild (999) 307 2026-10-08 20:08:03.000000 jtreg-test-output/jdk/0/JTreport/html/report.css │ │ │ │ │ --rw-r--r-- 0 sbuild (999) sbuild (999) 1124337 2026-10-08 20:08:03.000000 jtreg-test-output/jdk/0/JTreport/html/index.html │ │ │ │ │ --rw-r--r-- 0 sbuild (999) sbuild (999) 1124337 2026-10-08 20:08:03.000000 jtreg-test-output/jdk/0/JTreport/html/report.html │ │ │ │ │ -drwxr-xr-x 0 sbuild (999) sbuild (999) 0 2026-10-08 20:08:03.000000 jtreg-test-output/jdk/0/JTreport/text/ │ │ │ │ │ --rw-r--r-- 0 sbuild (999) sbuild (999) 85819 2026-10-08 20:08:03.000000 jtreg-test-output/jdk/0/JTreport/text/junit.txt │ │ │ │ │ --rw-r--r-- 0 sbuild (999) sbuild (999) 131926 2026-10-08 20:08:03.000000 jtreg-test-output/jdk/0/JTreport/text/testng.txt │ │ │ │ │ --rw-r--r-- 0 sbuild (999) sbuild (999) 26577 2026-10-08 20:08:03.000000 jtreg-test-output/jdk/0/JTreport/text/notRun.txt │ │ │ │ │ --rw-r--r-- 0 sbuild (999) sbuild (999) 173 2026-10-08 20:08:03.000000 jtreg-test-output/jdk/0/JTreport/text/stats.txt │ │ │ │ │ --rw-r--r-- 0 sbuild (999) sbuild (999) 947 2026-10-08 20:08:03.000000 jtreg-test-output/jdk/0/JTreport/text/timeStats.txt │ │ │ │ │ --rw-r--r-- 0 sbuild (999) sbuild (999) 21 2026-10-08 20:08:03.000000 jtreg-test-output/jdk/0/JTreport/text/tc_newfailures.txt │ │ │ │ │ --rw-r--r-- 0 sbuild (999) sbuild (999) 21 2026-10-08 20:08:03.000000 jtreg-test-output/jdk/0/JTreport/text/tc_fail2notrun.txt │ │ │ │ │ --rw-r--r-- 0 sbuild (999) sbuild (999) 20 2026-10-08 20:08:03.000000 jtreg-test-output/jdk/0/JTreport/text/tc_fail2error.txt │ │ │ │ │ --rw-r--r-- 0 sbuild (999) sbuild (999) 19 2026-10-08 20:08:03.000000 jtreg-test-output/jdk/0/JTreport/text/tc_fail2pass.txt │ │ │ │ │ --rw-r--r-- 0 sbuild (999) sbuild (999) 22 2026-10-08 20:08:03.000000 jtreg-test-output/jdk/0/JTreport/text/tc_fail2missing.txt │ │ │ │ │ --rw-r--r-- 0 sbuild (999) sbuild (999) 19 2026-10-08 20:08:03.000000 jtreg-test-output/jdk/0/JTreport/text/other_errors.txt │ │ │ │ │ --rw-r--r-- 0 sbuild (999) sbuild (999) 416 2026-10-08 20:08:03.000000 jtreg-test-output/jdk/0/JTreport/text/newfailures.txt │ │ │ │ │ --rw-r--r-- 0 sbuild (999) sbuild (999) 16 2026-10-08 20:08:03.000000 jtreg-test-output/jdk/0/JTreport/text/fail2fail.txt │ │ │ │ │ --rw-r--r-- 0 sbuild (999) sbuild (999) 18 2026-10-08 20:08:03.000000 jtreg-test-output/jdk/0/JTreport/text/fail2notrun.txt │ │ │ │ │ --rw-r--r-- 0 sbuild (999) sbuild (999) 17 2026-10-08 20:08:03.000000 jtreg-test-output/jdk/0/JTreport/text/faiL2error.txt │ │ │ │ │ --rw-r--r-- 0 sbuild (999) sbuild (999) 16 2026-10-08 20:08:03.000000 jtreg-test-output/jdk/0/JTreport/text/fail2pass.txt │ │ │ │ │ --rw-r--r-- 0 sbuild (999) sbuild (999) 19 2026-10-08 20:08:03.000000 jtreg-test-output/jdk/0/JTreport/text/fail2missing.txt │ │ │ │ │ --rw-r--r-- 0 sbuild (999) sbuild (999) 889810 2026-10-08 20:08:03.000000 jtreg-test-output/jdk/0/JTreport/text/summary.txt │ │ │ │ │ --rw-r--r-- 0 sbuild (999) sbuild (999) 531 2026-10-08 15:45:28.000000 jtreg-test-output/jdk/0/JTreport/text/cmdArgs.txt │ │ │ │ │ -lrwxrwxrwx 0 sbuild (999) sbuild (999) 0 2026-10-08 15:45:24.000000 jtreg-test-output/jaxp/JTreport -> 0/JTreport │ │ │ │ │ -drwxr-xr-x 0 sbuild (999) sbuild (999) 0 2026-10-08 15:45:23.000000 jtreg-test-output/jaxp/0/JTreport/ │ │ │ │ │ --rw-r--r-- 0 sbuild (999) sbuild (999) 714 2026-10-08 15:45:23.000000 jtreg-test-output/jaxp/0/JTreport/index.html │ │ │ │ │ --rw-r--r-- 0 sbuild (999) sbuild (999) 0 2026-10-08 15:45:23.000000 jtreg-test-output/jaxp/0/JTreport/reportdir.dat │ │ │ │ │ -drwxr-xr-x 0 sbuild (999) sbuild (999) 0 2026-10-08 15:45:23.000000 jtreg-test-output/jaxp/0/JTreport/html/ │ │ │ │ │ --rw-r--r-- 0 sbuild (999) sbuild (999) 694 2026-10-08 15:45:23.000000 jtreg-test-output/jaxp/0/JTreport/html/notRun_gr.html │ │ │ │ │ --rw-r--r-- 0 sbuild (999) sbuild (999) 572 2026-10-08 15:45:23.000000 jtreg-test-output/jaxp/0/JTreport/html/notRun.html │ │ │ │ │ --rw-r--r-- 0 sbuild (999) sbuild (999) 520 2026-10-08 15:45:23.000000 jtreg-test-output/jaxp/0/JTreport/html/error_gr.html │ │ │ │ │ --rw-r--r-- 0 sbuild (999) sbuild (999) 472 2026-10-08 15:45:23.000000 jtreg-test-output/jaxp/0/JTreport/html/error.html │ │ │ │ │ --rw-r--r-- 0 sbuild (999) sbuild (999) 512 2026-10-08 15:45:23.000000 jtreg-test-output/jaxp/0/JTreport/html/failed_gr.html │ │ │ │ │ --rw-r--r-- 0 sbuild (999) sbuild (999) 464 2026-10-08 15:45:23.000000 jtreg-test-output/jaxp/0/JTreport/html/failed.html │ │ │ │ │ --rw-r--r-- 0 sbuild (999) sbuild (999) 110061 2026-10-08 15:45:23.000000 jtreg-test-output/jaxp/0/JTreport/html/passed_gr.html │ │ │ │ │ --rw-r--r-- 0 sbuild (999) sbuild (999) 109972 2026-10-08 15:45:22.000000 jtreg-test-output/jaxp/0/JTreport/html/passed.html │ │ │ │ │ --rw-r--r-- 0 sbuild (999) sbuild (999) 3641 2026-10-08 15:45:22.000000 jtreg-test-output/jaxp/0/JTreport/html/excluded.html │ │ │ │ │ --rw-r--r-- 0 sbuild (999) sbuild (999) 4119 2026-10-08 15:45:22.000000 jtreg-test-output/jaxp/0/JTreport/html/env.html │ │ │ │ │ --rw-r--r-- 0 sbuild (999) sbuild (999) 4425 2026-10-08 15:45:22.000000 jtreg-test-output/jaxp/0/JTreport/html/config.html │ │ │ │ │ --rw-r--r-- 0 sbuild (999) sbuild (999) 307 2026-10-08 15:45:22.000000 jtreg-test-output/jaxp/0/JTreport/html/report.css │ │ │ │ │ --rw-r--r-- 0 sbuild (999) sbuild (999) 58501 2026-10-08 15:45:22.000000 jtreg-test-output/jaxp/0/JTreport/html/index.html │ │ │ │ │ --rw-r--r-- 0 sbuild (999) sbuild (999) 58501 2026-10-08 15:45:22.000000 jtreg-test-output/jaxp/0/JTreport/html/report.html │ │ │ │ │ -drwxr-xr-x 0 sbuild (999) sbuild (999) 0 2026-10-08 15:45:23.000000 jtreg-test-output/jaxp/0/JTreport/text/ │ │ │ │ │ --rw-r--r-- 0 sbuild (999) sbuild (999) 200 2026-10-08 15:45:23.000000 jtreg-test-output/jaxp/0/JTreport/text/junit.txt │ │ │ │ │ --rw-r--r-- 0 sbuild (999) sbuild (999) 69461 2026-10-08 15:45:23.000000 jtreg-test-output/jaxp/0/JTreport/text/testng.txt │ │ │ │ │ --rw-r--r-- 0 sbuild (999) sbuild (999) 116 2026-10-08 15:45:23.000000 jtreg-test-output/jaxp/0/JTreport/text/notRun.txt │ │ │ │ │ --rw-r--r-- 0 sbuild (999) sbuild (999) 65 2026-10-08 15:45:23.000000 jtreg-test-output/jaxp/0/JTreport/text/stats.txt │ │ │ │ │ --rw-r--r-- 0 sbuild (999) sbuild (999) 166 2026-10-08 15:45:23.000000 jtreg-test-output/jaxp/0/JTreport/text/timeStats.txt │ │ │ │ │ --rw-r--r-- 0 sbuild (999) sbuild (999) 21 2026-10-08 15:45:23.000000 jtreg-test-output/jaxp/0/JTreport/text/tc_newfailures.txt │ │ │ │ │ --rw-r--r-- 0 sbuild (999) sbuild (999) 21 2026-10-08 15:45:23.000000 jtreg-test-output/jaxp/0/JTreport/text/tc_fail2notrun.txt │ │ │ │ │ --rw-r--r-- 0 sbuild (999) sbuild (999) 20 2026-10-08 15:45:23.000000 jtreg-test-output/jaxp/0/JTreport/text/tc_fail2error.txt │ │ │ │ │ --rw-r--r-- 0 sbuild (999) sbuild (999) 19 2026-10-08 15:45:23.000000 jtreg-test-output/jaxp/0/JTreport/text/tc_fail2pass.txt │ │ │ │ │ --rw-r--r-- 0 sbuild (999) sbuild (999) 22 2026-10-08 15:45:23.000000 jtreg-test-output/jaxp/0/JTreport/text/tc_fail2missing.txt │ │ │ │ │ --rw-r--r-- 0 sbuild (999) sbuild (999) 19 2026-10-08 15:45:23.000000 jtreg-test-output/jaxp/0/JTreport/text/other_errors.txt │ │ │ │ │ --rw-r--r-- 0 sbuild (999) sbuild (999) 18 2026-10-08 15:45:23.000000 jtreg-test-output/jaxp/0/JTreport/text/newfailures.txt │ │ │ │ │ --rw-r--r-- 0 sbuild (999) sbuild (999) 16 2026-10-08 15:45:23.000000 jtreg-test-output/jaxp/0/JTreport/text/fail2fail.txt │ │ │ │ │ --rw-r--r-- 0 sbuild (999) sbuild (999) 18 2026-10-08 15:45:23.000000 jtreg-test-output/jaxp/0/JTreport/text/fail2notrun.txt │ │ │ │ │ --rw-r--r-- 0 sbuild (999) sbuild (999) 17 2026-10-08 15:45:23.000000 jtreg-test-output/jaxp/0/JTreport/text/faiL2error.txt │ │ │ │ │ --rw-r--r-- 0 sbuild (999) sbuild (999) 16 2026-10-08 15:45:23.000000 jtreg-test-output/jaxp/0/JTreport/text/fail2pass.txt │ │ │ │ │ --rw-r--r-- 0 sbuild (999) sbuild (999) 19 2026-10-08 15:45:23.000000 jtreg-test-output/jaxp/0/JTreport/text/fail2missing.txt │ │ │ │ │ --rw-r--r-- 0 sbuild (999) sbuild (999) 59118 2026-10-08 15:45:23.000000 jtreg-test-output/jaxp/0/JTreport/text/summary.txt │ │ │ │ │ --rw-r--r-- 0 sbuild (999) sbuild (999) 439 2026-10-08 15:21:52.000000 jtreg-test-output/jaxp/0/JTreport/text/cmdArgs.txt │ │ │ │ │ -lrwxrwxrwx 0 sbuild (999) sbuild (999) 0 2026-10-08 15:21:51.000000 jtreg-test-output/langtools/JTreport -> 0/JTreport │ │ │ │ │ -drwxr-xr-x 0 sbuild (999) sbuild (999) 0 2026-10-08 15:21:37.000000 jtreg-test-output/langtools/0/JTreport/ │ │ │ │ │ --rw-r--r-- 0 sbuild (999) sbuild (999) 724 2026-10-08 15:21:37.000000 jtreg-test-output/langtools/0/JTreport/index.html │ │ │ │ │ --rw-r--r-- 0 sbuild (999) sbuild (999) 0 2026-10-08 15:21:37.000000 jtreg-test-output/langtools/0/JTreport/reportdir.dat │ │ │ │ │ -drwxr-xr-x 0 sbuild (999) sbuild (999) 0 2026-10-08 15:21:36.000000 jtreg-test-output/langtools/0/JTreport/html/ │ │ │ │ │ --rw-r--r-- 0 sbuild (999) sbuild (999) 2462 2026-10-08 15:21:36.000000 jtreg-test-output/langtools/0/JTreport/html/notRun_gr.html │ │ │ │ │ --rw-r--r-- 0 sbuild (999) sbuild (999) 2173 2026-10-08 15:21:36.000000 jtreg-test-output/langtools/0/JTreport/html/notRun.html │ │ │ │ │ --rw-r--r-- 0 sbuild (999) sbuild (999) 520 2026-10-08 15:21:36.000000 jtreg-test-output/langtools/0/JTreport/html/error_gr.html │ │ │ │ │ --rw-r--r-- 0 sbuild (999) sbuild (999) 472 2026-10-08 15:21:36.000000 jtreg-test-output/langtools/0/JTreport/html/error.html │ │ │ │ │ --rw-r--r-- 0 sbuild (999) sbuild (999) 512 2026-10-08 15:21:36.000000 jtreg-test-output/langtools/0/JTreport/html/failed_gr.html │ │ │ │ │ --rw-r--r-- 0 sbuild (999) sbuild (999) 464 2026-10-08 15:21:36.000000 jtreg-test-output/langtools/0/JTreport/html/failed.html │ │ │ │ │ --rw-r--r-- 0 sbuild (999) sbuild (999) 885491 2026-10-08 15:21:36.000000 jtreg-test-output/langtools/0/JTreport/html/passed_gr.html │ │ │ │ │ --rw-r--r-- 0 sbuild (999) sbuild (999) 885166 2026-10-08 15:21:36.000000 jtreg-test-output/langtools/0/JTreport/html/passed.html │ │ │ │ │ --rw-r--r-- 0 sbuild (999) sbuild (999) 6194 2026-10-08 15:21:36.000000 jtreg-test-output/langtools/0/JTreport/html/excluded.html │ │ │ │ │ --rw-r--r-- 0 sbuild (999) sbuild (999) 4134 2026-10-08 15:21:36.000000 jtreg-test-output/langtools/0/JTreport/html/env.html │ │ │ │ │ --rw-r--r-- 0 sbuild (999) sbuild (999) 10727 2026-10-08 15:21:36.000000 jtreg-test-output/langtools/0/JTreport/html/config.html │ │ │ │ │ --rw-r--r-- 0 sbuild (999) sbuild (999) 307 2026-10-08 15:21:36.000000 jtreg-test-output/langtools/0/JTreport/html/report.css │ │ │ │ │ --rw-r--r-- 0 sbuild (999) sbuild (999) 541946 2026-10-08 15:21:36.000000 jtreg-test-output/langtools/0/JTreport/html/index.html │ │ │ │ │ --rw-r--r-- 0 sbuild (999) sbuild (999) 541946 2026-10-08 15:21:36.000000 jtreg-test-output/langtools/0/JTreport/html/report.html │ │ │ │ │ -drwxr-xr-x 0 sbuild (999) sbuild (999) 0 2026-10-08 15:21:37.000000 jtreg-test-output/langtools/0/JTreport/text/ │ │ │ │ │ --rw-r--r-- 0 sbuild (999) sbuild (999) 18550 2026-10-08 15:21:37.000000 jtreg-test-output/langtools/0/JTreport/text/junit.txt │ │ │ │ │ --rw-r--r-- 0 sbuild (999) sbuild (999) 9538 2026-10-08 15:21:37.000000 jtreg-test-output/langtools/0/JTreport/text/testng.txt │ │ │ │ │ --rw-r--r-- 0 sbuild (999) sbuild (999) 1921 2026-10-08 15:21:37.000000 jtreg-test-output/langtools/0/JTreport/text/notRun.txt │ │ │ │ │ --rw-r--r-- 0 sbuild (999) sbuild (999) 120 2026-10-08 15:21:37.000000 jtreg-test-output/langtools/0/JTreport/text/stats.txt │ │ │ │ │ --rw-r--r-- 0 sbuild (999) sbuild (999) 466 2026-10-08 15:21:37.000000 jtreg-test-output/langtools/0/JTreport/text/timeStats.txt │ │ │ │ │ --rw-r--r-- 0 sbuild (999) sbuild (999) 21 2026-10-08 15:21:37.000000 jtreg-test-output/langtools/0/JTreport/text/tc_newfailures.txt │ │ │ │ │ --rw-r--r-- 0 sbuild (999) sbuild (999) 21 2026-10-08 15:21:37.000000 jtreg-test-output/langtools/0/JTreport/text/tc_fail2notrun.txt │ │ │ │ │ --rw-r--r-- 0 sbuild (999) sbuild (999) 20 2026-10-08 15:21:37.000000 jtreg-test-output/langtools/0/JTreport/text/tc_fail2error.txt │ │ │ │ │ --rw-r--r-- 0 sbuild (999) sbuild (999) 19 2026-10-08 15:21:37.000000 jtreg-test-output/langtools/0/JTreport/text/tc_fail2pass.txt │ │ │ │ │ --rw-r--r-- 0 sbuild (999) sbuild (999) 22 2026-10-08 15:21:37.000000 jtreg-test-output/langtools/0/JTreport/text/tc_fail2missing.txt │ │ │ │ │ --rw-r--r-- 0 sbuild (999) sbuild (999) 19 2026-10-08 15:21:37.000000 jtreg-test-output/langtools/0/JTreport/text/other_errors.txt │ │ │ │ │ --rw-r--r-- 0 sbuild (999) sbuild (999) 18 2026-10-08 15:21:37.000000 jtreg-test-output/langtools/0/JTreport/text/newfailures.txt │ │ │ │ │ --rw-r--r-- 0 sbuild (999) sbuild (999) 16 2026-10-08 15:21:37.000000 jtreg-test-output/langtools/0/JTreport/text/fail2fail.txt │ │ │ │ │ --rw-r--r-- 0 sbuild (999) sbuild (999) 18 2026-10-08 15:21:37.000000 jtreg-test-output/langtools/0/JTreport/text/fail2notrun.txt │ │ │ │ │ --rw-r--r-- 0 sbuild (999) sbuild (999) 17 2026-10-08 15:21:37.000000 jtreg-test-output/langtools/0/JTreport/text/faiL2error.txt │ │ │ │ │ --rw-r--r-- 0 sbuild (999) sbuild (999) 16 2026-10-08 15:21:37.000000 jtreg-test-output/langtools/0/JTreport/text/fail2pass.txt │ │ │ │ │ --rw-r--r-- 0 sbuild (999) sbuild (999) 19 2026-10-08 15:21:37.000000 jtreg-test-output/langtools/0/JTreport/text/fail2missing.txt │ │ │ │ │ --rw-r--r-- 0 sbuild (999) sbuild (999) 643622 2026-10-08 15:21:37.000000 jtreg-test-output/langtools/0/JTreport/text/summary.txt │ │ │ │ │ --rw-r--r-- 0 sbuild (999) sbuild (999) 454 2026-10-08 14:36:00.000000 jtreg-test-output/langtools/0/JTreport/text/cmdArgs.txt │ │ │ │ │ -lrwxrwxrwx 0 sbuild (999) sbuild (999) 0 2026-10-08 14:35:59.000000 jtreg-test-output/hotspot/JTreport -> 0/JTreport │ │ │ │ │ -drwxr-xr-x 0 sbuild (999) sbuild (999) 0 2026-10-08 14:35:49.000000 jtreg-test-output/hotspot/0/JTreport/ │ │ │ │ │ --rw-r--r-- 0 sbuild (999) sbuild (999) 726 2026-10-08 14:35:49.000000 jtreg-test-output/hotspot/0/JTreport/index.html │ │ │ │ │ --rw-r--r-- 0 sbuild (999) sbuild (999) 0 2026-10-08 14:35:49.000000 jtreg-test-output/hotspot/0/JTreport/reportdir.dat │ │ │ │ │ -drwxr-xr-x 0 sbuild (999) sbuild (999) 0 2026-10-08 14:35:48.000000 jtreg-test-output/hotspot/0/JTreport/html/ │ │ │ │ │ --rw-r--r-- 0 sbuild (999) sbuild (999) 35826 2026-10-08 14:35:48.000000 jtreg-test-output/hotspot/0/JTreport/html/notRun_gr.html │ │ │ │ │ --rw-r--r-- 0 sbuild (999) sbuild (999) 35537 2026-10-08 14:35:48.000000 jtreg-test-output/hotspot/0/JTreport/html/notRun.html │ │ │ │ │ --rw-r--r-- 0 sbuild (999) sbuild (999) 520 2026-10-08 14:35:48.000000 jtreg-test-output/hotspot/0/JTreport/html/error_gr.html │ │ │ │ │ --rw-r--r-- 0 sbuild (999) sbuild (999) 472 2026-10-08 14:35:48.000000 jtreg-test-output/hotspot/0/JTreport/html/error.html │ │ │ │ │ --rw-r--r-- 0 sbuild (999) sbuild (999) 512 2026-10-08 14:35:48.000000 jtreg-test-output/hotspot/0/JTreport/html/failed_gr.html │ │ │ │ │ --rw-r--r-- 0 sbuild (999) sbuild (999) 464 2026-10-08 14:35:48.000000 jtreg-test-output/hotspot/0/JTreport/html/failed.html │ │ │ │ │ --rw-r--r-- 0 sbuild (999) sbuild (999) 635540 2026-10-08 14:35:48.000000 jtreg-test-output/hotspot/0/JTreport/html/passed_gr.html │ │ │ │ │ --rw-r--r-- 0 sbuild (999) sbuild (999) 635111 2026-10-08 14:35:48.000000 jtreg-test-output/hotspot/0/JTreport/html/passed.html │ │ │ │ │ --rw-r--r-- 0 sbuild (999) sbuild (999) 18323 2026-10-08 14:35:48.000000 jtreg-test-output/hotspot/0/JTreport/html/excluded.html │ │ │ │ │ --rw-r--r-- 0 sbuild (999) sbuild (999) 4233 2026-10-08 14:35:48.000000 jtreg-test-output/hotspot/0/JTreport/html/env.html │ │ │ │ │ --rw-r--r-- 0 sbuild (999) sbuild (999) 78259 2026-10-08 14:35:48.000000 jtreg-test-output/hotspot/0/JTreport/html/config.html │ │ │ │ │ --rw-r--r-- 0 sbuild (999) sbuild (999) 307 2026-10-08 14:35:48.000000 jtreg-test-output/hotspot/0/JTreport/html/report.css │ │ │ │ │ --rw-r--r-- 0 sbuild (999) sbuild (999) 529199 2026-10-08 14:35:48.000000 jtreg-test-output/hotspot/0/JTreport/html/index.html │ │ │ │ │ --rw-r--r-- 0 sbuild (999) sbuild (999) 529199 2026-10-08 14:35:48.000000 jtreg-test-output/hotspot/0/JTreport/html/report.html │ │ │ │ │ -drwxr-xr-x 0 sbuild (999) sbuild (999) 0 2026-10-08 14:35:49.000000 jtreg-test-output/hotspot/0/JTreport/text/ │ │ │ │ │ --rw-r--r-- 0 sbuild (999) sbuild (999) 9713 2026-10-08 14:35:49.000000 jtreg-test-output/hotspot/0/JTreport/text/junit.txt │ │ │ │ │ --rw-r--r-- 0 sbuild (999) sbuild (999) 9190 2026-10-08 14:35:49.000000 jtreg-test-output/hotspot/0/JTreport/text/testng.txt │ │ │ │ │ --rw-r--r-- 0 sbuild (999) sbuild (999) 47247 2026-10-08 14:35:49.000000 jtreg-test-output/hotspot/0/JTreport/text/notRun.txt │ │ │ │ │ --rw-r--r-- 0 sbuild (999) sbuild (999) 123 2026-10-08 14:35:49.000000 jtreg-test-output/hotspot/0/JTreport/text/stats.txt │ │ │ │ │ --rw-r--r-- 0 sbuild (999) sbuild (999) 850 2026-10-08 14:35:49.000000 jtreg-test-output/hotspot/0/JTreport/text/timeStats.txt │ │ │ │ │ --rw-r--r-- 0 sbuild (999) sbuild (999) 21 2026-10-08 14:35:49.000000 jtreg-test-output/hotspot/0/JTreport/text/tc_newfailures.txt │ │ │ │ │ --rw-r--r-- 0 sbuild (999) sbuild (999) 21 2026-10-08 14:35:49.000000 jtreg-test-output/hotspot/0/JTreport/text/tc_fail2notrun.txt │ │ │ │ │ --rw-r--r-- 0 sbuild (999) sbuild (999) 20 2026-10-08 14:35:49.000000 jtreg-test-output/hotspot/0/JTreport/text/tc_fail2error.txt │ │ │ │ │ --rw-r--r-- 0 sbuild (999) sbuild (999) 19 2026-10-08 14:35:49.000000 jtreg-test-output/hotspot/0/JTreport/text/tc_fail2pass.txt │ │ │ │ │ --rw-r--r-- 0 sbuild (999) sbuild (999) 22 2026-10-08 14:35:49.000000 jtreg-test-output/hotspot/0/JTreport/text/tc_fail2missing.txt │ │ │ │ │ --rw-r--r-- 0 sbuild (999) sbuild (999) 19 2026-10-08 14:35:49.000000 jtreg-test-output/hotspot/0/JTreport/text/other_errors.txt │ │ │ │ │ --rw-r--r-- 0 sbuild (999) sbuild (999) 18 2026-10-08 14:35:49.000000 jtreg-test-output/hotspot/0/JTreport/text/newfailures.txt │ │ │ │ │ --rw-r--r-- 0 sbuild (999) sbuild (999) 16 2026-10-08 14:35:49.000000 jtreg-test-output/hotspot/0/JTreport/text/fail2fail.txt │ │ │ │ │ --rw-r--r-- 0 sbuild (999) sbuild (999) 18 2026-10-08 14:35:49.000000 jtreg-test-output/hotspot/0/JTreport/text/fail2notrun.txt │ │ │ │ │ --rw-r--r-- 0 sbuild (999) sbuild (999) 17 2026-10-08 14:35:49.000000 jtreg-test-output/hotspot/0/JTreport/text/faiL2error.txt │ │ │ │ │ --rw-r--r-- 0 sbuild (999) sbuild (999) 16 2026-10-08 14:35:49.000000 jtreg-test-output/hotspot/0/JTreport/text/fail2pass.txt │ │ │ │ │ --rw-r--r-- 0 sbuild (999) sbuild (999) 19 2026-10-08 14:35:49.000000 jtreg-test-output/hotspot/0/JTreport/text/fail2missing.txt │ │ │ │ │ --rw-r--r-- 0 sbuild (999) sbuild (999) 478747 2026-10-08 14:35:49.000000 jtreg-test-output/hotspot/0/JTreport/text/summary.txt │ │ │ │ │ --rw-r--r-- 0 sbuild (999) sbuild (999) 553 2026-10-08 11:16:27.000000 jtreg-test-output/hotspot/0/JTreport/text/cmdArgs.txt │ │ │ │ │ +drwxr-xr-x 0 sbuild (999) sbuild (999) 0 2026-10-10 00:11:18.000000 jtreg-test-output/jdk/2/JTreport/ │ │ │ │ │ +-rw-r--r-- 0 sbuild (999) sbuild (999) 712 2026-10-10 00:11:18.000000 jtreg-test-output/jdk/2/JTreport/index.html │ │ │ │ │ +drwxr-xr-x 0 sbuild (999) sbuild (999) 0 2026-10-10 00:11:17.000000 jtreg-test-output/jdk/2/JTreport/html/ │ │ │ │ │ +-rw-r--r-- 0 sbuild (999) sbuild (999) 1250214 2026-10-10 00:11:17.000000 jtreg-test-output/jdk/2/JTreport/html/passed.html │ │ │ │ │ +-rw-r--r-- 0 sbuild (999) sbuild (999) 24358 2026-10-10 00:11:17.000000 jtreg-test-output/jdk/2/JTreport/html/config.html │ │ │ │ │ +-rw-r--r-- 0 sbuild (999) sbuild (999) 2021 2026-10-10 00:11:17.000000 jtreg-test-output/jdk/2/JTreport/html/failed.html │ │ │ │ │ +-rw-r--r-- 0 sbuild (999) sbuild (999) 1101686 2026-10-10 00:11:17.000000 jtreg-test-output/jdk/2/JTreport/html/index.html │ │ │ │ │ +-rw-r--r-- 0 sbuild (999) sbuild (999) 4232 2026-10-10 00:11:17.000000 jtreg-test-output/jdk/2/JTreport/html/env.html │ │ │ │ │ +-rw-r--r-- 0 sbuild (999) sbuild (999) 474 2026-10-10 00:11:17.000000 jtreg-test-output/jdk/2/JTreport/html/error.html │ │ │ │ │ +-rw-r--r-- 0 sbuild (999) sbuild (999) 307 2026-10-10 00:11:17.000000 jtreg-test-output/jdk/2/JTreport/html/report.css │ │ │ │ │ +-rw-r--r-- 0 sbuild (999) sbuild (999) 2751 2026-10-10 00:11:17.000000 jtreg-test-output/jdk/2/JTreport/html/failed_gr.html │ │ │ │ │ +-rw-r--r-- 0 sbuild (999) sbuild (999) 522 2026-10-10 00:11:17.000000 jtreg-test-output/jdk/2/JTreport/html/error_gr.html │ │ │ │ │ +-rw-r--r-- 0 sbuild (999) sbuild (999) 762367 2026-10-10 00:11:17.000000 jtreg-test-output/jdk/2/JTreport/html/notRun.html │ │ │ │ │ +-rw-r--r-- 0 sbuild (999) sbuild (999) 1251564 2026-10-10 00:11:17.000000 jtreg-test-output/jdk/2/JTreport/html/passed_gr.html │ │ │ │ │ +-rw-r--r-- 0 sbuild (999) sbuild (999) 1101686 2026-10-10 00:11:17.000000 jtreg-test-output/jdk/2/JTreport/html/report.html │ │ │ │ │ +-rw-r--r-- 0 sbuild (999) sbuild (999) 83175 2026-10-10 00:11:17.000000 jtreg-test-output/jdk/2/JTreport/html/excluded.html │ │ │ │ │ +-rw-r--r-- 0 sbuild (999) sbuild (999) 762640 2026-10-10 00:11:18.000000 jtreg-test-output/jdk/2/JTreport/html/notRun_gr.html │ │ │ │ │ +-rw-r--r-- 0 sbuild (999) sbuild (999) 0 2026-10-10 00:11:18.000000 jtreg-test-output/jdk/2/JTreport/reportdir.dat │ │ │ │ │ +drwxr-xr-x 0 sbuild (999) sbuild (999) 0 2026-10-10 00:11:18.000000 jtreg-test-output/jdk/2/JTreport/text/ │ │ │ │ │ +-rw-r--r-- 0 sbuild (999) sbuild (999) 116 2026-10-10 00:11:18.000000 jtreg-test-output/jdk/2/JTreport/text/timeStats.txt │ │ │ │ │ +-rw-r--r-- 0 sbuild (999) sbuild (999) 16 2026-10-10 00:11:18.000000 jtreg-test-output/jdk/2/JTreport/text/fail2pass.txt │ │ │ │ │ +-rw-r--r-- 0 sbuild (999) sbuild (999) 19 2026-10-10 00:11:18.000000 jtreg-test-output/jdk/2/JTreport/text/tc_fail2pass.txt │ │ │ │ │ +-rw-r--r-- 0 sbuild (999) sbuild (999) 19 2026-10-10 00:11:18.000000 jtreg-test-output/jdk/2/JTreport/text/fail2missing.txt │ │ │ │ │ +-rw-r--r-- 0 sbuild (999) sbuild (999) 1023408 2026-10-10 00:11:18.000000 jtreg-test-output/jdk/2/JTreport/text/notRun.txt │ │ │ │ │ +-rw-r--r-- 0 sbuild (999) sbuild (999) 17 2026-10-10 00:11:18.000000 jtreg-test-output/jdk/2/JTreport/text/faiL2error.txt │ │ │ │ │ +-rw-r--r-- 0 sbuild (999) sbuild (999) 20 2026-10-10 00:11:18.000000 jtreg-test-output/jdk/2/JTreport/text/tc_fail2error.txt │ │ │ │ │ +-rw-r--r-- 0 sbuild (999) sbuild (999) 101 2026-10-10 00:11:18.000000 jtreg-test-output/jdk/2/JTreport/text/stats.txt │ │ │ │ │ +-rw-r--r-- 0 sbuild (999) sbuild (999) 16 2026-10-10 00:11:18.000000 jtreg-test-output/jdk/2/JTreport/text/fail2fail.txt │ │ │ │ │ +-rw-r--r-- 0 sbuild (999) sbuild (999) 22 2026-10-10 00:11:18.000000 jtreg-test-output/jdk/2/JTreport/text/tc_fail2missing.txt │ │ │ │ │ +-rw-r--r-- 0 sbuild (999) sbuild (999) 550 2026-10-10 00:11:05.000000 jtreg-test-output/jdk/2/JTreport/text/cmdArgs.txt │ │ │ │ │ +-rw-r--r-- 0 sbuild (999) sbuild (999) 21 2026-10-10 00:11:18.000000 jtreg-test-output/jdk/2/JTreport/text/tc_fail2notrun.txt │ │ │ │ │ +-rw-r--r-- 0 sbuild (999) sbuild (999) 416 2026-10-10 00:11:18.000000 jtreg-test-output/jdk/2/JTreport/text/newfailures.txt │ │ │ │ │ +-rw-r--r-- 0 sbuild (999) sbuild (999) 890205 2026-10-10 00:11:18.000000 jtreg-test-output/jdk/2/JTreport/text/summary.txt │ │ │ │ │ +-rw-r--r-- 0 sbuild (999) sbuild (999) 18 2026-10-10 00:11:18.000000 jtreg-test-output/jdk/2/JTreport/text/fail2notrun.txt │ │ │ │ │ +-rw-r--r-- 0 sbuild (999) sbuild (999) 21 2026-10-10 00:11:18.000000 jtreg-test-output/jdk/2/JTreport/text/tc_newfailures.txt │ │ │ │ │ +-rw-r--r-- 0 sbuild (999) sbuild (999) 132 2026-10-10 00:11:18.000000 jtreg-test-output/jdk/2/JTreport/text/testng.txt │ │ │ │ │ +-rw-r--r-- 0 sbuild (999) sbuild (999) 19 2026-10-10 00:11:18.000000 jtreg-test-output/jdk/2/JTreport/text/other_errors.txt │ │ │ │ │ +drwxr-xr-x 0 sbuild (999) sbuild (999) 0 2026-10-10 00:10:54.000000 jtreg-test-output/jdk/1/JTreport/ │ │ │ │ │ +-rw-r--r-- 0 sbuild (999) sbuild (999) 712 2026-10-10 00:10:54.000000 jtreg-test-output/jdk/1/JTreport/index.html │ │ │ │ │ +drwxr-xr-x 0 sbuild (999) sbuild (999) 0 2026-10-10 00:10:54.000000 jtreg-test-output/jdk/1/JTreport/html/ │ │ │ │ │ +-rw-r--r-- 0 sbuild (999) sbuild (999) 1250214 2026-10-10 00:10:54.000000 jtreg-test-output/jdk/1/JTreport/html/passed.html │ │ │ │ │ +-rw-r--r-- 0 sbuild (999) sbuild (999) 24358 2026-10-10 00:10:54.000000 jtreg-test-output/jdk/1/JTreport/html/config.html │ │ │ │ │ +-rw-r--r-- 0 sbuild (999) sbuild (999) 2021 2026-10-10 00:10:54.000000 jtreg-test-output/jdk/1/JTreport/html/failed.html │ │ │ │ │ +-rw-r--r-- 0 sbuild (999) sbuild (999) 1101686 2026-10-10 00:10:54.000000 jtreg-test-output/jdk/1/JTreport/html/index.html │ │ │ │ │ +-rw-r--r-- 0 sbuild (999) sbuild (999) 4232 2026-10-10 00:10:54.000000 jtreg-test-output/jdk/1/JTreport/html/env.html │ │ │ │ │ +-rw-r--r-- 0 sbuild (999) sbuild (999) 474 2026-10-10 00:10:54.000000 jtreg-test-output/jdk/1/JTreport/html/error.html │ │ │ │ │ +-rw-r--r-- 0 sbuild (999) sbuild (999) 307 2026-10-10 00:10:53.000000 jtreg-test-output/jdk/1/JTreport/html/report.css │ │ │ │ │ +-rw-r--r-- 0 sbuild (999) sbuild (999) 2751 2026-10-10 00:10:54.000000 jtreg-test-output/jdk/1/JTreport/html/failed_gr.html │ │ │ │ │ +-rw-r--r-- 0 sbuild (999) sbuild (999) 522 2026-10-10 00:10:54.000000 jtreg-test-output/jdk/1/JTreport/html/error_gr.html │ │ │ │ │ +-rw-r--r-- 0 sbuild (999) sbuild (999) 762367 2026-10-10 00:10:54.000000 jtreg-test-output/jdk/1/JTreport/html/notRun.html │ │ │ │ │ +-rw-r--r-- 0 sbuild (999) sbuild (999) 1251564 2026-10-10 00:10:54.000000 jtreg-test-output/jdk/1/JTreport/html/passed_gr.html │ │ │ │ │ +-rw-r--r-- 0 sbuild (999) sbuild (999) 1101686 2026-10-10 00:10:54.000000 jtreg-test-output/jdk/1/JTreport/html/report.html │ │ │ │ │ +-rw-r--r-- 0 sbuild (999) sbuild (999) 83175 2026-10-10 00:10:54.000000 jtreg-test-output/jdk/1/JTreport/html/excluded.html │ │ │ │ │ +-rw-r--r-- 0 sbuild (999) sbuild (999) 762640 2026-10-10 00:10:54.000000 jtreg-test-output/jdk/1/JTreport/html/notRun_gr.html │ │ │ │ │ +-rw-r--r-- 0 sbuild (999) sbuild (999) 0 2026-10-10 00:10:54.000000 jtreg-test-output/jdk/1/JTreport/reportdir.dat │ │ │ │ │ +drwxr-xr-x 0 sbuild (999) sbuild (999) 0 2026-10-10 00:10:54.000000 jtreg-test-output/jdk/1/JTreport/text/ │ │ │ │ │ +-rw-r--r-- 0 sbuild (999) sbuild (999) 116 2026-10-10 00:10:54.000000 jtreg-test-output/jdk/1/JTreport/text/timeStats.txt │ │ │ │ │ +-rw-r--r-- 0 sbuild (999) sbuild (999) 16 2026-10-10 00:10:54.000000 jtreg-test-output/jdk/1/JTreport/text/fail2pass.txt │ │ │ │ │ +-rw-r--r-- 0 sbuild (999) sbuild (999) 19 2026-10-10 00:10:54.000000 jtreg-test-output/jdk/1/JTreport/text/tc_fail2pass.txt │ │ │ │ │ +-rw-r--r-- 0 sbuild (999) sbuild (999) 19 2026-10-10 00:10:54.000000 jtreg-test-output/jdk/1/JTreport/text/fail2missing.txt │ │ │ │ │ +-rw-r--r-- 0 sbuild (999) sbuild (999) 1023408 2026-10-10 00:10:54.000000 jtreg-test-output/jdk/1/JTreport/text/notRun.txt │ │ │ │ │ +-rw-r--r-- 0 sbuild (999) sbuild (999) 17 2026-10-10 00:10:54.000000 jtreg-test-output/jdk/1/JTreport/text/faiL2error.txt │ │ │ │ │ +-rw-r--r-- 0 sbuild (999) sbuild (999) 20 2026-10-10 00:10:54.000000 jtreg-test-output/jdk/1/JTreport/text/tc_fail2error.txt │ │ │ │ │ +-rw-r--r-- 0 sbuild (999) sbuild (999) 101 2026-10-10 00:10:54.000000 jtreg-test-output/jdk/1/JTreport/text/stats.txt │ │ │ │ │ +-rw-r--r-- 0 sbuild (999) sbuild (999) 16 2026-10-10 00:10:54.000000 jtreg-test-output/jdk/1/JTreport/text/fail2fail.txt │ │ │ │ │ +-rw-r--r-- 0 sbuild (999) sbuild (999) 22 2026-10-10 00:10:54.000000 jtreg-test-output/jdk/1/JTreport/text/tc_fail2missing.txt │ │ │ │ │ +-rw-r--r-- 0 sbuild (999) sbuild (999) 550 2026-10-10 00:10:39.000000 jtreg-test-output/jdk/1/JTreport/text/cmdArgs.txt │ │ │ │ │ +-rw-r--r-- 0 sbuild (999) sbuild (999) 21 2026-10-10 00:10:54.000000 jtreg-test-output/jdk/1/JTreport/text/tc_fail2notrun.txt │ │ │ │ │ +-rw-r--r-- 0 sbuild (999) sbuild (999) 416 2026-10-10 00:10:54.000000 jtreg-test-output/jdk/1/JTreport/text/newfailures.txt │ │ │ │ │ +-rw-r--r-- 0 sbuild (999) sbuild (999) 890205 2026-10-10 00:10:54.000000 jtreg-test-output/jdk/1/JTreport/text/summary.txt │ │ │ │ │ +-rw-r--r-- 0 sbuild (999) sbuild (999) 18 2026-10-10 00:10:54.000000 jtreg-test-output/jdk/1/JTreport/text/fail2notrun.txt │ │ │ │ │ +-rw-r--r-- 0 sbuild (999) sbuild (999) 21 2026-10-10 00:10:54.000000 jtreg-test-output/jdk/1/JTreport/text/tc_newfailures.txt │ │ │ │ │ +-rw-r--r-- 0 sbuild (999) sbuild (999) 132 2026-10-10 00:10:54.000000 jtreg-test-output/jdk/1/JTreport/text/testng.txt │ │ │ │ │ +-rw-r--r-- 0 sbuild (999) sbuild (999) 19 2026-10-10 00:10:54.000000 jtreg-test-output/jdk/1/JTreport/text/other_errors.txt │ │ │ │ │ +drwxr-xr-x 0 sbuild (999) sbuild (999) 0 2026-10-10 00:10:26.000000 jtreg-test-output/jdk/0/JTreport/ │ │ │ │ │ +-rw-r--r-- 0 sbuild (999) sbuild (999) 712 2026-10-10 00:10:26.000000 jtreg-test-output/jdk/0/JTreport/index.html │ │ │ │ │ +drwxr-xr-x 0 sbuild (999) sbuild (999) 0 2026-10-10 00:10:26.000000 jtreg-test-output/jdk/0/JTreport/html/ │ │ │ │ │ +-rw-r--r-- 0 sbuild (999) sbuild (999) 1250214 2026-10-10 00:10:26.000000 jtreg-test-output/jdk/0/JTreport/html/passed.html │ │ │ │ │ +-rw-r--r-- 0 sbuild (999) sbuild (999) 23926 2026-10-10 00:10:26.000000 jtreg-test-output/jdk/0/JTreport/html/config.html │ │ │ │ │ +-rw-r--r-- 0 sbuild (999) sbuild (999) 2021 2026-10-10 00:10:26.000000 jtreg-test-output/jdk/0/JTreport/html/failed.html │ │ │ │ │ +-rw-r--r-- 0 sbuild (999) sbuild (999) 1124339 2026-10-10 00:10:26.000000 jtreg-test-output/jdk/0/JTreport/html/index.html │ │ │ │ │ +-rw-r--r-- 0 sbuild (999) sbuild (999) 4213 2026-10-10 00:10:26.000000 jtreg-test-output/jdk/0/JTreport/html/env.html │ │ │ │ │ +-rw-r--r-- 0 sbuild (999) sbuild (999) 474 2026-10-10 00:10:26.000000 jtreg-test-output/jdk/0/JTreport/html/error.html │ │ │ │ │ +-rw-r--r-- 0 sbuild (999) sbuild (999) 307 2026-10-10 00:10:26.000000 jtreg-test-output/jdk/0/JTreport/html/report.css │ │ │ │ │ +-rw-r--r-- 0 sbuild (999) sbuild (999) 2751 2026-10-10 00:10:26.000000 jtreg-test-output/jdk/0/JTreport/html/failed_gr.html │ │ │ │ │ +-rw-r--r-- 0 sbuild (999) sbuild (999) 522 2026-10-10 00:10:26.000000 jtreg-test-output/jdk/0/JTreport/html/error_gr.html │ │ │ │ │ +-rw-r--r-- 0 sbuild (999) sbuild (999) 20340 2026-10-10 00:10:26.000000 jtreg-test-output/jdk/0/JTreport/html/notRun.html │ │ │ │ │ +-rw-r--r-- 0 sbuild (999) sbuild (999) 1251564 2026-10-10 00:10:26.000000 jtreg-test-output/jdk/0/JTreport/html/passed_gr.html │ │ │ │ │ +-rw-r--r-- 0 sbuild (999) sbuild (999) 1124339 2026-10-10 00:10:26.000000 jtreg-test-output/jdk/0/JTreport/html/report.html │ │ │ │ │ +-rw-r--r-- 0 sbuild (999) sbuild (999) 83175 2026-10-10 00:10:26.000000 jtreg-test-output/jdk/0/JTreport/html/excluded.html │ │ │ │ │ +-rw-r--r-- 0 sbuild (999) sbuild (999) 20685 2026-10-10 00:10:26.000000 jtreg-test-output/jdk/0/JTreport/html/notRun_gr.html │ │ │ │ │ +-rw-r--r-- 0 sbuild (999) sbuild (999) 0 2026-10-10 00:10:26.000000 jtreg-test-output/jdk/0/JTreport/reportdir.dat │ │ │ │ │ +drwxr-xr-x 0 sbuild (999) sbuild (999) 0 2026-10-10 00:10:26.000000 jtreg-test-output/jdk/0/JTreport/text/ │ │ │ │ │ +-rw-r--r-- 0 sbuild (999) sbuild (999) 911 2026-10-10 00:10:26.000000 jtreg-test-output/jdk/0/JTreport/text/timeStats.txt │ │ │ │ │ +-rw-r--r-- 0 sbuild (999) sbuild (999) 16 2026-10-10 00:10:26.000000 jtreg-test-output/jdk/0/JTreport/text/fail2pass.txt │ │ │ │ │ +-rw-r--r-- 0 sbuild (999) sbuild (999) 19 2026-10-10 00:10:26.000000 jtreg-test-output/jdk/0/JTreport/text/tc_fail2pass.txt │ │ │ │ │ +-rw-r--r-- 0 sbuild (999) sbuild (999) 19 2026-10-10 00:10:26.000000 jtreg-test-output/jdk/0/JTreport/text/fail2missing.txt │ │ │ │ │ +-rw-r--r-- 0 sbuild (999) sbuild (999) 26283 2026-10-10 00:10:26.000000 jtreg-test-output/jdk/0/JTreport/text/notRun.txt │ │ │ │ │ +-rw-r--r-- 0 sbuild (999) sbuild (999) 17 2026-10-10 00:10:26.000000 jtreg-test-output/jdk/0/JTreport/text/faiL2error.txt │ │ │ │ │ +-rw-r--r-- 0 sbuild (999) sbuild (999) 20 2026-10-10 00:10:26.000000 jtreg-test-output/jdk/0/JTreport/text/tc_fail2error.txt │ │ │ │ │ +-rw-r--r-- 0 sbuild (999) sbuild (999) 172 2026-10-10 00:10:26.000000 jtreg-test-output/jdk/0/JTreport/text/stats.txt │ │ │ │ │ +-rw-r--r-- 0 sbuild (999) sbuild (999) 16 2026-10-10 00:10:26.000000 jtreg-test-output/jdk/0/JTreport/text/fail2fail.txt │ │ │ │ │ +-rw-r--r-- 0 sbuild (999) sbuild (999) 22 2026-10-10 00:10:26.000000 jtreg-test-output/jdk/0/JTreport/text/tc_fail2missing.txt │ │ │ │ │ +-rw-r--r-- 0 sbuild (999) sbuild (999) 531 2026-10-09 20:25:24.000000 jtreg-test-output/jdk/0/JTreport/text/cmdArgs.txt │ │ │ │ │ +-rw-r--r-- 0 sbuild (999) sbuild (999) 21 2026-10-10 00:10:26.000000 jtreg-test-output/jdk/0/JTreport/text/tc_fail2notrun.txt │ │ │ │ │ +-rw-r--r-- 0 sbuild (999) sbuild (999) 416 2026-10-10 00:10:26.000000 jtreg-test-output/jdk/0/JTreport/text/newfailures.txt │ │ │ │ │ +-rw-r--r-- 0 sbuild (999) sbuild (999) 890205 2026-10-10 00:10:26.000000 jtreg-test-output/jdk/0/JTreport/text/summary.txt │ │ │ │ │ +-rw-r--r-- 0 sbuild (999) sbuild (999) 18 2026-10-10 00:10:26.000000 jtreg-test-output/jdk/0/JTreport/text/fail2notrun.txt │ │ │ │ │ +-rw-r--r-- 0 sbuild (999) sbuild (999) 21 2026-10-10 00:10:26.000000 jtreg-test-output/jdk/0/JTreport/text/tc_newfailures.txt │ │ │ │ │ +-rw-r--r-- 0 sbuild (999) sbuild (999) 132051 2026-10-10 00:10:26.000000 jtreg-test-output/jdk/0/JTreport/text/testng.txt │ │ │ │ │ +-rw-r--r-- 0 sbuild (999) sbuild (999) 85819 2026-10-10 00:10:26.000000 jtreg-test-output/jdk/0/JTreport/text/junit.txt │ │ │ │ │ +-rw-r--r-- 0 sbuild (999) sbuild (999) 19 2026-10-10 00:10:26.000000 jtreg-test-output/jdk/0/JTreport/text/other_errors.txt │ │ │ │ │ +lrwxrwxrwx 0 sbuild (999) sbuild (999) 0 2026-10-10 00:11:28.000000 jtreg-test-output/jdk/JTreport -> 2/JTreport │ │ │ │ │ +drwxr-xr-x 0 sbuild (999) sbuild (999) 0 2026-10-09 19:30:24.000000 jtreg-test-output/hotspot/0/JTreport/ │ │ │ │ │ +-rw-r--r-- 0 sbuild (999) sbuild (999) 726 2026-10-09 19:30:24.000000 jtreg-test-output/hotspot/0/JTreport/index.html │ │ │ │ │ +drwxr-xr-x 0 sbuild (999) sbuild (999) 0 2026-10-09 19:30:24.000000 jtreg-test-output/hotspot/0/JTreport/html/ │ │ │ │ │ +-rw-r--r-- 0 sbuild (999) sbuild (999) 638492 2026-10-09 19:30:24.000000 jtreg-test-output/hotspot/0/JTreport/html/passed.html │ │ │ │ │ +-rw-r--r-- 0 sbuild (999) sbuild (999) 78259 2026-10-09 19:30:23.000000 jtreg-test-output/hotspot/0/JTreport/html/config.html │ │ │ │ │ +-rw-r--r-- 0 sbuild (999) sbuild (999) 464 2026-10-09 19:30:24.000000 jtreg-test-output/hotspot/0/JTreport/html/failed.html │ │ │ │ │ +-rw-r--r-- 0 sbuild (999) sbuild (999) 529209 2026-10-09 19:30:23.000000 jtreg-test-output/hotspot/0/JTreport/html/index.html │ │ │ │ │ +-rw-r--r-- 0 sbuild (999) sbuild (999) 4233 2026-10-09 19:30:23.000000 jtreg-test-output/hotspot/0/JTreport/html/env.html │ │ │ │ │ +-rw-r--r-- 0 sbuild (999) sbuild (999) 472 2026-10-09 19:30:24.000000 jtreg-test-output/hotspot/0/JTreport/html/error.html │ │ │ │ │ +-rw-r--r-- 0 sbuild (999) sbuild (999) 307 2026-10-09 19:30:22.000000 jtreg-test-output/hotspot/0/JTreport/html/report.css │ │ │ │ │ +-rw-r--r-- 0 sbuild (999) sbuild (999) 512 2026-10-09 19:30:24.000000 jtreg-test-output/hotspot/0/JTreport/html/failed_gr.html │ │ │ │ │ +-rw-r--r-- 0 sbuild (999) sbuild (999) 520 2026-10-09 19:30:24.000000 jtreg-test-output/hotspot/0/JTreport/html/error_gr.html │ │ │ │ │ +-rw-r--r-- 0 sbuild (999) sbuild (999) 33593 2026-10-09 19:30:24.000000 jtreg-test-output/hotspot/0/JTreport/html/notRun.html │ │ │ │ │ +-rw-r--r-- 0 sbuild (999) sbuild (999) 638921 2026-10-09 19:30:24.000000 jtreg-test-output/hotspot/0/JTreport/html/passed_gr.html │ │ │ │ │ +-rw-r--r-- 0 sbuild (999) sbuild (999) 529209 2026-10-09 19:30:23.000000 jtreg-test-output/hotspot/0/JTreport/html/report.html │ │ │ │ │ +-rw-r--r-- 0 sbuild (999) sbuild (999) 18323 2026-10-09 19:30:24.000000 jtreg-test-output/hotspot/0/JTreport/html/excluded.html │ │ │ │ │ +-rw-r--r-- 0 sbuild (999) sbuild (999) 33882 2026-10-09 19:30:24.000000 jtreg-test-output/hotspot/0/JTreport/html/notRun_gr.html │ │ │ │ │ +-rw-r--r-- 0 sbuild (999) sbuild (999) 0 2026-10-09 19:30:24.000000 jtreg-test-output/hotspot/0/JTreport/reportdir.dat │ │ │ │ │ +drwxr-xr-x 0 sbuild (999) sbuild (999) 0 2026-10-09 19:30:24.000000 jtreg-test-output/hotspot/0/JTreport/text/ │ │ │ │ │ +-rw-r--r-- 0 sbuild (999) sbuild (999) 899 2026-10-09 19:30:24.000000 jtreg-test-output/hotspot/0/JTreport/text/timeStats.txt │ │ │ │ │ +-rw-r--r-- 0 sbuild (999) sbuild (999) 16 2026-10-09 19:30:24.000000 jtreg-test-output/hotspot/0/JTreport/text/fail2pass.txt │ │ │ │ │ +-rw-r--r-- 0 sbuild (999) sbuild (999) 19 2026-10-09 19:30:24.000000 jtreg-test-output/hotspot/0/JTreport/text/tc_fail2pass.txt │ │ │ │ │ +-rw-r--r-- 0 sbuild (999) sbuild (999) 19 2026-10-09 19:30:24.000000 jtreg-test-output/hotspot/0/JTreport/text/fail2missing.txt │ │ │ │ │ +-rw-r--r-- 0 sbuild (999) sbuild (999) 44907 2026-10-09 19:30:24.000000 jtreg-test-output/hotspot/0/JTreport/text/notRun.txt │ │ │ │ │ +-rw-r--r-- 0 sbuild (999) sbuild (999) 17 2026-10-09 19:30:24.000000 jtreg-test-output/hotspot/0/JTreport/text/faiL2error.txt │ │ │ │ │ +-rw-r--r-- 0 sbuild (999) sbuild (999) 20 2026-10-09 19:30:24.000000 jtreg-test-output/hotspot/0/JTreport/text/tc_fail2error.txt │ │ │ │ │ +-rw-r--r-- 0 sbuild (999) sbuild (999) 123 2026-10-09 19:30:24.000000 jtreg-test-output/hotspot/0/JTreport/text/stats.txt │ │ │ │ │ +-rw-r--r-- 0 sbuild (999) sbuild (999) 16 2026-10-09 19:30:24.000000 jtreg-test-output/hotspot/0/JTreport/text/fail2fail.txt │ │ │ │ │ +-rw-r--r-- 0 sbuild (999) sbuild (999) 22 2026-10-09 19:30:24.000000 jtreg-test-output/hotspot/0/JTreport/text/tc_fail2missing.txt │ │ │ │ │ +-rw-r--r-- 0 sbuild (999) sbuild (999) 553 2026-10-09 16:39:01.000000 jtreg-test-output/hotspot/0/JTreport/text/cmdArgs.txt │ │ │ │ │ +-rw-r--r-- 0 sbuild (999) sbuild (999) 21 2026-10-09 19:30:24.000000 jtreg-test-output/hotspot/0/JTreport/text/tc_fail2notrun.txt │ │ │ │ │ +-rw-r--r-- 0 sbuild (999) sbuild (999) 18 2026-10-09 19:30:24.000000 jtreg-test-output/hotspot/0/JTreport/text/newfailures.txt │ │ │ │ │ +-rw-r--r-- 0 sbuild (999) sbuild (999) 481027 2026-10-09 19:30:24.000000 jtreg-test-output/hotspot/0/JTreport/text/summary.txt │ │ │ │ │ +-rw-r--r-- 0 sbuild (999) sbuild (999) 18 2026-10-09 19:30:24.000000 jtreg-test-output/hotspot/0/JTreport/text/fail2notrun.txt │ │ │ │ │ +-rw-r--r-- 0 sbuild (999) sbuild (999) 21 2026-10-09 19:30:24.000000 jtreg-test-output/hotspot/0/JTreport/text/tc_newfailures.txt │ │ │ │ │ +-rw-r--r-- 0 sbuild (999) sbuild (999) 9190 2026-10-09 19:30:24.000000 jtreg-test-output/hotspot/0/JTreport/text/testng.txt │ │ │ │ │ +-rw-r--r-- 0 sbuild (999) sbuild (999) 9713 2026-10-09 19:30:24.000000 jtreg-test-output/hotspot/0/JTreport/text/junit.txt │ │ │ │ │ +-rw-r--r-- 0 sbuild (999) sbuild (999) 19 2026-10-09 19:30:24.000000 jtreg-test-output/hotspot/0/JTreport/text/other_errors.txt │ │ │ │ │ +lrwxrwxrwx 0 sbuild (999) sbuild (999) 0 2026-10-09 19:30:30.000000 jtreg-test-output/hotspot/JTreport -> 0/JTreport │ │ │ │ │ +drwxr-xr-x 0 sbuild (999) sbuild (999) 0 2026-10-09 20:09:22.000000 jtreg-test-output/langtools/0/JTreport/ │ │ │ │ │ +-rw-r--r-- 0 sbuild (999) sbuild (999) 724 2026-10-09 20:09:22.000000 jtreg-test-output/langtools/0/JTreport/index.html │ │ │ │ │ +drwxr-xr-x 0 sbuild (999) sbuild (999) 0 2026-10-09 20:09:22.000000 jtreg-test-output/langtools/0/JTreport/html/ │ │ │ │ │ +-rw-r--r-- 0 sbuild (999) sbuild (999) 885166 2026-10-09 20:09:22.000000 jtreg-test-output/langtools/0/JTreport/html/passed.html │ │ │ │ │ +-rw-r--r-- 0 sbuild (999) sbuild (999) 10727 2026-10-09 20:09:22.000000 jtreg-test-output/langtools/0/JTreport/html/config.html │ │ │ │ │ +-rw-r--r-- 0 sbuild (999) sbuild (999) 464 2026-10-09 20:09:22.000000 jtreg-test-output/langtools/0/JTreport/html/failed.html │ │ │ │ │ +-rw-r--r-- 0 sbuild (999) sbuild (999) 541946 2026-10-09 20:09:22.000000 jtreg-test-output/langtools/0/JTreport/html/index.html │ │ │ │ │ +-rw-r--r-- 0 sbuild (999) sbuild (999) 4134 2026-10-09 20:09:22.000000 jtreg-test-output/langtools/0/JTreport/html/env.html │ │ │ │ │ +-rw-r--r-- 0 sbuild (999) sbuild (999) 472 2026-10-09 20:09:22.000000 jtreg-test-output/langtools/0/JTreport/html/error.html │ │ │ │ │ +-rw-r--r-- 0 sbuild (999) sbuild (999) 307 2026-10-09 20:09:22.000000 jtreg-test-output/langtools/0/JTreport/html/report.css │ │ │ │ │ +-rw-r--r-- 0 sbuild (999) sbuild (999) 512 2026-10-09 20:09:22.000000 jtreg-test-output/langtools/0/JTreport/html/failed_gr.html │ │ │ │ │ +-rw-r--r-- 0 sbuild (999) sbuild (999) 520 2026-10-09 20:09:22.000000 jtreg-test-output/langtools/0/JTreport/html/error_gr.html │ │ │ │ │ +-rw-r--r-- 0 sbuild (999) sbuild (999) 2173 2026-10-09 20:09:22.000000 jtreg-test-output/langtools/0/JTreport/html/notRun.html │ │ │ │ │ +-rw-r--r-- 0 sbuild (999) sbuild (999) 885491 2026-10-09 20:09:22.000000 jtreg-test-output/langtools/0/JTreport/html/passed_gr.html │ │ │ │ │ +-rw-r--r-- 0 sbuild (999) sbuild (999) 541946 2026-10-09 20:09:22.000000 jtreg-test-output/langtools/0/JTreport/html/report.html │ │ │ │ │ +-rw-r--r-- 0 sbuild (999) sbuild (999) 6194 2026-10-09 20:09:22.000000 jtreg-test-output/langtools/0/JTreport/html/excluded.html │ │ │ │ │ +-rw-r--r-- 0 sbuild (999) sbuild (999) 2462 2026-10-09 20:09:22.000000 jtreg-test-output/langtools/0/JTreport/html/notRun_gr.html │ │ │ │ │ +-rw-r--r-- 0 sbuild (999) sbuild (999) 0 2026-10-09 20:09:22.000000 jtreg-test-output/langtools/0/JTreport/reportdir.dat │ │ │ │ │ +drwxr-xr-x 0 sbuild (999) sbuild (999) 0 2026-10-09 20:09:22.000000 jtreg-test-output/langtools/0/JTreport/text/ │ │ │ │ │ +-rw-r--r-- 0 sbuild (999) sbuild (999) 430 2026-10-09 20:09:22.000000 jtreg-test-output/langtools/0/JTreport/text/timeStats.txt │ │ │ │ │ +-rw-r--r-- 0 sbuild (999) sbuild (999) 16 2026-10-09 20:09:22.000000 jtreg-test-output/langtools/0/JTreport/text/fail2pass.txt │ │ │ │ │ +-rw-r--r-- 0 sbuild (999) sbuild (999) 19 2026-10-09 20:09:22.000000 jtreg-test-output/langtools/0/JTreport/text/tc_fail2pass.txt │ │ │ │ │ +-rw-r--r-- 0 sbuild (999) sbuild (999) 19 2026-10-09 20:09:22.000000 jtreg-test-output/langtools/0/JTreport/text/fail2missing.txt │ │ │ │ │ +-rw-r--r-- 0 sbuild (999) sbuild (999) 1921 2026-10-09 20:09:22.000000 jtreg-test-output/langtools/0/JTreport/text/notRun.txt │ │ │ │ │ +-rw-r--r-- 0 sbuild (999) sbuild (999) 17 2026-10-09 20:09:22.000000 jtreg-test-output/langtools/0/JTreport/text/faiL2error.txt │ │ │ │ │ +-rw-r--r-- 0 sbuild (999) sbuild (999) 20 2026-10-09 20:09:22.000000 jtreg-test-output/langtools/0/JTreport/text/tc_fail2error.txt │ │ │ │ │ +-rw-r--r-- 0 sbuild (999) sbuild (999) 120 2026-10-09 20:09:22.000000 jtreg-test-output/langtools/0/JTreport/text/stats.txt │ │ │ │ │ +-rw-r--r-- 0 sbuild (999) sbuild (999) 16 2026-10-09 20:09:22.000000 jtreg-test-output/langtools/0/JTreport/text/fail2fail.txt │ │ │ │ │ +-rw-r--r-- 0 sbuild (999) sbuild (999) 22 2026-10-09 20:09:22.000000 jtreg-test-output/langtools/0/JTreport/text/tc_fail2missing.txt │ │ │ │ │ +-rw-r--r-- 0 sbuild (999) sbuild (999) 454 2026-10-09 19:30:30.000000 jtreg-test-output/langtools/0/JTreport/text/cmdArgs.txt │ │ │ │ │ +-rw-r--r-- 0 sbuild (999) sbuild (999) 21 2026-10-09 20:09:22.000000 jtreg-test-output/langtools/0/JTreport/text/tc_fail2notrun.txt │ │ │ │ │ +-rw-r--r-- 0 sbuild (999) sbuild (999) 18 2026-10-09 20:09:22.000000 jtreg-test-output/langtools/0/JTreport/text/newfailures.txt │ │ │ │ │ +-rw-r--r-- 0 sbuild (999) sbuild (999) 643622 2026-10-09 20:09:22.000000 jtreg-test-output/langtools/0/JTreport/text/summary.txt │ │ │ │ │ +-rw-r--r-- 0 sbuild (999) sbuild (999) 18 2026-10-09 20:09:22.000000 jtreg-test-output/langtools/0/JTreport/text/fail2notrun.txt │ │ │ │ │ +-rw-r--r-- 0 sbuild (999) sbuild (999) 21 2026-10-09 20:09:22.000000 jtreg-test-output/langtools/0/JTreport/text/tc_newfailures.txt │ │ │ │ │ +-rw-r--r-- 0 sbuild (999) sbuild (999) 9538 2026-10-09 20:09:22.000000 jtreg-test-output/langtools/0/JTreport/text/testng.txt │ │ │ │ │ +-rw-r--r-- 0 sbuild (999) sbuild (999) 18550 2026-10-09 20:09:22.000000 jtreg-test-output/langtools/0/JTreport/text/junit.txt │ │ │ │ │ +-rw-r--r-- 0 sbuild (999) sbuild (999) 19 2026-10-09 20:09:22.000000 jtreg-test-output/langtools/0/JTreport/text/other_errors.txt │ │ │ │ │ +lrwxrwxrwx 0 sbuild (999) sbuild (999) 0 2026-10-09 20:09:30.000000 jtreg-test-output/langtools/JTreport -> 0/JTreport │ │ │ │ │ +drwxr-xr-x 0 sbuild (999) sbuild (999) 0 2026-10-09 20:25:19.000000 jtreg-test-output/jaxp/0/JTreport/ │ │ │ │ │ +-rw-r--r-- 0 sbuild (999) sbuild (999) 714 2026-10-09 20:25:19.000000 jtreg-test-output/jaxp/0/JTreport/index.html │ │ │ │ │ +drwxr-xr-x 0 sbuild (999) sbuild (999) 0 2026-10-09 20:25:19.000000 jtreg-test-output/jaxp/0/JTreport/html/ │ │ │ │ │ +-rw-r--r-- 0 sbuild (999) sbuild (999) 109972 2026-10-09 20:25:19.000000 jtreg-test-output/jaxp/0/JTreport/html/passed.html │ │ │ │ │ +-rw-r--r-- 0 sbuild (999) sbuild (999) 4425 2026-10-09 20:25:19.000000 jtreg-test-output/jaxp/0/JTreport/html/config.html │ │ │ │ │ +-rw-r--r-- 0 sbuild (999) sbuild (999) 464 2026-10-09 20:25:19.000000 jtreg-test-output/jaxp/0/JTreport/html/failed.html │ │ │ │ │ +-rw-r--r-- 0 sbuild (999) sbuild (999) 58501 2026-10-09 20:25:19.000000 jtreg-test-output/jaxp/0/JTreport/html/index.html │ │ │ │ │ +-rw-r--r-- 0 sbuild (999) sbuild (999) 4119 2026-10-09 20:25:19.000000 jtreg-test-output/jaxp/0/JTreport/html/env.html │ │ │ │ │ +-rw-r--r-- 0 sbuild (999) sbuild (999) 472 2026-10-09 20:25:19.000000 jtreg-test-output/jaxp/0/JTreport/html/error.html │ │ │ │ │ +-rw-r--r-- 0 sbuild (999) sbuild (999) 307 2026-10-09 20:25:19.000000 jtreg-test-output/jaxp/0/JTreport/html/report.css │ │ │ │ │ +-rw-r--r-- 0 sbuild (999) sbuild (999) 512 2026-10-09 20:25:19.000000 jtreg-test-output/jaxp/0/JTreport/html/failed_gr.html │ │ │ │ │ +-rw-r--r-- 0 sbuild (999) sbuild (999) 520 2026-10-09 20:25:19.000000 jtreg-test-output/jaxp/0/JTreport/html/error_gr.html │ │ │ │ │ +-rw-r--r-- 0 sbuild (999) sbuild (999) 572 2026-10-09 20:25:19.000000 jtreg-test-output/jaxp/0/JTreport/html/notRun.html │ │ │ │ │ +-rw-r--r-- 0 sbuild (999) sbuild (999) 110061 2026-10-09 20:25:19.000000 jtreg-test-output/jaxp/0/JTreport/html/passed_gr.html │ │ │ │ │ +-rw-r--r-- 0 sbuild (999) sbuild (999) 58501 2026-10-09 20:25:19.000000 jtreg-test-output/jaxp/0/JTreport/html/report.html │ │ │ │ │ +-rw-r--r-- 0 sbuild (999) sbuild (999) 3641 2026-10-09 20:25:19.000000 jtreg-test-output/jaxp/0/JTreport/html/excluded.html │ │ │ │ │ +-rw-r--r-- 0 sbuild (999) sbuild (999) 694 2026-10-09 20:25:19.000000 jtreg-test-output/jaxp/0/JTreport/html/notRun_gr.html │ │ │ │ │ +-rw-r--r-- 0 sbuild (999) sbuild (999) 0 2026-10-09 20:25:19.000000 jtreg-test-output/jaxp/0/JTreport/reportdir.dat │ │ │ │ │ +drwxr-xr-x 0 sbuild (999) sbuild (999) 0 2026-10-09 20:25:19.000000 jtreg-test-output/jaxp/0/JTreport/text/ │ │ │ │ │ +-rw-r--r-- 0 sbuild (999) sbuild (999) 154 2026-10-09 20:25:19.000000 jtreg-test-output/jaxp/0/JTreport/text/timeStats.txt │ │ │ │ │ +-rw-r--r-- 0 sbuild (999) sbuild (999) 16 2026-10-09 20:25:19.000000 jtreg-test-output/jaxp/0/JTreport/text/fail2pass.txt │ │ │ │ │ +-rw-r--r-- 0 sbuild (999) sbuild (999) 19 2026-10-09 20:25:19.000000 jtreg-test-output/jaxp/0/JTreport/text/tc_fail2pass.txt │ │ │ │ │ +-rw-r--r-- 0 sbuild (999) sbuild (999) 19 2026-10-09 20:25:19.000000 jtreg-test-output/jaxp/0/JTreport/text/fail2missing.txt │ │ │ │ │ +-rw-r--r-- 0 sbuild (999) sbuild (999) 116 2026-10-09 20:25:19.000000 jtreg-test-output/jaxp/0/JTreport/text/notRun.txt │ │ │ │ │ +-rw-r--r-- 0 sbuild (999) sbuild (999) 17 2026-10-09 20:25:19.000000 jtreg-test-output/jaxp/0/JTreport/text/faiL2error.txt │ │ │ │ │ +-rw-r--r-- 0 sbuild (999) sbuild (999) 20 2026-10-09 20:25:19.000000 jtreg-test-output/jaxp/0/JTreport/text/tc_fail2error.txt │ │ │ │ │ +-rw-r--r-- 0 sbuild (999) sbuild (999) 65 2026-10-09 20:25:19.000000 jtreg-test-output/jaxp/0/JTreport/text/stats.txt │ │ │ │ │ +-rw-r--r-- 0 sbuild (999) sbuild (999) 16 2026-10-09 20:25:19.000000 jtreg-test-output/jaxp/0/JTreport/text/fail2fail.txt │ │ │ │ │ +-rw-r--r-- 0 sbuild (999) sbuild (999) 22 2026-10-09 20:25:19.000000 jtreg-test-output/jaxp/0/JTreport/text/tc_fail2missing.txt │ │ │ │ │ +-rw-r--r-- 0 sbuild (999) sbuild (999) 439 2026-10-09 20:09:31.000000 jtreg-test-output/jaxp/0/JTreport/text/cmdArgs.txt │ │ │ │ │ +-rw-r--r-- 0 sbuild (999) sbuild (999) 21 2026-10-09 20:25:19.000000 jtreg-test-output/jaxp/0/JTreport/text/tc_fail2notrun.txt │ │ │ │ │ +-rw-r--r-- 0 sbuild (999) sbuild (999) 18 2026-10-09 20:25:19.000000 jtreg-test-output/jaxp/0/JTreport/text/newfailures.txt │ │ │ │ │ +-rw-r--r-- 0 sbuild (999) sbuild (999) 59118 2026-10-09 20:25:19.000000 jtreg-test-output/jaxp/0/JTreport/text/summary.txt │ │ │ │ │ +-rw-r--r-- 0 sbuild (999) sbuild (999) 18 2026-10-09 20:25:19.000000 jtreg-test-output/jaxp/0/JTreport/text/fail2notrun.txt │ │ │ │ │ +-rw-r--r-- 0 sbuild (999) sbuild (999) 21 2026-10-09 20:25:19.000000 jtreg-test-output/jaxp/0/JTreport/text/tc_newfailures.txt │ │ │ │ │ +-rw-r--r-- 0 sbuild (999) sbuild (999) 69461 2026-10-09 20:25:19.000000 jtreg-test-output/jaxp/0/JTreport/text/testng.txt │ │ │ │ │ +-rw-r--r-- 0 sbuild (999) sbuild (999) 200 2026-10-09 20:25:19.000000 jtreg-test-output/jaxp/0/JTreport/text/junit.txt │ │ │ │ │ +-rw-r--r-- 0 sbuild (999) sbuild (999) 19 2026-10-09 20:25:19.000000 jtreg-test-output/jaxp/0/JTreport/text/other_errors.txt │ │ │ │ │ +lrwxrwxrwx 0 sbuild (999) sbuild (999) 0 2026-10-09 20:25:20.000000 jtreg-test-output/jaxp/JTreport -> 0/JTreport │ │ │ │ ├── jtreg-test-output/jdk/2/JTreport/index.html │ │ │ │ │ @@ -3,15 +3,15 @@ │ │ │ │ │ │ │ │ │ │ │ │ │ │ │ │ │ │ │ │ │ │ │ │ │ Report Index │ │ │ │ │ │ │ │ │ │

/build/reproducible-path/openjdk-21-21.0.13~8ea/test/jdk

│ │ │ │ │ -Date of report : 08 October 2026 20:09:17 │ │ │ │ │ +Date of report : 10 October 2026 00:11:18 │ │ │ │ │ │ │ │ │ │

│ │ │ │ │ HTML Report │ │ │ │ │
Standard JT Harness HTML report. Can show a summary of the results, configuration information, and environment values.

│ │ │ │ │

│ │ │ │ │ Plain Text Report │ │ │ │ │
Standard JT Harness text report showing only test names and their result status string. Suitable for parsing by external program.

│ │ │ │ │ ├── html2text {} │ │ │ │ │ │ @@ -1,8 +1,8 @@ │ │ │ │ │ │ ************ //bbuuiilldd//rreepprroodduucciibbllee--ppaatthh//ooppeennjjddkk--2211--2211..00..1133~~88eeaa//tteesstt//jjddkk ************ │ │ │ │ │ │ -Date of report : 08 October 2026 20:09:17 │ │ │ │ │ │ +Date of report : 10 October 2026 00:11:18 │ │ │ │ │ │ _H_T_M_L_ _R_e_p_o_r_t │ │ │ │ │ │ Standard JT Harness HTML report. Can show a summary of the results, │ │ │ │ │ │ configuration information, and environment values. │ │ │ │ │ │ _P_l_a_i_n_ _T_e_x_t_ _R_e_p_o_r_t │ │ │ │ │ │ Standard JT Harness text report showing only test names and their result status │ │ │ │ │ │ string. Suitable for parsing by external program. │ │ │ │ ├── jtreg-test-output/jdk/2/JTreport/html/notRun_gr.html │ │ │ │ │ @@ -47648,18 +47648,18 @@ │ │ │ │ │ 000ba1f0: 6f72 6b20 636f 7272 6563 746c 790a 0a3c ork correctly..< │ │ │ │ │ 000ba200: 6c69 3e73 756e 2f73 6563 7572 6974 792f li>sun/security/ │ │ │ │ │ 000ba210: 736d 6172 7463 6172 6469 6f2f 5465 7374 smartcardio/Test │ │ │ │ │ 000ba220: 5472 616e 736d 6974 2e6a 6176 613a 2074 Transmit.java: t │ │ │ │ │ 000ba230: 6573 7420 7472 616e 736d 6974 2829 2077 est transmit() w │ │ │ │ │ 000ba240: 6f72 6b73 0a3c 2f75 6c3e 0a3c 6872 3e0a orks..
. │ │ │ │ │ 000ba250: 3c73 6d61 6c6c 3e52 6570 6f72 7420 6765 Report ge │ │ │ │ │ -000ba260: 6e65 7261 7465 6420 6f6e 204f 6374 2038 nerated on Oct 8 │ │ │ │ │ -000ba270: 2c20 3230 3236 2038 3a30 393a 3137 e280 , 2026 8:09:17.. │ │ │ │ │ -000ba280: af50 4d0a 3c62 723e 5573 696e 6720 4a54 .PM.
Using JT │ │ │ │ │ -000ba290: 2048 6172 6e65 7373 2036 2e30 2062 3236 Harness 6.0 b26 │ │ │ │ │ -000ba2a0: 3b20 6275 696c 7420 6f6e 204d 6172 6368 ; built on March │ │ │ │ │ -000ba2b0: 2031 382c 2032 3032 362c 2031 323a 3030 18, 2026, 12:00 │ │ │ │ │ -000ba2c0: 3a30 30e2 80af 414d 2055 5443 2077 6974 :00...AM UTC wit │ │ │ │ │ -000ba2d0: 6820 6f70 656e 6a64 6b20 7665 7273 696f h openjdk versio │ │ │ │ │ -000ba2e0: 6e20 2232 352e 302e 332d 6561 2220 3230 n "25.0.3-ea" 20 │ │ │ │ │ -000ba2f0: 3236 2d30 342d 3231 3c2f 736d 616c 6c3e 26-04-21
│ │ │ │ │ -000ba300: 3c2f 626f 6479 3e3c 2f68 746d 6c3e │ │ │ │ │ +000ba260: 6e65 7261 7465 6420 6f6e 204f 6374 2031 nerated on Oct 1 │ │ │ │ │ +000ba270: 302c 2032 3032 3620 3132 3a31 313a 3138 0, 2026 12:11:18 │ │ │ │ │ +000ba280: e280 af41 4d0a 3c62 723e 5573 696e 6720 ...AM.
Using │ │ │ │ │ +000ba290: 4a54 2048 6172 6e65 7373 2036 2e30 2062 JT Harness 6.0 b │ │ │ │ │ +000ba2a0: 3236 3b20 6275 696c 7420 6f6e 204d 6172 26; built on Mar │ │ │ │ │ +000ba2b0: 6368 2031 382c 2032 3032 362c 2031 323a ch 18, 2026, 12: │ │ │ │ │ +000ba2c0: 3030 3a30 30e2 80af 414d 2055 5443 2077 00:00...AM UTC w │ │ │ │ │ +000ba2d0: 6974 6820 6f70 656e 6a64 6b20 7665 7273 ith openjdk vers │ │ │ │ │ +000ba2e0: 696f 6e20 2232 352e 302e 332d 6561 2220 ion "25.0.3-ea" │ │ │ │ │ +000ba2f0: 3230 3236 2d30 342d 3231 3c2f 736d 616c 2026-04-21 │ │ │ │ │ ├── html2text {} │ │ │ │ │ │ @@ -13393,10 +13393,10 @@ │ │ │ │ │ │ ()/endExclusive() works │ │ │ │ │ │ * sun/security/smartcardio/TestMultiplePresent.java: test that │ │ │ │ │ │ CardTerminals.waitForCard() works │ │ │ │ │ │ * sun/security/smartcardio/TestPresent.java: test that the isCardPresent()/ │ │ │ │ │ │ waitForX() APIs work correctly │ │ │ │ │ │ * sun/security/smartcardio/TestTransmit.java: test transmit() works │ │ │ │ │ │ =============================================================================== │ │ │ │ │ │ -Report generated on Oct 8, 2026 8:09:17 PM │ │ │ │ │ │ +Report generated on Oct 10, 2026 12:11:18 AM │ │ │ │ │ │ Using JT Harness 6.0 b26; built on March 18, 2026, 12:00:00 AM UTC with openjdk │ │ │ │ │ │ version "25.0.3-ea" 2026-04-21 │ │ │ │ ├── jtreg-test-output/jdk/2/JTreport/html/notRun.html │ │ │ │ │ @@ -47631,18 +47631,18 @@ │ │ │ │ │ 000ba0e0: 722f 6d6f 6475 6c65 732f 7661 6c69 6461 r/modules/valida │ │ │ │ │ 000ba0f0: 7465 2f56 616c 6964 6174 654d 6f64 756c te/ValidateModul │ │ │ │ │ 000ba100: 6573 5465 7374 2e6a 6176 613a 2042 6173 esTest.java: Bas │ │ │ │ │ 000ba110: 6963 2074 6573 7420 666f 7220 6a61 7661 ic test for java │ │ │ │ │ 000ba120: 202d 2d76 616c 6964 6174 652d 6d6f 6475 --validate-modu │ │ │ │ │ 000ba130: 6c65 730a 3c62 720a 3e0a 3c68 723e 0a3c les..
.< │ │ │ │ │ 000ba140: 736d 616c 6c3e 5265 706f 7274 2067 656e small>Report gen │ │ │ │ │ -000ba150: 6572 6174 6564 206f 6e20 4f63 7420 382c erated on Oct 8, │ │ │ │ │ -000ba160: 2032 3032 3620 383a 3039 3a31 37e2 80af 2026 8:09:17... │ │ │ │ │ -000ba170: 504d 0a3c 6272 3e55 7369 6e67 204a 5420 PM.
Using JT │ │ │ │ │ -000ba180: 4861 726e 6573 7320 362e 3020 6232 363b Harness 6.0 b26; │ │ │ │ │ -000ba190: 2062 7569 6c74 206f 6e20 4d61 7263 6820 built on March │ │ │ │ │ -000ba1a0: 3138 2c20 3230 3236 2c20 3132 3a30 303a 18, 2026, 12:00: │ │ │ │ │ -000ba1b0: 3030 e280 af41 4d20 5554 4320 7769 7468 00...AM UTC with │ │ │ │ │ -000ba1c0: 206f 7065 6e6a 646b 2076 6572 7369 6f6e openjdk version │ │ │ │ │ -000ba1d0: 2022 3235 2e30 2e33 2d65 6122 2032 3032 "25.0.3-ea" 202 │ │ │ │ │ -000ba1e0: 362d 3034 2d32 313c 2f73 6d61 6c6c 3e3c 6-04-21< │ │ │ │ │ -000ba1f0: 2f62 6f64 793e 3c2f 6874 6d6c 3e /body> │ │ │ │ │ +000ba150: 6572 6174 6564 206f 6e20 4f63 7420 3130 erated on Oct 10 │ │ │ │ │ +000ba160: 2c20 3230 3236 2031 323a 3131 3a31 37e2 , 2026 12:11:17. │ │ │ │ │ +000ba170: 80af 414d 0a3c 6272 3e55 7369 6e67 204a ..AM.
Using J │ │ │ │ │ +000ba180: 5420 4861 726e 6573 7320 362e 3020 6232 T Harness 6.0 b2 │ │ │ │ │ +000ba190: 363b 2062 7569 6c74 206f 6e20 4d61 7263 6; built on Marc │ │ │ │ │ +000ba1a0: 6820 3138 2c20 3230 3236 2c20 3132 3a30 h 18, 2026, 12:0 │ │ │ │ │ +000ba1b0: 303a 3030 e280 af41 4d20 5554 4320 7769 0:00...AM UTC wi │ │ │ │ │ +000ba1c0: 7468 206f 7065 6e6a 646b 2076 6572 7369 th openjdk versi │ │ │ │ │ +000ba1d0: 6f6e 2022 3235 2e30 2e33 2d65 6122 2032 on "25.0.3-ea" 2 │ │ │ │ │ +000ba1e0: 3032 362d 3034 2d32 313c 2f73 6d61 6c6c 026-04-21 │ │ │ │ │ ├── html2text {} │ │ │ │ │ │ @@ -12773,10 +12773,10 @@ │ │ │ │ │ │ tools/launcher/modules/patch/systemmodules/PatchSystemModules.java: Patch │ │ │ │ │ │ java.base and user module with ModuleHashes attribute │ │ │ │ │ │ tools/launcher/modules/showmoduleresolution/ShowModuleResolutionTest.java: │ │ │ │ │ │ Basic test for java --show-module-resolution │ │ │ │ │ │ tools/launcher/modules/validate/ValidateModulesTest.java: Basic test for java - │ │ │ │ │ │ -validate-modules │ │ │ │ │ │ =============================================================================== │ │ │ │ │ │ -Report generated on Oct 8, 2026 8:09:17 PM │ │ │ │ │ │ +Report generated on Oct 10, 2026 12:11:17 AM │ │ │ │ │ │ Using JT Harness 6.0 b26; built on March 18, 2026, 12:00:00 AM UTC with openjdk │ │ │ │ │ │ version "25.0.3-ea" 2026-04-21 │ │ │ │ ├── jtreg-test-output/jdk/2/JTreport/html/error_gr.html │ │ │ │ │ @@ -6,9 +6,9 @@ │ │ │ │ │ │ │ │ │ │ JT Harness : Tests that had errors │ │ │ │ │ │ │ │ │ │ │ │ │ │ │ │ │ │ │ │

JT Harness : Tests that had errors

Tests are grouped by their final status message. │ │ │ │ │
│ │ │ │ │ -Report generated on Oct 8, 2026 8:09:17 PM │ │ │ │ │ +Report generated on Oct 10, 2026 12:11:17 AM │ │ │ │ │
Using JT Harness 6.0 b26; built on March 18, 2026, 12:00:00 AM UTC with openjdk version "25.0.3-ea" 2026-04-21
│ │ │ │ │ ├── html2text {} │ │ │ │ │ │ @@ -1,6 +1,6 @@ │ │ │ │ │ │ ************ JJTT HHaarrnneessss :: TTeessttss tthhaatt hhaadd eerrrroorrss ************ │ │ │ │ │ │ Tests are grouped by their final status message. │ │ │ │ │ │ =============================================================================== │ │ │ │ │ │ -Report generated on Oct 8, 2026 8:09:17 PM │ │ │ │ │ │ +Report generated on Oct 10, 2026 12:11:17 AM │ │ │ │ │ │ Using JT Harness 6.0 b26; built on March 18, 2026, 12:00:00 AM UTC with openjdk │ │ │ │ │ │ version "25.0.3-ea" 2026-04-21 │ │ │ │ ├── jtreg-test-output/jdk/2/JTreport/html/error.html │ │ │ │ │ @@ -6,9 +6,9 @@ │ │ │ │ │ │ │ │ │ │ JT Harness : Tests that had errors │ │ │ │ │ │ │ │ │ │ │ │ │ │ │ │ │ │ │ │

JT Harness : Tests that had errors

│ │ │ │ │
│ │ │ │ │ -Report generated on Oct 8, 2026 8:09:17 PM │ │ │ │ │ +Report generated on Oct 10, 2026 12:11:17 AM │ │ │ │ │
Using JT Harness 6.0 b26; built on March 18, 2026, 12:00:00 AM UTC with openjdk version "25.0.3-ea" 2026-04-21
│ │ │ │ │ ├── html2text {} │ │ │ │ │ │ @@ -1,5 +1,5 @@ │ │ │ │ │ │ ************ JJTT HHaarrnneessss :: TTeessttss tthhaatt hhaadd eerrrroorrss ************ │ │ │ │ │ │ =============================================================================== │ │ │ │ │ │ -Report generated on Oct 8, 2026 8:09:17 PM │ │ │ │ │ │ +Report generated on Oct 10, 2026 12:11:17 AM │ │ │ │ │ │ Using JT Harness 6.0 b26; built on March 18, 2026, 12:00:00 AM UTC with openjdk │ │ │ │ │ │ version "25.0.3-ea" 2026-04-21 │ │ │ │ ├── jtreg-test-output/jdk/2/JTreport/html/failed_gr.html │ │ │ │ │ @@ -56,9 +56,9 @@ │ │ │ │ │
  • │ │ │ │ │ java/net/MulticastSocket/SetLoopbackMode.java: Test MulticastSocket.setLoopbackMode │ │ │ │ │ │ │ │ │ │
  • │ │ │ │ │ java/net/MulticastSocket/SetLoopbackModeIPv4.java: Test MulticastSocket.setLoopbackMode with IPv4 addresses │ │ │ │ │ │ │ │ │ │
    │ │ │ │ │ -Report generated on Oct 8, 2026 8:09:17 PM │ │ │ │ │ +Report generated on Oct 10, 2026 12:11:17 AM │ │ │ │ │
    Using JT Harness 6.0 b26; built on March 18, 2026, 12:00:00 AM UTC with openjdk version "25.0.3-ea" 2026-04-21
    │ │ │ │ │ ├── html2text {} │ │ │ │ │ │ @@ -25,10 +25,10 @@ │ │ │ │ │ │ * _j_a_v_a_/_n_e_t_/_M_u_l_t_i_c_a_s_t_S_o_c_k_e_t_/_N_o_L_o_o_p_b_a_c_k_P_a_c_k_e_t_s_._j_a_v_a: Re-test IPv6 (and │ │ │ │ │ │ specifically MulticastSocket) with latest Linux & USAGI code │ │ │ │ │ │ * _j_a_v_a_/_n_e_t_/_M_u_l_t_i_c_a_s_t_S_o_c_k_e_t_/_S_e_t_L_o_o_p_b_a_c_k_M_o_d_e_._j_a_v_a: Test │ │ │ │ │ │ MulticastSocket.setLoopbackMode │ │ │ │ │ │ * _j_a_v_a_/_n_e_t_/_M_u_l_t_i_c_a_s_t_S_o_c_k_e_t_/_S_e_t_L_o_o_p_b_a_c_k_M_o_d_e_I_P_v_4_._j_a_v_a: Test │ │ │ │ │ │ MulticastSocket.setLoopbackMode with IPv4 addresses │ │ │ │ │ │ =============================================================================== │ │ │ │ │ │ -Report generated on Oct 8, 2026 8:09:17 PM │ │ │ │ │ │ +Report generated on Oct 10, 2026 12:11:17 AM │ │ │ │ │ │ Using JT Harness 6.0 b26; built on March 18, 2026, 12:00:00 AM UTC with openjdk │ │ │ │ │ │ version "25.0.3-ea" 2026-04-21 │ │ │ │ ├── jtreg-test-output/jdk/2/JTreport/html/failed.html │ │ │ │ │ @@ -33,9 +33,9 @@ │ │ │ │ │ java/net/SocketPermission/SocketPermissionTest.java: SocketPermission tests for legacy socket types. │ │ │ │ │
    │ │ │ │ │ sun/security/krb5/auto/Addresses.java: fix krb5 caddr │ │ │ │ │
    │ │ │ │ │
    │ │ │ │ │ -Report generated on Oct 8, 2026 8:09:17 PM │ │ │ │ │ +Report generated on Oct 10, 2026 12:11:17 AM │ │ │ │ │
    Using JT Harness 6.0 b26; built on March 18, 2026, 12:00:00 AM UTC with openjdk version "25.0.3-ea" 2026-04-21
    │ │ │ │ │ ├── html2text {} │ │ │ │ │ │ @@ -11,10 +11,10 @@ │ │ │ │ │ │ MulticastSocket.setLoopbackMode with IPv4 addresses │ │ │ │ │ │ _j_a_v_a_/_n_e_t_/_M_u_l_t_i_c_a_s_t_S_o_c_k_e_t_/_T_e_s_t_._j_a_v_a: IPv4 and IPv6 multicasting broken on Linux │ │ │ │ │ │ _j_a_v_a_/_n_e_t_/_S_o_c_k_e_t_O_p_t_i_o_n_/_O_p_t_i_o_n_s_T_e_s_t_._j_a_v_a: │ │ │ │ │ │ _j_a_v_a_/_n_e_t_/_S_o_c_k_e_t_P_e_r_m_i_s_s_i_o_n_/_S_o_c_k_e_t_P_e_r_m_i_s_s_i_o_n_T_e_s_t_._j_a_v_a: SocketPermission tests for │ │ │ │ │ │ legacy socket types. │ │ │ │ │ │ _s_u_n_/_s_e_c_u_r_i_t_y_/_k_r_b_5_/_a_u_t_o_/_A_d_d_r_e_s_s_e_s_._j_a_v_a: fix krb5 caddr │ │ │ │ │ │ =============================================================================== │ │ │ │ │ │ -Report generated on Oct 8, 2026 8:09:17 PM │ │ │ │ │ │ +Report generated on Oct 10, 2026 12:11:17 AM │ │ │ │ │ │ Using JT Harness 6.0 b26; built on March 18, 2026, 12:00:00 AM UTC with openjdk │ │ │ │ │ │ version "25.0.3-ea" 2026-04-21 │ │ │ │ ├── jtreg-test-output/jdk/2/JTreport/html/passed_gr.html │ │ │ │ │ @@ -241,77955 +241,77983 @@ │ │ │ │ │ 00000f00: 6c65 732e 6a74 7222 3e6a 646b 2f63 6c61 les.jtr">jdk/cla │ │ │ │ │ 00000f10: 7373 6669 6c65 2f65 7861 6d70 6c65 732f ssfile/examples/ │ │ │ │ │ 00000f20: 5472 616e 7366 6f72 6d45 7861 6d70 6c65 TransformExample │ │ │ │ │ 00000f30: 732e 6a61 7661 3c2f 613e 3a20 5465 7374 s.java: Test │ │ │ │ │ 00000f40: 696e 6720 436c 6173 7366 696c 6520 5472 ing Classfile Tr │ │ │ │ │ 00000f50: 616e 7366 6f72 6d45 7861 6d70 6c65 7320 ansformExamples │ │ │ │ │ 00000f60: 636f 6d70 696c 6174 696f 6e2e 0a3c 2f75 compilation....

    Executio │ │ │ │ │ -00000f80: 6e20 6661 696c 6564 2061 7320 6578 7065 n failed as expe │ │ │ │ │ -00000f90: 6374 6564 3c2f 6834 3e0a 0a3c 756c 3e0a cted

    ....

    E │ │ │ │ │ -00001670: 7865 6375 7469 6f6e 2073 7563 6365 7373 xecution success │ │ │ │ │ -00001680: 6675 6c3c 2f68 343e 0a0a 3c75 6c3e 0a3c ful

    ....DEBUG: [HttpCl │ │ │ │ │ +000010a0: 6965 6e74 2d32 342d 576f 726b 6572 2d31 ient-24-Worker-1 │ │ │ │ │ +000010b0: 5d20 5b31 7320 3939 336d 735d 2053 534c ] [1s 993ms] SSL │ │ │ │ │ +000010c0: 2052 6561 6465 7228 536f 636b 6574 5475 Reader(SocketTu │ │ │ │ │ +000010d0: 6265 2832 3429 2920 4465 636f 6465 6420 be(24)) Decoded │ │ │ │ │ +000010e0: 3020 6279 7465 7320 6f75 7420 6f66 2038 0 bytes out of 8 │ │ │ │ │ +000010f0: 3020 696e 746f 2062 7566 6665 7220 6f66 0 into buffer of │ │ │ │ │ +00001100: 2034 3020 7265 6d61 696e 696e 6720 746f 40 remaining to │ │ │ │ │ +00001110: 2064 6563 6f64 653a 2034 303c 2f68 343e decode: 40 │ │ │ │ │ +00001120: 0a0a 3c75 6c3e 0a3c 6c69 3e0a 3c61 2068 ....< │ │ │ │ │ +000011b0: 6834 3e45 7865 6375 7469 6f6e 2066 6169 h4>Execution fai │ │ │ │ │ +000011c0: 6c65 6420 6173 2065 7870 6563 7465 643c led as expected< │ │ │ │ │ +000011d0: 2f68 343e 0a0a 3c75 6c3e 0a3c 6c69 3e0a /h4>..