--- /srv/rebuilderd/tmp/rebuilderdBmTG2t/inputs/openjdk-21-jdk_21.0.13+9-1_amd64.deb +++ /srv/rebuilderd/tmp/rebuilderdBmTG2t/out/openjdk-21-jdk_21.0.13+9-1_amd64.deb ├── file list │ @@ -1,3 +1,3 @@ │ -rw-r--r-- 0 0 0 4 2026-10-22 01:19:01.000000 debian-binary │ -rw-r--r-- 0 0 0 1840 2026-10-22 01:19:01.000000 control.tar.xz │ --rw-r--r-- 0 0 0 3616760 2026-10-22 01:19:01.000000 data.tar.xz │ +-rw-r--r-- 0 0 0 3571536 2026-10-22 01:19:01.000000 data.tar.xz ├── control.tar.xz │ ├── control.tar │ │ ├── ./control │ │ │ @@ -1,13 +1,13 @@ │ │ │ Package: openjdk-21-jdk │ │ │ Source: openjdk-21 │ │ │ Version: 21.0.13+9-1 │ │ │ Architecture: amd64 │ │ │ Maintainer: OpenJDK Team │ │ │ -Installed-Size: 3727 │ │ │ +Installed-Size: 3745 │ │ │ Depends: openjdk-21-jre (= 21.0.13+9-1), openjdk-21-jdk-headless (= 21.0.13+9-1), libc6 (>= 2.34), zlib1g (>= 1:1.1.4) │ │ │ Recommends: libxt-dev │ │ │ Suggests: openjdk-21-demo, openjdk-21-source, visualvm │ │ │ Provides: java-compiler, java-sdk (= 21), java10-sdk, java11-sdk, java12-sdk, java13-sdk, java14-sdk, java15-sdk, java16-sdk, java17-sdk, java18-sdk, java19-sdk, java2-sdk, java20-sdk, java21-sdk, java5-sdk, java6-sdk, java7-sdk, java8-sdk, java9-sdk │ │ │ Section: java │ │ │ Priority: optional │ │ │ Multi-Arch: same │ │ ├── ./md5sums │ │ │ ├── ./md5sums │ │ │ │┄ Files differ ├── data.tar.xz │ ├── data.tar │ │ ├── file list │ │ │ @@ -13,17 +13,17 @@ │ │ │ drwxr-xr-x 0 root (0) root (0) 0 2026-10-22 01:19:01.000000 ./usr/lib/jvm/java-21-openjdk-amd64/man/man1/ │ │ │ -rw-r--r-- 0 root (0) root (0) 1723 2026-10-22 01:19:01.000000 ./usr/lib/jvm/java-21-openjdk-amd64/man/man1/jconsole.1.gz │ │ │ drwxr-xr-x 0 root (0) root (0) 0 2026-10-22 01:19:01.000000 ./usr/lib/jvm/openjdk-21/ │ │ │ drwxr-xr-x 0 root (0) root (0) 0 2026-10-22 01:19:01.000000 ./usr/share/ │ │ │ drwxr-xr-x 0 root (0) root (0) 0 2026-10-22 01:19:01.000000 ./usr/share/doc/ │ │ │ drwxr-xr-x 0 root (0) root (0) 0 2026-10-22 01:19:01.000000 ./usr/share/doc/openjdk-21-jre-headless/ │ │ │ drwxr-xr-x 0 root (0) root (0) 0 2026-10-22 01:19:01.000000 ./usr/share/doc/openjdk-21-jre-headless/test-amd64/ │ │ │ --rw-r--r-- 0 root (0) root (0) 28918 2026-10-22 01:19:01.000000 ./usr/share/doc/openjdk-21-jre-headless/test-amd64/check-hotspot-hotspot.log.gz │ │ │ +-rw-r--r-- 0 root (0) root (0) 28992 2026-10-22 01:19:01.000000 ./usr/share/doc/openjdk-21-jre-headless/test-amd64/check-hotspot-hotspot.log.gz │ │ │ -rw-r--r-- 0 root (0) root (0) 3919 2026-10-22 01:19:01.000000 ./usr/share/doc/openjdk-21-jre-headless/test-amd64/check-jaxp-hotspot.log.gz │ │ │ --rw-r--r-- 0 root (0) root (0) 55741 2026-10-22 01:19:01.000000 ./usr/share/doc/openjdk-21-jre-headless/test-amd64/check-jdk-hotspot.log.gz │ │ │ +-rw-r--r-- 0 root (0) root (0) 55752 2026-10-22 01:19:01.000000 ./usr/share/doc/openjdk-21-jre-headless/test-amd64/check-jdk-hotspot.log.gz │ │ │ -rw-r--r-- 0 root (0) root (0) 35242 2026-10-22 01:19:01.000000 ./usr/share/doc/openjdk-21-jre-headless/test-amd64/check-langtools-hotspot.log.gz │ │ │ --rw-r--r-- 0 root (0) root (0) 8559 2026-10-22 01:19:01.000000 ./usr/share/doc/openjdk-21-jre-headless/test-amd64/failed_tests-hotspot.tar.gz │ │ │ --rw-r--r-- 0 root (0) root (0) 3398 2026-10-22 01:19:01.000000 ./usr/share/doc/openjdk-21-jre-headless/test-amd64/jtreg-summary-hotspot.log │ │ │ --rw-r--r-- 0 root (0) root (0) 128168 2026-10-22 01:19:01.000000 ./usr/share/doc/openjdk-21-jre-headless/test-amd64/jtreg_output-hotspot.log.gz │ │ │ --rw-r--r-- 0 root (0) root (0) 3492917 2026-10-22 01:19:01.000000 ./usr/share/doc/openjdk-21-jre-headless/test-amd64/jtreport-hotspot.tar.gz │ │ │ +-rw-r--r-- 0 root (0) root (0) 8545 2026-10-22 01:19:01.000000 ./usr/share/doc/openjdk-21-jre-headless/test-amd64/failed_tests-hotspot.tar.gz │ │ │ +-rw-r--r-- 0 root (0) root (0) 3397 2026-10-22 01:19:01.000000 ./usr/share/doc/openjdk-21-jre-headless/test-amd64/jtreg-summary-hotspot.log │ │ │ +-rw-r--r-- 0 root (0) root (0) 128293 2026-10-22 01:19:01.000000 ./usr/share/doc/openjdk-21-jre-headless/test-amd64/jtreg_output-hotspot.log.gz │ │ │ +-rw-r--r-- 0 root (0) root (0) 3511919 2026-10-22 01:19:01.000000 ./usr/share/doc/openjdk-21-jre-headless/test-amd64/jtreport-hotspot.tar.gz │ │ │ lrwxrwxrwx 0 root (0) root (0) 0 2026-10-22 01:19:01.000000 ./usr/lib/jvm/openjdk-21/src.zip -> lib/src.zip │ │ │ lrwxrwxrwx 0 root (0) root (0) 0 2026-10-22 01:19:01.000000 ./usr/share/doc/openjdk-21-jdk -> openjdk-21-jre │ │ ├── ./usr/share/doc/openjdk-21-jre-headless/test-amd64/check-hotspot-hotspot.log.gz │ │ │ ├── check-hotspot-hotspot.log │ │ │ │ @@ -274,14 +274,16 @@ │ │ │ │ Passed: compiler/intrinsics/Test8005419.java │ │ │ │ Passed: compiler/intrinsics/Test8215792.java │ │ │ │ Passed: compiler/intrinsics/Test8237524.java │ │ │ │ Passed: compiler/intrinsics/TestArraysHashCode.java │ │ │ │ Passed: compiler/intrinsics/TestBitShuffleOpers.java │ │ │ │ Passed: compiler/intrinsics/TestCheckIndex.java │ │ │ │ Passed: compiler/intrinsics/TestCompareUnsigned.java │ │ │ │ +Passed: compiler/intrinsics/TestDoubleIsInfinite.java │ │ │ │ +Passed: compiler/intrinsics/TestFloatIsInfinite.java │ │ │ │ Passed: compiler/intrinsics/TestIntegerUnsignedDivMod.java │ │ │ │ Passed: compiler/intrinsics/TestLongUnsignedDivMod.java │ │ │ │ Passed: compiler/intrinsics/TestReferenceGetWithNull.java │ │ │ │ Passed: compiler/intrinsics/TestReferenceRefersTo.java │ │ │ │ Passed: compiler/intrinsics/TestRotate.java │ │ │ │ Passed: compiler/intrinsics/VectorizedMismatchTest.java │ │ │ │ Passed: compiler/intrinsics/zip/TestAdler32.java │ │ │ │ @@ -1526,18 +1528,21 @@ │ │ │ │ Passed: compiler/intrinsics/sha/sanity/TestSHA3Intrinsics.java │ │ │ │ Passed: compiler/intrinsics/sha/sanity/TestSHA3MultiBlockIntrinsics.java │ │ │ │ Passed: compiler/intrinsics/sha/sanity/TestSHA512Intrinsics.java │ │ │ │ Passed: compiler/intrinsics/sha/sanity/TestSHA512MultiBlockIntrinsics.java │ │ │ │ Passed: compiler/intrinsics/sha/TestDigest.java │ │ │ │ Passed: compiler/intrinsics/string/TestCopyValueOf.java │ │ │ │ Passed: compiler/intrinsics/string/TestCountPositives.java#id0 │ │ │ │ +Passed: compiler/intrinsics/string/TestCountPositives.java#id1 │ │ │ │ Passed: compiler/intrinsics/string/TestEncodeIntrinsics.java │ │ │ │ Passed: compiler/intrinsics/string/TestHasNegatives.java#id0 │ │ │ │ +Passed: compiler/intrinsics/string/TestHasNegatives.java#id1 │ │ │ │ Passed: compiler/intrinsics/string/TestStringConstruction.java │ │ │ │ Passed: compiler/intrinsics/string/TestStringConstructionIntrinsics.java#id0 │ │ │ │ +Passed: compiler/intrinsics/string/TestStringConstructionIntrinsics.java#id1 │ │ │ │ Passed: compiler/intrinsics/string/TestStringEqualsBadLength.java │ │ │ │ Passed: compiler/intrinsics/string/TestStringIndexOfCharIntrinsics.java │ │ │ │ Passed: compiler/intrinsics/string/TestStringIntrinsicMemoryFlow.java │ │ │ │ Passed: compiler/intrinsics/string/TestStringIntrinsicRangeChecks.java │ │ │ │ Passed: compiler/intrinsics/string/TestStringIntrinsics.java │ │ │ │ Passed: compiler/intrinsics/string/TestStringIntrinsics2.java │ │ │ │ Passed: compiler/intrinsics/string/TestStringLatin1IndexOfChar.java │ │ │ │ @@ -1700,14 +1705,22 @@ │ │ │ │ Passed: compiler/loopopts/superword/TestDependencyOffsets.java#avx1-v016-U │ │ │ │ Passed: compiler/loopopts/superword/TestDependencyOffsets.java#avx1-v032-A │ │ │ │ Passed: compiler/loopopts/superword/TestDependencyOffsets.java#avx1-v032-U │ │ │ │ Passed: compiler/loopopts/superword/TestDependencyOffsets.java#avx2-v016-A │ │ │ │ Passed: compiler/loopopts/superword/TestDependencyOffsets.java#avx2-v016-U │ │ │ │ Passed: compiler/loopopts/superword/TestDependencyOffsets.java#avx2-v032-A │ │ │ │ Passed: compiler/loopopts/superword/TestDependencyOffsets.java#avx2-v032-U │ │ │ │ +Passed: compiler/loopopts/superword/TestDependencyOffsets.java#avx512bw-v032-A │ │ │ │ +Passed: compiler/loopopts/superword/TestDependencyOffsets.java#avx512bw-v032-U │ │ │ │ +Passed: compiler/loopopts/superword/TestDependencyOffsets.java#avx512bw-v064-A │ │ │ │ +Passed: compiler/loopopts/superword/TestDependencyOffsets.java#avx512bw-v064-U │ │ │ │ +Passed: compiler/loopopts/superword/TestDependencyOffsets.java#avx512-v032-A │ │ │ │ +Passed: compiler/loopopts/superword/TestDependencyOffsets.java#avx512-v032-U │ │ │ │ +Passed: compiler/loopopts/superword/TestDependencyOffsets.java#avx512-v064-A │ │ │ │ +Passed: compiler/loopopts/superword/TestDependencyOffsets.java#avx512-v064-U │ │ │ │ Passed: compiler/loopopts/superword/TestDependencyOffsets.java#sse4-v002-A │ │ │ │ Passed: compiler/loopopts/superword/TestDependencyOffsets.java#sse4-v002-U │ │ │ │ Passed: compiler/loopopts/superword/TestDependencyOffsets.java#sse4-v004-A │ │ │ │ Passed: compiler/loopopts/superword/TestDependencyOffsets.java#sse4-v004-U │ │ │ │ Passed: compiler/loopopts/superword/TestDependencyOffsets.java#sse4-v008-A │ │ │ │ Passed: compiler/loopopts/superword/TestDependencyOffsets.java#sse4-v008-U │ │ │ │ Passed: compiler/loopopts/superword/TestDependencyOffsets.java#sse4-v016-A │ │ │ │ @@ -2003,19 +2016,21 @@ │ │ │ │ Passed: compiler/vectorization/TestNaNVector.java │ │ │ │ Passed: compiler/vectorization/TestNarrowedIntegerReverseBytes.java │ │ │ │ Passed: compiler/vectorization/TestNumberOfContinuousZeros.java │ │ │ │ Passed: compiler/vectorization/TestOptionVectorize.java │ │ │ │ Passed: compiler/vectorization/TestOptionVectorizeIR.java │ │ │ │ Passed: compiler/vectorization/TestOverlappingMismatchedAccesses.java │ │ │ │ Passed: compiler/vectorization/TestPopCountVector.java │ │ │ │ +Passed: compiler/vectorization/TestPopCountVectorLong.java │ │ │ │ Passed: compiler/vectorization/TestPopulateIndex.java │ │ │ │ Passed: compiler/vectorization/TestReplicateLoopIV.java │ │ │ │ Passed: compiler/vectorization/TestReverseBitsVector.java │ │ │ │ Passed: compiler/vectorization/TestReverseBytes.java │ │ │ │ Passed: compiler/vectorization/TestRotateByteAndShortVector.java │ │ │ │ +Passed: compiler/vectorization/TestRoundVectDouble.java │ │ │ │ Passed: compiler/vectorization/TestRoundVectFloat.java │ │ │ │ Passed: compiler/vectorization/TestSignumVector.java │ │ │ │ Passed: compiler/vectorization/TestSmallVectorPopIndex.java │ │ │ │ Passed: compiler/vectorization/TestSubwordReverseBytes.java │ │ │ │ Passed: compiler/vectorization/TestUnexpectedLoadOrdering.java │ │ │ │ Passed: compiler/vectorization/TestVectorsNotSavedAtSafepoint.java │ │ │ │ Passed: compiler/vectorization/TestVectorUnalignedOffset.java │ │ │ │ @@ -3146,14 +3161,14 @@ │ │ │ │ Passed: serviceability/tmtools/jstat/GcCapacityTest.java │ │ │ │ Passed: serviceability/tmtools/jstat/GcCauseTest01.java │ │ │ │ Passed: serviceability/tmtools/jstat/GcCauseTest02.java │ │ │ │ Passed: serviceability/tmtools/jstat/GcCauseTest03.java │ │ │ │ Passed: serviceability/tmtools/jstat/GcNewTest.java │ │ │ │ Passed: serviceability/tmtools/jstat/GcTest01.java │ │ │ │ Passed: serviceability/tmtools/jstat/GcTest02.java │ │ │ │ -Test results: passed: 3,150; skipped: 4; excluded: 42; did not match keywords: 75; did not meet platform requirements: 179 │ │ │ │ +Test results: passed: 3,165; skipped: 4; excluded: 42; did not match keywords: 75; did not meet platform requirements: 164 │ │ │ │ Framework-based tests: 2,176 = 1,909 TestNG + 267 JUnit │ │ │ │ Report written to /build/reproducible-path/openjdk-21-21.0.13+9/jtreg-test-output/hotspot/0/JTreport/html/report.html │ │ │ │ Results written to /tmp/hotspot/JTwork │ │ │ │ [debian/tests/jtreg-autopkgtest.sh] nothing to cleanup │ │ │ │ Unable to compare jtreg results: no build jtreport found for hotspot/amd64. │ │ │ │ Reason: '/usr/share/doc/openjdk-21-jre-headless//test-amd64/jtreport-hotspot.tar.gz' does not exist. │ │ ├── ./usr/share/doc/openjdk-21-jre-headless/test-amd64/check-jdk-hotspot.log.gz │ │ │ ├── check-jdk-hotspot.log │ │ │ │ @@ -667,14 +667,15 @@ │ │ │ │ Passed: java/io/File/ListRoots.java │ │ │ │ Passed: java/io/File/ListSpace.java │ │ │ │ Passed: java/io/File/MaxPathLength.java │ │ │ │ Passed: java/io/File/Mkdir.java │ │ │ │ Passed: java/io/File/NulFile.java │ │ │ │ Passed: java/io/File/NullArgs.java │ │ │ │ Passed: java/io/File/SetAccess.java │ │ │ │ +Passed: java/io/File/SetLastModified.java │ │ │ │ Passed: java/io/File/SetReadOnly.java │ │ │ │ Passed: java/io/File/SymLinks.java │ │ │ │ Passed: java/io/File/TempDirDoesNotExist.java │ │ │ │ Passed: java/io/File/TimeZoneLastModified.java │ │ │ │ Passed: java/io/File/ToURI.java │ │ │ │ Passed: java/io/File/ToURL.java │ │ │ │ Passed: java/io/File/Unicode.java │ │ │ │ @@ -2670,14 +2671,15 @@ │ │ │ │ Passed: java/nio/channels/AsynchronousSocketChannel/StressLoopback.java │ │ │ │ Passed: java/nio/channels/Channels/Basic.java │ │ │ │ Passed: java/nio/channels/Channels/Basic2.java │ │ │ │ Passed: java/nio/channels/Channels/CloseWriterOnFailedFlush.java │ │ │ │ Passed: java/nio/channels/Channels/EncodingTest.java │ │ │ │ Passed: java/nio/channels/Channels/ReadByte.java │ │ │ │ Passed: java/nio/channels/Channels/ReadOffset.java │ │ │ │ +Passed: java/nio/channels/Channels/ReadXBytes.java │ │ │ │ Passed: java/nio/channels/Channels/ShortWrite.java │ │ │ │ Passed: java/nio/channels/Channels/SocketChannelStreams.java │ │ │ │ Passed: java/nio/channels/Channels/TinyBuffers.java │ │ │ │ Passed: java/nio/channels/Channels/TransferTo_2GB_transferFrom.java │ │ │ │ Passed: java/nio/channels/Channels/TransferTo_2GB_transferTo.java │ │ │ │ Passed: java/nio/channels/Channels/TransferTo.java │ │ │ │ Passed: java/nio/channels/Channels/TransferTo2.java │ │ │ │ @@ -6506,16 +6508,16 @@ │ │ │ │ Passed: tools/launcher/TestXcheckJNIWarnings.java#jdwp-agent │ │ │ │ Passed: tools/launcher/TestXcheckJNIWarnings.java#noagent │ │ │ │ Passed: tools/launcher/ToolsOpts.java │ │ │ │ Passed: tools/launcher/TooSmallStackSize.java │ │ │ │ Passed: tools/launcher/UnicodeTest.java │ │ │ │ Passed: tools/launcher/UnresolvedExceptions.java │ │ │ │ Passed: tools/launcher/VersionCheck.java │ │ │ │ -Test results: passed: 6,501; failed: 9; skipped: 115; excluded: 38; did not match keywords: 37; did not meet module requirements: 3; did not meet platform requirements: 101 │ │ │ │ -Framework-based tests: 335,210 = 164,236 TestNG + 170,974 JUnit │ │ │ │ +Test results: passed: 6,503; failed: 9; skipped: 115; excluded: 38; did not match keywords: 37; did not meet module requirements: 3; did not meet platform requirements: 99 │ │ │ │ +Framework-based tests: 335,229 = 164,255 TestNG + 170,974 JUnit │ │ │ │ Report written to /build/reproducible-path/openjdk-21-21.0.13+9/jtreg-test-output/jdk/0/JTreport/html/report.html │ │ │ │ Results written to /tmp/jdk/JTwork │ │ │ │ Directory "jtreg-test-output/jdk/1/JTreport" not found: creating │ │ │ │ FAILED: java/net/MulticastSocket/B6427403.java │ │ │ │ FAILED: java/net/MulticastSocket/NoLoopbackPackets.java │ │ │ │ FAILED: java/net/MulticastSocket/Promiscuous.java │ │ │ │ FAILED: java/net/MulticastSocket/SetLoopbackMode.java │ │ ├── ./usr/share/doc/openjdk-21-jre-headless/test-amd64/failed_tests-hotspot.tar.gz │ │ │ ├── failed_tests-hotspot.tar │ │ │ │ ├── file list │ │ │ │ │ @@ -1,9 +1,9 @@ │ │ │ │ │ --rw-r--r-- 0 sbuild (999) sbuild (999) 6765 2026-10-22 23:55:24.000000 jtreg-test-output/jdk/JTwork/java/net/MulticastSocket/B6427403.jtr │ │ │ │ │ --rw-r--r-- 0 sbuild (999) sbuild (999) 7782 2026-10-22 23:55:24.000000 jtreg-test-output/jdk/JTwork/java/net/MulticastSocket/NoLoopbackPackets.jtr │ │ │ │ │ --rw-r--r-- 0 sbuild (999) sbuild (999) 7788 2026-10-22 23:55:24.000000 jtreg-test-output/jdk/JTwork/java/net/MulticastSocket/Promiscuous.jtr │ │ │ │ │ --rw-r--r-- 0 sbuild (999) sbuild (999) 8407 2026-10-22 23:55:24.000000 jtreg-test-output/jdk/JTwork/java/net/MulticastSocket/SetLoopbackMode.jtr │ │ │ │ │ --rw-r--r-- 0 sbuild (999) sbuild (999) 8826 2026-10-22 23:55:24.000000 jtreg-test-output/jdk/JTwork/java/net/MulticastSocket/SetLoopbackModeIPv4.jtr │ │ │ │ │ --rw-r--r-- 0 sbuild (999) sbuild (999) 9678 2026-10-22 23:55:24.000000 jtreg-test-output/jdk/JTwork/java/net/MulticastSocket/Test.jtr │ │ │ │ │ --rw-r--r-- 0 sbuild (999) sbuild (999) 7427 2026-10-22 23:55:25.000000 jtreg-test-output/jdk/JTwork/java/net/SocketOption/OptionsTest.jtr │ │ │ │ │ --rw-r--r-- 0 sbuild (999) sbuild (999) 15114 2026-10-22 23:55:26.000000 jtreg-test-output/jdk/JTwork/java/net/SocketPermission/SocketPermissionTest.jtr │ │ │ │ │ --rw-r--r-- 0 sbuild (999) sbuild (999) 25671 2026-10-22 23:55:29.000000 jtreg-test-output/jdk/JTwork/sun/security/krb5/auto/Addresses.jtr │ │ │ │ │ +-rw-r--r-- 0 sbuild (999) sbuild (999) 6764 2026-10-26 06:46:25.000000 jtreg-test-output/jdk/JTwork/java/net/MulticastSocket/B6427403.jtr │ │ │ │ │ +-rw-r--r-- 0 sbuild (999) sbuild (999) 7783 2026-10-26 06:46:25.000000 jtreg-test-output/jdk/JTwork/java/net/MulticastSocket/NoLoopbackPackets.jtr │ │ │ │ │ +-rw-r--r-- 0 sbuild (999) sbuild (999) 7787 2026-10-26 06:46:26.000000 jtreg-test-output/jdk/JTwork/java/net/MulticastSocket/Promiscuous.jtr │ │ │ │ │ +-rw-r--r-- 0 sbuild (999) sbuild (999) 8403 2026-10-26 06:46:26.000000 jtreg-test-output/jdk/JTwork/java/net/MulticastSocket/SetLoopbackMode.jtr │ │ │ │ │ +-rw-r--r-- 0 sbuild (999) sbuild (999) 8821 2026-10-26 06:46:26.000000 jtreg-test-output/jdk/JTwork/java/net/MulticastSocket/SetLoopbackModeIPv4.jtr │ │ │ │ │ +-rw-r--r-- 0 sbuild (999) sbuild (999) 9677 2026-10-26 06:46:26.000000 jtreg-test-output/jdk/JTwork/java/net/MulticastSocket/Test.jtr │ │ │ │ │ +-rw-r--r-- 0 sbuild (999) sbuild (999) 7428 2026-10-26 06:46:26.000000 jtreg-test-output/jdk/JTwork/java/net/SocketOption/OptionsTest.jtr │ │ │ │ │ +-rw-r--r-- 0 sbuild (999) sbuild (999) 15109 2026-10-26 06:46:28.000000 jtreg-test-output/jdk/JTwork/java/net/SocketPermission/SocketPermissionTest.jtr │ │ │ │ │ +-rw-r--r-- 0 sbuild (999) sbuild (999) 25668 2026-10-26 06:46:30.000000 jtreg-test-output/jdk/JTwork/sun/security/krb5/auto/Addresses.jtr │ │ │ │ ├── jtreg-test-output/jdk/JTwork/java/net/MulticastSocket/B6427403.jtr │ │ │ │ │ @@ -1,70 +1,70 @@ │ │ │ │ │ #Test Results (version 2) │ │ │ │ │ -#Thu Oct 22 23:55:24 UTC 2026 │ │ │ │ │ +#Mon Oct 26 06:46:25 UTC 2026 │ │ │ │ │ #-----testdescription----- │ │ │ │ │ $file=/build/reproducible-path/openjdk-21-21.0.13+9/test/jdk/java/net/MulticastSocket/B6427403.java │ │ │ │ │ $root=/build/reproducible-path/openjdk-21-21.0.13+9/test/jdk │ │ │ │ │ keywords=bug6427403 │ │ │ │ │ run=USER_SPECIFIED main B6427403\n │ │ │ │ │ source=B6427403.java │ │ │ │ │ title=java.net.MulticastSocket.joinGroup() reports 'socket closed' │ │ │ │ │ │ │ │ │ │ #-----environment----- │ │ │ │ │ │ │ │ │ │ #-----testresult----- │ │ │ │ │ description=file\:/build/reproducible-path/openjdk-21-21.0.13+9/test/jdk/java/net/MulticastSocket/B6427403.java │ │ │ │ │ -elapsed=612 0\:00\:00.612 │ │ │ │ │ -end=Thu Oct 22 23\:55\:24 UTC 2026 │ │ │ │ │ +elapsed=550 0\:00\:00.550 │ │ │ │ │ +end=Mon Oct 26 06\:46\:25 UTC 2026 │ │ │ │ │ environment=regtest │ │ │ │ │ execStatus=Failed. Execution failed\: `main' threw exception\: java.net.SocketException\: No such device (setsockopt failed) │ │ │ │ │ harnessLoaderMode=Classpath Loader │ │ │ │ │ harnessVariety=Full Bundle │ │ │ │ │ hostname=sbuild │ │ │ │ │ javatestOS=Linux 6.12.113+deb13-amd64 (amd64) │ │ │ │ │ javatestVersion=6.0-ea+b26-2026-03-18-${BUILT_FROM_COMMIT} │ │ │ │ │ jtregVersion=jtreg 8.3 src 1 │ │ │ │ │ script=com.sun.javatest.regtest.exec.RegressionScript │ │ │ │ │ sections=script_messages build main │ │ │ │ │ -start=Thu Oct 22 23\:55\:23 UTC 2026 │ │ │ │ │ +start=Mon Oct 26 06\:46\:25 UTC 2026 │ │ │ │ │ test=java/net/MulticastSocket/B6427403.java │ │ │ │ │ testJDK=/build/reproducible-path/openjdk-21-21.0.13+9/build/bootcycle-build/images/jdk │ │ │ │ │ -testJDK_OS=[name\:Linux,arch\:amd64,version\:6.12.113+deb13-amd64,family\:linux,simple_arch\:x64,simple_version\:6.12,processors\:6,maxMemory\:16775897088,maxSwap\:182536105984] │ │ │ │ │ +testJDK_OS=[name\:Linux,arch\:amd64,version\:6.12.113+deb13-amd64,family\:linux,simple_arch\:x64,simple_version\:6.12,processors\:4,maxMemory\:33662730240,maxSwap\:34359734272] │ │ │ │ │ testJDK_os.arch=amd64 │ │ │ │ │ testJDK_os.name=Linux │ │ │ │ │ testJDK_os.version=6.12.113+deb13-amd64 │ │ │ │ │ -totalTime=616 │ │ │ │ │ +totalTime=556 │ │ │ │ │ user.name=sbuild │ │ │ │ │ work=/tmp/jdk/JTwork/java/net/MulticastSocket │ │ │ │ │ │ │ │ │ │ #section:script_messages │ │ │ │ │ ----------messages:(4/260)---------- │ │ │ │ │ JDK under test: /build/reproducible-path/openjdk-21-21.0.13+9/build/bootcycle-build/images/jdk │ │ │ │ │ openjdk version "21.0.13" 2026-10-20 │ │ │ │ │ OpenJDK Runtime Environment (build 21.0.13+9-1-Debian) │ │ │ │ │ OpenJDK 64-Bit Server VM (build 21.0.13+9-1-Debian, mixed mode, sharing) │ │ │ │ │ │ │ │ │ │ #section:build │ │ │ │ │ ----------messages:(5/178)---------- │ │ │ │ │ command: build B6427403 │ │ │ │ │ reason: Named class compiled on demand │ │ │ │ │ -started: Thu Oct 22 23:55:23.630 UTC 2026 │ │ │ │ │ -finished: Thu Oct 22 23:55:23.642 UTC 2026 │ │ │ │ │ -elapsed time (seconds): 0.012 │ │ │ │ │ +started: Mon Oct 26 06:46:25.442 UTC 2026 │ │ │ │ │ +finished: Mon Oct 26 06:46:25.464 UTC 2026 │ │ │ │ │ +elapsed time (seconds): 0.022 │ │ │ │ │ result: Passed. All files up to date │ │ │ │ │ │ │ │ │ │ #section:main │ │ │ │ │ ----------messages:(8/234)---------- │ │ │ │ │ command: main B6427403 │ │ │ │ │ reason: User specified action: run main B6427403 │ │ │ │ │ -started: Thu Oct 22 23:55:23.643 UTC 2026 │ │ │ │ │ +started: Mon Oct 26 06:46:25.466 UTC 2026 │ │ │ │ │ Mode: agentvm │ │ │ │ │ Agent id: 1 │ │ │ │ │ -Process id: 3533426 │ │ │ │ │ -finished: Thu Oct 22 23:55:24.148 UTC 2026 │ │ │ │ │ -elapsed time (seconds): 0.505 │ │ │ │ │ +Process id: 1026207 │ │ │ │ │ +finished: Mon Oct 26 06:46:25.889 UTC 2026 │ │ │ │ │ +elapsed time (seconds): 0.423 │ │ │ │ │ ----------configuration:(15/666)---------- │ │ │ │ │ Boot Layer │ │ │ │ │ class path: /usr/share/jtreg/lib/javatest.jar │ │ │ │ │ /usr/share/jtreg/lib/jtreg.jar │ │ │ │ │ /usr/share/jtreg/lib/junit-platform-console-standalone.jar │ │ │ │ │ /usr/share/jtreg/lib/testng.jar │ │ │ │ │ /usr/share/jtreg/lib/guice.jar │ │ │ │ ├── jtreg-test-output/jdk/JTwork/java/net/MulticastSocket/NoLoopbackPackets.jtr │ │ │ │ │ @@ -1,75 +1,75 @@ │ │ │ │ │ #Test Results (version 2) │ │ │ │ │ -#Thu Oct 22 23:55:24 UTC 2026 │ │ │ │ │ +#Mon Oct 26 06:46:25 UTC 2026 │ │ │ │ │ #-----testdescription----- │ │ │ │ │ $file=/build/reproducible-path/openjdk-21-21.0.13+9/test/jdk/java/net/MulticastSocket/NoLoopbackPackets.java │ │ │ │ │ $root=/build/reproducible-path/openjdk-21-21.0.13+9/test/jdk │ │ │ │ │ keywords=bug4742177 │ │ │ │ │ library=/test/lib │ │ │ │ │ requires=os.family \!\= "windows" │ │ │ │ │ run=ASSUMED_ACTION main NoLoopbackPackets\n │ │ │ │ │ source=NoLoopbackPackets.java │ │ │ │ │ title=Re-test IPv6 (and specifically MulticastSocket) with latest Linux & USAGI code │ │ │ │ │ │ │ │ │ │ #-----environment----- │ │ │ │ │ │ │ │ │ │ #-----testresult----- │ │ │ │ │ description=file\:/build/reproducible-path/openjdk-21-21.0.13+9/test/jdk/java/net/MulticastSocket/NoLoopbackPackets.java │ │ │ │ │ -elapsed=95 0\:00\:00.095 │ │ │ │ │ -end=Thu Oct 22 23\:55\:24 UTC 2026 │ │ │ │ │ +elapsed=92 0\:00\:00.092 │ │ │ │ │ +end=Mon Oct 26 06\:46\:25 UTC 2026 │ │ │ │ │ environment=regtest │ │ │ │ │ execStatus=Failed. Execution failed\: `main' threw exception\: java.net.SocketException\: No such device (setsockopt failed) │ │ │ │ │ harnessLoaderMode=Classpath Loader │ │ │ │ │ harnessVariety=Full Bundle │ │ │ │ │ hostname=sbuild │ │ │ │ │ javatestOS=Linux 6.12.113+deb13-amd64 (amd64) │ │ │ │ │ javatestVersion=6.0-ea+b26-2026-03-18-${BUILT_FROM_COMMIT} │ │ │ │ │ jtregVersion=jtreg 8.3 src 1 │ │ │ │ │ script=com.sun.javatest.regtest.exec.RegressionScript │ │ │ │ │ sections=script_messages build main │ │ │ │ │ -start=Thu Oct 22 23\:55\:24 UTC 2026 │ │ │ │ │ +start=Mon Oct 26 06\:46\:25 UTC 2026 │ │ │ │ │ test=java/net/MulticastSocket/NoLoopbackPackets.java │ │ │ │ │ testJDK=/build/reproducible-path/openjdk-21-21.0.13+9/build/bootcycle-build/images/jdk │ │ │ │ │ -testJDK_OS=[name\:Linux,arch\:amd64,version\:6.12.113+deb13-amd64,family\:linux,simple_arch\:x64,simple_version\:6.12,processors\:6,maxMemory\:16775897088,maxSwap\:182536105984] │ │ │ │ │ +testJDK_OS=[name\:Linux,arch\:amd64,version\:6.12.113+deb13-amd64,family\:linux,simple_arch\:x64,simple_version\:6.12,processors\:4,maxMemory\:33662730240,maxSwap\:34359734272] │ │ │ │ │ testJDK_os.arch=amd64 │ │ │ │ │ testJDK_os.name=Linux │ │ │ │ │ testJDK_os.version=6.12.113+deb13-amd64 │ │ │ │ │ -totalTime=97 │ │ │ │ │ +totalTime=93 │ │ │ │ │ user.name=sbuild │ │ │ │ │ work=/tmp/jdk/JTwork/java/net/MulticastSocket │ │ │ │ │ │ │ │ │ │ #section:script_messages │ │ │ │ │ ----------messages:(7/468)---------- │ │ │ │ │ JDK under test: /build/reproducible-path/openjdk-21-21.0.13+9/build/bootcycle-build/images/jdk │ │ │ │ │ openjdk version "21.0.13" 2026-10-20 │ │ │ │ │ OpenJDK Runtime Environment (build 21.0.13+9-1-Debian) │ │ │ │ │ OpenJDK 64-Bit Server VM (build 21.0.13+9-1-Debian, mixed mode, sharing) │ │ │ │ │ Library /test/lib; kind: packages │ │ │ │ │ source directory: /build/reproducible-path/openjdk-21-21.0.13+9/test/lib │ │ │ │ │ class directory: /tmp/jdk/JTwork/classes/java/net/MulticastSocket/NoLoopbackPackets.d/test/lib │ │ │ │ │ │ │ │ │ │ #section:build │ │ │ │ │ -----------messages:(5/185)---------- │ │ │ │ │ +----------messages:(5/187)---------- │ │ │ │ │ command: build NoLoopbackPackets │ │ │ │ │ reason: Named class compiled on demand │ │ │ │ │ -started: Thu Oct 22 23:55:24.159 UTC 2026 │ │ │ │ │ -finished: Thu Oct 22 23:55:24.159 UTC 2026 │ │ │ │ │ -elapsed time (seconds): 0.0 │ │ │ │ │ +started: Mon Oct 26 06:46:25.902 UTC 2026 │ │ │ │ │ +finished: Mon Oct 26 06:46:25.903 UTC 2026 │ │ │ │ │ +elapsed time (seconds): 0.001 │ │ │ │ │ result: Passed. All files up to date │ │ │ │ │ │ │ │ │ │ #section:main │ │ │ │ │ ----------messages:(8/264)---------- │ │ │ │ │ command: main NoLoopbackPackets │ │ │ │ │ reason: Assumed action based on file name: run main NoLoopbackPackets │ │ │ │ │ -started: Thu Oct 22 23:55:24.159 UTC 2026 │ │ │ │ │ +started: Mon Oct 26 06:46:25.903 UTC 2026 │ │ │ │ │ Mode: agentvm │ │ │ │ │ Agent id: 1 │ │ │ │ │ -Process id: 3533426 │ │ │ │ │ -finished: Thu Oct 22 23:55:24.251 UTC 2026 │ │ │ │ │ -elapsed time (seconds): 0.092 │ │ │ │ │ +Process id: 1026207 │ │ │ │ │ +finished: Mon Oct 26 06:46:25.991 UTC 2026 │ │ │ │ │ +elapsed time (seconds): 0.088 │ │ │ │ │ ----------configuration:(17/836)---------- │ │ │ │ │ Boot Layer │ │ │ │ │ class path: /usr/share/jtreg/lib/javatest.jar │ │ │ │ │ /usr/share/jtreg/lib/jtreg.jar │ │ │ │ │ /usr/share/jtreg/lib/junit-platform-console-standalone.jar │ │ │ │ │ /usr/share/jtreg/lib/testng.jar │ │ │ │ │ /usr/share/jtreg/lib/guice.jar │ │ │ │ │ @@ -113,15 +113,15 @@ │ │ │ │ │ -Dtest.class.path=/tmp/jdk/JTwork/classes/java/net/MulticastSocket/NoLoopbackPackets.d:/tmp/jdk/JTwork/classes/java/net/MulticastSocket/NoLoopbackPackets.d/test/lib \\ │ │ │ │ │ -Dtest.class.path.prefix=/tmp/jdk/JTwork/classes/java/net/MulticastSocket/NoLoopbackPackets.d:/build/reproducible-path/openjdk-21-21.0.13+9/test/jdk/java/net/MulticastSocket:/tmp/jdk/JTwork/classes/java/net/MulticastSocket/NoLoopbackPackets.d/test/lib \\ │ │ │ │ │ -classpath /tmp/jdk/JTwork/classes/java/net/MulticastSocket/NoLoopbackPackets.d:/build/reproducible-path/openjdk-21-21.0.13+9/test/jdk/java/net/MulticastSocket:/tmp/jdk/JTwork/classes/java/net/MulticastSocket/NoLoopbackPackets.d/test/lib:/build/reproducible-path/openjdk-21-21.0.13+9/test/lib:/usr/share/jtreg/lib/javatest.jar:/usr/share/jtreg/lib/jtreg.jar \\ │ │ │ │ │ NoLoopbackPackets │ │ │ │ │ ----------stdout:(0/0)---------- │ │ │ │ │ ----------stderr:(0/0)---------- │ │ │ │ │ ----------System.out:(1/32)---------- │ │ │ │ │ -joining group: /224.1.1.1:43711 │ │ │ │ │ +joining group: /224.1.1.1:37412 │ │ │ │ │ ----------System.err:(17/1050)---------- │ │ │ │ │ java.net.SocketException: No such device (setsockopt failed) │ │ │ │ │ at java.base/sun.nio.ch.Net.joinOrDrop4(Native Method) │ │ │ │ │ at java.base/sun.nio.ch.Net.join4(Net.java:720) │ │ │ │ │ at java.base/sun.nio.ch.DatagramChannelImpl.innerJoin(DatagramChannelImpl.java:1676) │ │ │ │ │ at java.base/sun.nio.ch.DatagramChannelImpl.join(DatagramChannelImpl.java:1694) │ │ │ │ │ at java.base/sun.nio.ch.DatagramSocketAdaptor.joinGroup(DatagramSocketAdaptor.java:494) │ │ │ │ ├── jtreg-test-output/jdk/JTwork/java/net/MulticastSocket/Promiscuous.jtr │ │ │ │ │ @@ -1,42 +1,42 @@ │ │ │ │ │ #Test Results (version 2) │ │ │ │ │ -#Thu Oct 22 23:55:24 UTC 2026 │ │ │ │ │ +#Mon Oct 26 06:46:26 UTC 2026 │ │ │ │ │ #-----testdescription----- │ │ │ │ │ $file=/build/reproducible-path/openjdk-21-21.0.13+9/test/jdk/java/net/MulticastSocket/Promiscuous.java │ │ │ │ │ $root=/build/reproducible-path/openjdk-21-21.0.13+9/test/jdk │ │ │ │ │ keywords=bug8014499 bug8219804 othervm │ │ │ │ │ library=/test/lib │ │ │ │ │ run=USER_SPECIFIED main Promiscuous\nUSER_SPECIFIED main/othervm -Djava.net.preferIPv4Stack\=true Promiscuous\n │ │ │ │ │ source=Promiscuous.java │ │ │ │ │ title=Test for interference when two sockets are bound to the same port but joined to different multicast groups │ │ │ │ │ │ │ │ │ │ #-----environment----- │ │ │ │ │ │ │ │ │ │ #-----testresult----- │ │ │ │ │ description=file\:/build/reproducible-path/openjdk-21-21.0.13+9/test/jdk/java/net/MulticastSocket/Promiscuous.java │ │ │ │ │ -elapsed=82 0\:00\:00.082 │ │ │ │ │ -end=Thu Oct 22 23\:55\:24 UTC 2026 │ │ │ │ │ +elapsed=77 0\:00\:00.077 │ │ │ │ │ +end=Mon Oct 26 06\:46\:26 UTC 2026 │ │ │ │ │ environment=regtest │ │ │ │ │ execStatus=Failed. Execution failed\: `main' threw exception\: java.net.SocketException\: Network is unreachable │ │ │ │ │ harnessLoaderMode=Classpath Loader │ │ │ │ │ harnessVariety=Full Bundle │ │ │ │ │ hostname=sbuild │ │ │ │ │ javatestOS=Linux 6.12.113+deb13-amd64 (amd64) │ │ │ │ │ javatestVersion=6.0-ea+b26-2026-03-18-${BUILT_FROM_COMMIT} │ │ │ │ │ jtregVersion=jtreg 8.3 src 1 │ │ │ │ │ script=com.sun.javatest.regtest.exec.RegressionScript │ │ │ │ │ sections=script_messages build main │ │ │ │ │ -start=Thu Oct 22 23\:55\:24 UTC 2026 │ │ │ │ │ +start=Mon Oct 26 06\:46\:25 UTC 2026 │ │ │ │ │ test=java/net/MulticastSocket/Promiscuous.java │ │ │ │ │ testJDK=/build/reproducible-path/openjdk-21-21.0.13+9/build/bootcycle-build/images/jdk │ │ │ │ │ -testJDK_OS=[name\:Linux,arch\:amd64,version\:6.12.113+deb13-amd64,family\:linux,simple_arch\:x64,simple_version\:6.12,processors\:6,maxMemory\:16775897088,maxSwap\:182536105984] │ │ │ │ │ +testJDK_OS=[name\:Linux,arch\:amd64,version\:6.12.113+deb13-amd64,family\:linux,simple_arch\:x64,simple_version\:6.12,processors\:4,maxMemory\:33662730240,maxSwap\:34359734272] │ │ │ │ │ testJDK_os.arch=amd64 │ │ │ │ │ testJDK_os.name=Linux │ │ │ │ │ testJDK_os.version=6.12.113+deb13-amd64 │ │ │ │ │ -totalTime=83 │ │ │ │ │ +totalTime=79 │ │ │ │ │ user.name=sbuild │ │ │ │ │ work=/tmp/jdk/JTwork/java/net/MulticastSocket │ │ │ │ │ │ │ │ │ │ #section:script_messages │ │ │ │ │ ----------messages:(7/462)---------- │ │ │ │ │ JDK under test: /build/reproducible-path/openjdk-21-21.0.13+9/build/bootcycle-build/images/jdk │ │ │ │ │ openjdk version "21.0.13" 2026-10-20 │ │ │ │ │ @@ -46,29 +46,29 @@ │ │ │ │ │ source directory: /build/reproducible-path/openjdk-21-21.0.13+9/test/lib │ │ │ │ │ class directory: /tmp/jdk/JTwork/classes/java/net/MulticastSocket/Promiscuous.d/test/lib │ │ │ │ │ │ │ │ │ │ #section:build │ │ │ │ │ ----------messages:(5/179)---------- │ │ │ │ │ command: build Promiscuous │ │ │ │ │ reason: Named class compiled on demand │ │ │ │ │ -started: Thu Oct 22 23:55:24.258 UTC 2026 │ │ │ │ │ -finished: Thu Oct 22 23:55:24.258 UTC 2026 │ │ │ │ │ +started: Mon Oct 26 06:46:26.000 UTC 2026 │ │ │ │ │ +finished: Mon Oct 26 06:46:26.000 UTC 2026 │ │ │ │ │ elapsed time (seconds): 0.0 │ │ │ │ │ result: Passed. All files up to date │ │ │ │ │ │ │ │ │ │ #section:main │ │ │ │ │ ----------messages:(8/240)---------- │ │ │ │ │ command: main Promiscuous │ │ │ │ │ reason: User specified action: run main Promiscuous │ │ │ │ │ -started: Thu Oct 22 23:55:24.258 UTC 2026 │ │ │ │ │ +started: Mon Oct 26 06:46:26.000 UTC 2026 │ │ │ │ │ Mode: agentvm │ │ │ │ │ Agent id: 1 │ │ │ │ │ -Process id: 3533426 │ │ │ │ │ -finished: Thu Oct 22 23:55:24.336 UTC 2026 │ │ │ │ │ -elapsed time (seconds): 0.078 │ │ │ │ │ +Process id: 1026207 │ │ │ │ │ +finished: Mon Oct 26 06:46:26.074 UTC 2026 │ │ │ │ │ +elapsed time (seconds): 0.074 │ │ │ │ │ ----------configuration:(17/824)---------- │ │ │ │ │ Boot Layer │ │ │ │ │ class path: /usr/share/jtreg/lib/javatest.jar │ │ │ │ │ /usr/share/jtreg/lib/jtreg.jar │ │ │ │ │ /usr/share/jtreg/lib/junit-platform-console-standalone.jar │ │ │ │ │ /usr/share/jtreg/lib/testng.jar │ │ │ │ │ /usr/share/jtreg/lib/guice.jar │ │ │ │ │ @@ -112,16 +112,16 @@ │ │ │ │ │ -Dtest.class.path=/tmp/jdk/JTwork/classes/java/net/MulticastSocket/Promiscuous.d:/tmp/jdk/JTwork/classes/java/net/MulticastSocket/Promiscuous.d/test/lib \\ │ │ │ │ │ -Dtest.class.path.prefix=/tmp/jdk/JTwork/classes/java/net/MulticastSocket/Promiscuous.d:/build/reproducible-path/openjdk-21-21.0.13+9/test/jdk/java/net/MulticastSocket:/tmp/jdk/JTwork/classes/java/net/MulticastSocket/Promiscuous.d/test/lib \\ │ │ │ │ │ -classpath /tmp/jdk/JTwork/classes/java/net/MulticastSocket/Promiscuous.d:/build/reproducible-path/openjdk-21-21.0.13+9/test/jdk/java/net/MulticastSocket:/tmp/jdk/JTwork/classes/java/net/MulticastSocket/Promiscuous.d/test/lib:/build/reproducible-path/openjdk-21-21.0.13+9/test/lib:/usr/share/jtreg/lib/javatest.jar:/usr/share/jtreg/lib/jtreg.jar \\ │ │ │ │ │ Promiscuous │ │ │ │ │ ----------stdout:(0/0)---------- │ │ │ │ │ ----------stderr:(0/0)---------- │ │ │ │ │ ----------System.out:(2/58)---------- │ │ │ │ │ -Using port: 48325 │ │ │ │ │ -Sending datagram to: /224.1.1.120/48325 │ │ │ │ │ +Using port: 42605 │ │ │ │ │ +Sending datagram to: /224.1.1.120/42605 │ │ │ │ │ ----------System.err:(18/1123)---------- │ │ │ │ │ java.net.SocketException: Network is unreachable │ │ │ │ │ at java.base/sun.nio.ch.DatagramChannelImpl.send0(Native Method) │ │ │ │ │ at java.base/sun.nio.ch.DatagramChannelImpl.sendFromNativeBuffer(DatagramChannelImpl.java:1005) │ │ │ │ │ at java.base/sun.nio.ch.DatagramChannelImpl.send(DatagramChannelImpl.java:966) │ │ │ │ │ at java.base/sun.nio.ch.DatagramChannelImpl.send(DatagramChannelImpl.java:889) │ │ │ │ │ at java.base/sun.nio.ch.DatagramChannelImpl.blockingSend(DatagramChannelImpl.java:952) │ │ │ │ ├── jtreg-test-output/jdk/JTwork/java/net/MulticastSocket/SetLoopbackMode.jtr │ │ │ │ │ @@ -1,85 +1,85 @@ │ │ │ │ │ #Test Results (version 2) │ │ │ │ │ -#Thu Oct 22 23:55:24 UTC 2026 │ │ │ │ │ +#Mon Oct 26 06:46:26 UTC 2026 │ │ │ │ │ #-----testdescription----- │ │ │ │ │ $file=/build/reproducible-path/openjdk-21-21.0.13+9/test/jdk/java/net/MulticastSocket/SetLoopbackMode.java │ │ │ │ │ $root=/build/reproducible-path/openjdk-21-21.0.13+9/test/jdk │ │ │ │ │ keywords=bug4686717 othervm │ │ │ │ │ library=/test/lib │ │ │ │ │ modules=java.base/java.net\:+open │ │ │ │ │ run=USER_SPECIFIED build jdk.test.lib.NetworkConfiguration jdk.test.lib.Platform\nUSER_SPECIFIED main/othervm SetLoopbackMode\n │ │ │ │ │ source=SetLoopbackMode.java │ │ │ │ │ title=Test MulticastSocket.setLoopbackMode │ │ │ │ │ │ │ │ │ │ #-----environment----- │ │ │ │ │ │ │ │ │ │ #-----testresult----- │ │ │ │ │ description=file\:/build/reproducible-path/openjdk-21-21.0.13+9/test/jdk/java/net/MulticastSocket/SetLoopbackMode.java │ │ │ │ │ -elapsed=215 0\:00\:00.215 │ │ │ │ │ -end=Thu Oct 22 23\:55\:24 UTC 2026 │ │ │ │ │ +elapsed=164 0\:00\:00.164 │ │ │ │ │ +end=Mon Oct 26 06\:46\:26 UTC 2026 │ │ │ │ │ environment=regtest │ │ │ │ │ execStatus=Failed. Execution failed\: `main' threw exception\: java.net.SocketException\: No such device (setsockopt failed) │ │ │ │ │ harnessLoaderMode=Classpath Loader │ │ │ │ │ harnessVariety=Full Bundle │ │ │ │ │ hostname=sbuild │ │ │ │ │ javatestOS=Linux 6.12.113+deb13-amd64 (amd64) │ │ │ │ │ javatestVersion=6.0-ea+b26-2026-03-18-${BUILT_FROM_COMMIT} │ │ │ │ │ jtregVersion=jtreg 8.3 src 1 │ │ │ │ │ modules=java.base/java.net\:+open │ │ │ │ │ script=com.sun.javatest.regtest.exec.RegressionScript │ │ │ │ │ sections=script_messages build build main │ │ │ │ │ -start=Thu Oct 22 23\:55\:24 UTC 2026 │ │ │ │ │ +start=Mon Oct 26 06\:46\:26 UTC 2026 │ │ │ │ │ test=java/net/MulticastSocket/SetLoopbackMode.java │ │ │ │ │ testJDK=/build/reproducible-path/openjdk-21-21.0.13+9/build/bootcycle-build/images/jdk │ │ │ │ │ -testJDK_OS=[name\:Linux,arch\:amd64,version\:6.12.113+deb13-amd64,family\:linux,simple_arch\:x64,simple_version\:6.12,processors\:6,maxMemory\:16775897088,maxSwap\:182536105984] │ │ │ │ │ +testJDK_OS=[name\:Linux,arch\:amd64,version\:6.12.113+deb13-amd64,family\:linux,simple_arch\:x64,simple_version\:6.12,processors\:4,maxMemory\:33662730240,maxSwap\:34359734272] │ │ │ │ │ testJDK_os.arch=amd64 │ │ │ │ │ testJDK_os.name=Linux │ │ │ │ │ testJDK_os.version=6.12.113+deb13-amd64 │ │ │ │ │ -totalTime=217 │ │ │ │ │ +totalTime=165 │ │ │ │ │ user.name=sbuild │ │ │ │ │ work=/tmp/jdk/JTwork/java/net/MulticastSocket │ │ │ │ │ │ │ │ │ │ #section:script_messages │ │ │ │ │ ----------messages:(7/466)---------- │ │ │ │ │ JDK under test: /build/reproducible-path/openjdk-21-21.0.13+9/build/bootcycle-build/images/jdk │ │ │ │ │ openjdk version "21.0.13" 2026-10-20 │ │ │ │ │ OpenJDK Runtime Environment (build 21.0.13+9-1-Debian) │ │ │ │ │ OpenJDK 64-Bit Server VM (build 21.0.13+9-1-Debian, mixed mode, sharing) │ │ │ │ │ Library /test/lib; kind: packages │ │ │ │ │ source directory: /build/reproducible-path/openjdk-21-21.0.13+9/test/lib │ │ │ │ │ class directory: /tmp/jdk/JTwork/classes/java/net/MulticastSocket/SetLoopbackMode.d/test/lib │ │ │ │ │ │ │ │ │ │ #section:build │ │ │ │ │ -----------messages:(5/284)---------- │ │ │ │ │ +----------messages:(5/282)---------- │ │ │ │ │ command: build jdk.test.lib.NetworkConfiguration jdk.test.lib.Platform │ │ │ │ │ reason: User specified action: run build jdk.test.lib.NetworkConfiguration jdk.test.lib.Platform │ │ │ │ │ -started: Thu Oct 22 23:55:24.348 UTC 2026 │ │ │ │ │ -finished: Thu Oct 22 23:55:24.349 UTC 2026 │ │ │ │ │ -elapsed time (seconds): 0.001 │ │ │ │ │ +started: Mon Oct 26 06:46:26.083 UTC 2026 │ │ │ │ │ +finished: Mon Oct 26 06:46:26.083 UTC 2026 │ │ │ │ │ +elapsed time (seconds): 0.0 │ │ │ │ │ result: Passed. All files up to date │ │ │ │ │ │ │ │ │ │ #section:build │ │ │ │ │ ----------messages:(5/183)---------- │ │ │ │ │ command: build SetLoopbackMode │ │ │ │ │ reason: Named class compiled on demand │ │ │ │ │ -started: Thu Oct 22 23:55:24.349 UTC 2026 │ │ │ │ │ -finished: Thu Oct 22 23:55:24.349 UTC 2026 │ │ │ │ │ +started: Mon Oct 26 06:46:26.083 UTC 2026 │ │ │ │ │ +finished: Mon Oct 26 06:46:26.083 UTC 2026 │ │ │ │ │ elapsed time (seconds): 0.0 │ │ │ │ │ result: Passed. All files up to date │ │ │ │ │ │ │ │ │ │ #section:main │ │ │ │ │ -----------messages:(8/411)---------- │ │ │ │ │ +----------messages:(8/410)---------- │ │ │ │ │ command: main SetLoopbackMode │ │ │ │ │ reason: User specified action: run main/othervm SetLoopbackMode │ │ │ │ │ -started: Thu Oct 22 23:55:24.349 UTC 2026 │ │ │ │ │ +started: Mon Oct 26 06:46:26.084 UTC 2026 │ │ │ │ │ Mode: othervm [/othervm specified] │ │ │ │ │ Additional options from @modules: --add-modules java.base --add-exports java.base/java.net=ALL-UNNAMED --add-opens java.base/java.net=ALL-UNNAMED │ │ │ │ │ -Process id: 3533453 │ │ │ │ │ -finished: Thu Oct 22 23:55:24.558 UTC 2026 │ │ │ │ │ -elapsed time (seconds): 0.209 │ │ │ │ │ +Process id: 1026234 │ │ │ │ │ +finished: Mon Oct 26 06:46:26.244 UTC 2026 │ │ │ │ │ +elapsed time (seconds): 0.16 │ │ │ │ │ ----------configuration:(5/139)---------- │ │ │ │ │ Boot Layer │ │ │ │ │ add modules: java.base │ │ │ │ │ add exports: java.base/java.net ALL-UNNAMED │ │ │ │ │ add opens: java.base/java.net ALL-UNNAMED │ │ │ │ │ │ │ │ │ │ ----------System.out:(5/155)---------- │ │ │ │ ├── jtreg-test-output/jdk/JTwork/java/net/MulticastSocket/SetLoopbackModeIPv4.jtr │ │ │ │ │ @@ -1,85 +1,85 @@ │ │ │ │ │ #Test Results (version 2) │ │ │ │ │ -#Thu Oct 22 23:55:24 UTC 2026 │ │ │ │ │ +#Mon Oct 26 06:46:26 UTC 2026 │ │ │ │ │ #-----testdescription----- │ │ │ │ │ $file=/build/reproducible-path/openjdk-21-21.0.13+9/test/jdk/java/net/MulticastSocket/SetLoopbackModeIPv4.java │ │ │ │ │ $root=/build/reproducible-path/openjdk-21-21.0.13+9/test/jdk │ │ │ │ │ keywords=bug4686717 bug8241786 othervm │ │ │ │ │ library=/test/lib │ │ │ │ │ modules=java.base/java.net\:+open │ │ │ │ │ run=USER_SPECIFIED build jdk.test.lib.NetworkConfiguration jdk.test.lib.Platform SetLoopbackMode SetLoopbackModeIPv4\nUSER_SPECIFIED main/othervm -Djava.net.preferIPv4Stack\=true SetLoopbackModeIPv4\n │ │ │ │ │ source=SetLoopbackModeIPv4.java │ │ │ │ │ title=Test MulticastSocket.setLoopbackMode with IPv4 addresses │ │ │ │ │ │ │ │ │ │ #-----environment----- │ │ │ │ │ │ │ │ │ │ #-----testresult----- │ │ │ │ │ description=file\:/build/reproducible-path/openjdk-21-21.0.13+9/test/jdk/java/net/MulticastSocket/SetLoopbackModeIPv4.java │ │ │ │ │ -elapsed=200 0\:00\:00.200 │ │ │ │ │ -end=Thu Oct 22 23\:55\:24 UTC 2026 │ │ │ │ │ +elapsed=140 0\:00\:00.140 │ │ │ │ │ +end=Mon Oct 26 06\:46\:26 UTC 2026 │ │ │ │ │ environment=regtest │ │ │ │ │ execStatus=Failed. Execution failed\: `main' threw exception\: java.net.SocketException\: No such device (setsockopt failed) │ │ │ │ │ harnessLoaderMode=Classpath Loader │ │ │ │ │ harnessVariety=Full Bundle │ │ │ │ │ hostname=sbuild │ │ │ │ │ javatestOS=Linux 6.12.113+deb13-amd64 (amd64) │ │ │ │ │ javatestVersion=6.0-ea+b26-2026-03-18-${BUILT_FROM_COMMIT} │ │ │ │ │ jtregVersion=jtreg 8.3 src 1 │ │ │ │ │ modules=java.base/java.net\:+open │ │ │ │ │ script=com.sun.javatest.regtest.exec.RegressionScript │ │ │ │ │ sections=script_messages build build main │ │ │ │ │ -start=Thu Oct 22 23\:55\:24 UTC 2026 │ │ │ │ │ +start=Mon Oct 26 06\:46\:26 UTC 2026 │ │ │ │ │ test=java/net/MulticastSocket/SetLoopbackModeIPv4.java │ │ │ │ │ testJDK=/build/reproducible-path/openjdk-21-21.0.13+9/build/bootcycle-build/images/jdk │ │ │ │ │ -testJDK_OS=[name\:Linux,arch\:amd64,version\:6.12.113+deb13-amd64,family\:linux,simple_arch\:x64,simple_version\:6.12,processors\:6,maxMemory\:16775897088,maxSwap\:182536105984] │ │ │ │ │ +testJDK_OS=[name\:Linux,arch\:amd64,version\:6.12.113+deb13-amd64,family\:linux,simple_arch\:x64,simple_version\:6.12,processors\:4,maxMemory\:33662730240,maxSwap\:34359734272] │ │ │ │ │ testJDK_os.arch=amd64 │ │ │ │ │ testJDK_os.name=Linux │ │ │ │ │ testJDK_os.version=6.12.113+deb13-amd64 │ │ │ │ │ -totalTime=200 │ │ │ │ │ +totalTime=141 │ │ │ │ │ user.name=sbuild │ │ │ │ │ work=/tmp/jdk/JTwork/java/net/MulticastSocket │ │ │ │ │ │ │ │ │ │ #section:script_messages │ │ │ │ │ ----------messages:(7/470)---------- │ │ │ │ │ JDK under test: /build/reproducible-path/openjdk-21-21.0.13+9/build/bootcycle-build/images/jdk │ │ │ │ │ openjdk version "21.0.13" 2026-10-20 │ │ │ │ │ OpenJDK Runtime Environment (build 21.0.13+9-1-Debian) │ │ │ │ │ OpenJDK 64-Bit Server VM (build 21.0.13+9-1-Debian, mixed mode, sharing) │ │ │ │ │ Library /test/lib; kind: packages │ │ │ │ │ source directory: /build/reproducible-path/openjdk-21-21.0.13+9/test/lib │ │ │ │ │ class directory: /tmp/jdk/JTwork/classes/java/net/MulticastSocket/SetLoopbackModeIPv4.d/test/lib │ │ │ │ │ │ │ │ │ │ #section:build │ │ │ │ │ -----------messages:(5/356)---------- │ │ │ │ │ +----------messages:(5/354)---------- │ │ │ │ │ command: build jdk.test.lib.NetworkConfiguration jdk.test.lib.Platform SetLoopbackMode SetLoopbackModeIPv4 │ │ │ │ │ reason: User specified action: run build jdk.test.lib.NetworkConfiguration jdk.test.lib.Platform SetLoopbackMode SetLoopbackModeIPv4 │ │ │ │ │ -started: Thu Oct 22 23:55:24.566 UTC 2026 │ │ │ │ │ -finished: Thu Oct 22 23:55:24.567 UTC 2026 │ │ │ │ │ -elapsed time (seconds): 0.001 │ │ │ │ │ +started: Mon Oct 26 06:46:26.250 UTC 2026 │ │ │ │ │ +finished: Mon Oct 26 06:46:26.250 UTC 2026 │ │ │ │ │ +elapsed time (seconds): 0.0 │ │ │ │ │ result: Passed. All files up to date │ │ │ │ │ │ │ │ │ │ #section:build │ │ │ │ │ -----------messages:(5/189)---------- │ │ │ │ │ +----------messages:(5/187)---------- │ │ │ │ │ command: build SetLoopbackModeIPv4 │ │ │ │ │ reason: Named class compiled on demand │ │ │ │ │ -started: Thu Oct 22 23:55:24.567 UTC 2026 │ │ │ │ │ -finished: Thu Oct 22 23:55:24.568 UTC 2026 │ │ │ │ │ -elapsed time (seconds): 0.001 │ │ │ │ │ +started: Mon Oct 26 06:46:26.250 UTC 2026 │ │ │ │ │ +finished: Mon Oct 26 06:46:26.250 UTC 2026 │ │ │ │ │ +elapsed time (seconds): 0.0 │ │ │ │ │ result: Passed. All files up to date │ │ │ │ │ │ │ │ │ │ #section:main │ │ │ │ │ ----------messages:(8/483)---------- │ │ │ │ │ command: main -Djava.net.preferIPv4Stack=true SetLoopbackModeIPv4 │ │ │ │ │ reason: User specified action: run main/othervm -Djava.net.preferIPv4Stack=true SetLoopbackModeIPv4 │ │ │ │ │ -started: Thu Oct 22 23:55:24.568 UTC 2026 │ │ │ │ │ +started: Mon Oct 26 06:46:26.250 UTC 2026 │ │ │ │ │ Mode: othervm [/othervm specified] │ │ │ │ │ Additional options from @modules: --add-modules java.base --add-exports java.base/java.net=ALL-UNNAMED --add-opens java.base/java.net=ALL-UNNAMED │ │ │ │ │ -Process id: 3533475 │ │ │ │ │ -finished: Thu Oct 22 23:55:24.762 UTC 2026 │ │ │ │ │ -elapsed time (seconds): 0.194 │ │ │ │ │ +Process id: 1026256 │ │ │ │ │ +finished: Mon Oct 26 06:46:26.388 UTC 2026 │ │ │ │ │ +elapsed time (seconds): 0.138 │ │ │ │ │ ----------configuration:(5/139)---------- │ │ │ │ │ Boot Layer │ │ │ │ │ add modules: java.base │ │ │ │ │ add exports: java.base/java.net ALL-UNNAMED │ │ │ │ │ add opens: java.base/java.net ALL-UNNAMED │ │ │ │ │ │ │ │ │ │ ----------System.out:(5/155)---------- │ │ │ │ ├── jtreg-test-output/jdk/JTwork/java/net/MulticastSocket/Test.jtr │ │ │ │ │ @@ -1,83 +1,83 @@ │ │ │ │ │ #Test Results (version 2) │ │ │ │ │ -#Thu Oct 22 23:55:24 UTC 2026 │ │ │ │ │ +#Mon Oct 26 06:46:26 UTC 2026 │ │ │ │ │ #-----testdescription----- │ │ │ │ │ $file=/build/reproducible-path/openjdk-21-21.0.13+9/test/jdk/java/net/MulticastSocket/Test.java │ │ │ │ │ $root=/build/reproducible-path/openjdk-21-21.0.13+9/test/jdk │ │ │ │ │ keywords=bug4488458 othervm │ │ │ │ │ library=/test/lib │ │ │ │ │ run=USER_SPECIFIED build jdk.test.lib.NetworkConfiguration jdk.test.lib.Platform\nUSER_SPECIFIED main Test\nUSER_SPECIFIED main/othervm -Djava.net.preferIPv4Stack\=true Test\n │ │ │ │ │ source=Test.java │ │ │ │ │ title=IPv4 and IPv6 multicasting broken on Linux │ │ │ │ │ │ │ │ │ │ #-----environment----- │ │ │ │ │ │ │ │ │ │ #-----testresult----- │ │ │ │ │ description=file\:/build/reproducible-path/openjdk-21-21.0.13+9/test/jdk/java/net/MulticastSocket/Test.java │ │ │ │ │ -elapsed=89 0\:00\:00.089 │ │ │ │ │ -end=Thu Oct 22 23\:55\:24 UTC 2026 │ │ │ │ │ +elapsed=95 0\:00\:00.095 │ │ │ │ │ +end=Mon Oct 26 06\:46\:26 UTC 2026 │ │ │ │ │ environment=regtest │ │ │ │ │ execStatus=Failed. Execution failed\: `main' threw exception\: java.lang.Exception\: Test failed - see log file for details │ │ │ │ │ harnessLoaderMode=Classpath Loader │ │ │ │ │ harnessVariety=Full Bundle │ │ │ │ │ hostname=sbuild │ │ │ │ │ javatestOS=Linux 6.12.113+deb13-amd64 (amd64) │ │ │ │ │ javatestVersion=6.0-ea+b26-2026-03-18-${BUILT_FROM_COMMIT} │ │ │ │ │ jtregVersion=jtreg 8.3 src 1 │ │ │ │ │ script=com.sun.javatest.regtest.exec.RegressionScript │ │ │ │ │ sections=script_messages build build main │ │ │ │ │ -start=Thu Oct 22 23\:55\:24 UTC 2026 │ │ │ │ │ +start=Mon Oct 26 06\:46\:26 UTC 2026 │ │ │ │ │ test=java/net/MulticastSocket/Test.java │ │ │ │ │ testJDK=/build/reproducible-path/openjdk-21-21.0.13+9/build/bootcycle-build/images/jdk │ │ │ │ │ -testJDK_OS=[name\:Linux,arch\:amd64,version\:6.12.113+deb13-amd64,family\:linux,simple_arch\:x64,simple_version\:6.12,processors\:6,maxMemory\:16775897088,maxSwap\:182536105984] │ │ │ │ │ +testJDK_OS=[name\:Linux,arch\:amd64,version\:6.12.113+deb13-amd64,family\:linux,simple_arch\:x64,simple_version\:6.12,processors\:4,maxMemory\:33662730240,maxSwap\:34359734272] │ │ │ │ │ testJDK_os.arch=amd64 │ │ │ │ │ testJDK_os.name=Linux │ │ │ │ │ testJDK_os.version=6.12.113+deb13-amd64 │ │ │ │ │ -totalTime=91 │ │ │ │ │ +totalTime=95 │ │ │ │ │ user.name=sbuild │ │ │ │ │ work=/tmp/jdk/JTwork/java/net/MulticastSocket │ │ │ │ │ │ │ │ │ │ #section:script_messages │ │ │ │ │ ----------messages:(7/455)---------- │ │ │ │ │ JDK under test: /build/reproducible-path/openjdk-21-21.0.13+9/build/bootcycle-build/images/jdk │ │ │ │ │ openjdk version "21.0.13" 2026-10-20 │ │ │ │ │ OpenJDK Runtime Environment (build 21.0.13+9-1-Debian) │ │ │ │ │ OpenJDK 64-Bit Server VM (build 21.0.13+9-1-Debian, mixed mode, sharing) │ │ │ │ │ Library /test/lib; kind: packages │ │ │ │ │ source directory: /build/reproducible-path/openjdk-21-21.0.13+9/test/lib │ │ │ │ │ class directory: /tmp/jdk/JTwork/classes/java/net/MulticastSocket/Test.d/test/lib │ │ │ │ │ │ │ │ │ │ #section:build │ │ │ │ │ -----------messages:(5/284)---------- │ │ │ │ │ +----------messages:(5/282)---------- │ │ │ │ │ command: build jdk.test.lib.NetworkConfiguration jdk.test.lib.Platform │ │ │ │ │ reason: User specified action: run build jdk.test.lib.NetworkConfiguration jdk.test.lib.Platform │ │ │ │ │ -started: Thu Oct 22 23:55:24.770 UTC 2026 │ │ │ │ │ -finished: Thu Oct 22 23:55:24.771 UTC 2026 │ │ │ │ │ -elapsed time (seconds): 0.001 │ │ │ │ │ +started: Mon Oct 26 06:46:26.393 UTC 2026 │ │ │ │ │ +finished: Mon Oct 26 06:46:26.393 UTC 2026 │ │ │ │ │ +elapsed time (seconds): 0.0 │ │ │ │ │ result: Passed. All files up to date │ │ │ │ │ │ │ │ │ │ #section:build │ │ │ │ │ -----------messages:(5/172)---------- │ │ │ │ │ +----------messages:(5/174)---------- │ │ │ │ │ command: build Test │ │ │ │ │ reason: Named class compiled on demand │ │ │ │ │ -started: Thu Oct 22 23:55:24.771 UTC 2026 │ │ │ │ │ -finished: Thu Oct 22 23:55:24.771 UTC 2026 │ │ │ │ │ -elapsed time (seconds): 0.0 │ │ │ │ │ +started: Mon Oct 26 06:46:26.393 UTC 2026 │ │ │ │ │ +finished: Mon Oct 26 06:46:26.394 UTC 2026 │ │ │ │ │ +elapsed time (seconds): 0.001 │ │ │ │ │ result: Passed. All files up to date │ │ │ │ │ │ │ │ │ │ #section:main │ │ │ │ │ ----------messages:(8/226)---------- │ │ │ │ │ command: main Test │ │ │ │ │ reason: User specified action: run main Test │ │ │ │ │ -started: Thu Oct 22 23:55:24.771 UTC 2026 │ │ │ │ │ +started: Mon Oct 26 06:46:26.394 UTC 2026 │ │ │ │ │ Mode: agentvm │ │ │ │ │ Agent id: 1 │ │ │ │ │ -Process id: 3533426 │ │ │ │ │ -finished: Thu Oct 22 23:55:24.856 UTC 2026 │ │ │ │ │ -elapsed time (seconds): 0.085 │ │ │ │ │ +Process id: 1026207 │ │ │ │ │ +finished: Mon Oct 26 06:46:26.485 UTC 2026 │ │ │ │ │ +elapsed time (seconds): 0.091 │ │ │ │ │ ----------configuration:(17/810)---------- │ │ │ │ │ Boot Layer │ │ │ │ │ class path: /usr/share/jtreg/lib/javatest.jar │ │ │ │ │ /usr/share/jtreg/lib/jtreg.jar │ │ │ │ │ /usr/share/jtreg/lib/junit-platform-console-standalone.jar │ │ │ │ │ /usr/share/jtreg/lib/testng.jar │ │ │ │ │ /usr/share/jtreg/lib/guice.jar │ │ │ │ ├── jtreg-test-output/jdk/JTwork/java/net/SocketOption/OptionsTest.jtr │ │ │ │ │ @@ -1,43 +1,43 @@ │ │ │ │ │ #Test Results (version 2) │ │ │ │ │ -#Thu Oct 22 23:55:25 UTC 2026 │ │ │ │ │ +#Mon Oct 26 06:46:26 UTC 2026 │ │ │ │ │ #-----testdescription----- │ │ │ │ │ $file=/build/reproducible-path/openjdk-21-21.0.13+9/test/jdk/java/net/SocketOption/OptionsTest.java │ │ │ │ │ $root=/build/reproducible-path/openjdk-21-21.0.13+9/test/jdk │ │ │ │ │ keywords=bug8036979 bug8072384 bug8044773 bug8225214 bug8233296 bug8234083 othervm │ │ │ │ │ library=/test/lib │ │ │ │ │ requires=\!vm.graal.enabled │ │ │ │ │ run=USER_SPECIFIED main/othervm -Xcheck\:jni OptionsTest\nUSER_SPECIFIED main/othervm -Xcheck\:jni -Djava.net.preferIPv4Stack\=true OptionsTest\nUSER_SPECIFIED main/othervm --limit-modules\=java.base OptionsTest\nUSER_SPECIFIED main/othervm/policy\=options.policy OptionsTest\n │ │ │ │ │ source=OptionsTest.java │ │ │ │ │ title=\ │ │ │ │ │ │ │ │ │ │ #-----environment----- │ │ │ │ │ │ │ │ │ │ #-----testresult----- │ │ │ │ │ description=file\:/build/reproducible-path/openjdk-21-21.0.13+9/test/jdk/java/net/SocketOption/OptionsTest.java │ │ │ │ │ -elapsed=205 0\:00\:00.205 │ │ │ │ │ -end=Thu Oct 22 23\:55\:25 UTC 2026 │ │ │ │ │ +elapsed=175 0\:00\:00.175 │ │ │ │ │ +end=Mon Oct 26 06\:46\:26 UTC 2026 │ │ │ │ │ environment=regtest │ │ │ │ │ execStatus=Failed. Execution failed\: `main' threw exception\: java.lang.IllegalArgumentException\: Invalid value 'null' │ │ │ │ │ harnessLoaderMode=Classpath Loader │ │ │ │ │ harnessVariety=Full Bundle │ │ │ │ │ hostname=sbuild │ │ │ │ │ javatestOS=Linux 6.12.113+deb13-amd64 (amd64) │ │ │ │ │ javatestVersion=6.0-ea+b26-2026-03-18-${BUILT_FROM_COMMIT} │ │ │ │ │ jtregVersion=jtreg 8.3 src 1 │ │ │ │ │ script=com.sun.javatest.regtest.exec.RegressionScript │ │ │ │ │ sections=script_messages build main │ │ │ │ │ -start=Thu Oct 22 23\:55\:24 UTC 2026 │ │ │ │ │ +start=Mon Oct 26 06\:46\:26 UTC 2026 │ │ │ │ │ test=java/net/SocketOption/OptionsTest.java │ │ │ │ │ testJDK=/build/reproducible-path/openjdk-21-21.0.13+9/build/bootcycle-build/images/jdk │ │ │ │ │ -testJDK_OS=[name\:Linux,arch\:amd64,version\:6.12.113+deb13-amd64,family\:linux,simple_arch\:x64,simple_version\:6.12,processors\:6,maxMemory\:16775897088,maxSwap\:182536105984] │ │ │ │ │ +testJDK_OS=[name\:Linux,arch\:amd64,version\:6.12.113+deb13-amd64,family\:linux,simple_arch\:x64,simple_version\:6.12,processors\:4,maxMemory\:33662730240,maxSwap\:34359734272] │ │ │ │ │ testJDK_os.arch=amd64 │ │ │ │ │ testJDK_os.name=Linux │ │ │ │ │ testJDK_os.version=6.12.113+deb13-amd64 │ │ │ │ │ -totalTime=206 │ │ │ │ │ +totalTime=176 │ │ │ │ │ user.name=sbuild │ │ │ │ │ work=/tmp/jdk/JTwork/java/net/SocketOption │ │ │ │ │ │ │ │ │ │ #section:script_messages │ │ │ │ │ ----------messages:(7/459)---------- │ │ │ │ │ JDK under test: /build/reproducible-path/openjdk-21-21.0.13+9/build/bootcycle-build/images/jdk │ │ │ │ │ openjdk version "21.0.13" 2026-10-20 │ │ │ │ │ @@ -47,28 +47,28 @@ │ │ │ │ │ source directory: /build/reproducible-path/openjdk-21-21.0.13+9/test/lib │ │ │ │ │ class directory: /tmp/jdk/JTwork/classes/java/net/SocketOption/OptionsTest.d/test/lib │ │ │ │ │ │ │ │ │ │ #section:build │ │ │ │ │ ----------messages:(5/179)---------- │ │ │ │ │ command: build OptionsTest │ │ │ │ │ reason: Named class compiled on demand │ │ │ │ │ -started: Thu Oct 22 23:55:24.866 UTC 2026 │ │ │ │ │ -finished: Thu Oct 22 23:55:24.866 UTC 2026 │ │ │ │ │ +started: Mon Oct 26 06:46:26.495 UTC 2026 │ │ │ │ │ +finished: Mon Oct 26 06:46:26.495 UTC 2026 │ │ │ │ │ elapsed time (seconds): 0.0 │ │ │ │ │ result: Passed. All files up to date │ │ │ │ │ │ │ │ │ │ #section:main │ │ │ │ │ -----------messages:(7/279)---------- │ │ │ │ │ +----------messages:(7/281)---------- │ │ │ │ │ command: main -Xcheck:jni OptionsTest │ │ │ │ │ reason: User specified action: run main/othervm -Xcheck:jni OptionsTest │ │ │ │ │ -started: Thu Oct 22 23:55:24.867 UTC 2026 │ │ │ │ │ +started: Mon Oct 26 06:46:26.495 UTC 2026 │ │ │ │ │ Mode: othervm [/othervm specified] │ │ │ │ │ -Process id: 3533497 │ │ │ │ │ -finished: Thu Oct 22 23:55:25.067 UTC 2026 │ │ │ │ │ -elapsed time (seconds): 0.2 │ │ │ │ │ +Process id: 1026279 │ │ │ │ │ +finished: Mon Oct 26 06:46:26.668 UTC 2026 │ │ │ │ │ +elapsed time (seconds): 0.173 │ │ │ │ │ ----------configuration:(0/0)---------- │ │ │ │ │ ----------System.out:(7/201)---------- │ │ │ │ │ Testing SO_LINGER with:-1 │ │ │ │ │ Testing SO_LINGER with:-2 │ │ │ │ │ Testing SO_LINGER with:-100 │ │ │ │ │ Testing SO_LINGER with:-65534 │ │ │ │ │ Testing SO_LINGER with:-65535 │ │ │ │ ├── jtreg-test-output/jdk/JTwork/java/net/SocketPermission/SocketPermissionTest.jtr │ │ │ │ │ @@ -1,92 +1,92 @@ │ │ │ │ │ #Test Results (version 2) │ │ │ │ │ -#Thu Oct 22 23:55:26 UTC 2026 │ │ │ │ │ +#Mon Oct 26 06:46:28 UTC 2026 │ │ │ │ │ #-----testdescription----- │ │ │ │ │ $file=/build/reproducible-path/openjdk-21-21.0.13+9/test/jdk/java/net/SocketPermission/SocketPermissionTest.java │ │ │ │ │ $root=/build/reproducible-path/openjdk-21-21.0.13+9/test/jdk │ │ │ │ │ keywords=bug8047031 intermittent othervm testng │ │ │ │ │ library=/test/lib │ │ │ │ │ run=USER_SPECIFIED build jdk.test.lib.NetworkConfiguration jdk.test.lib.Platform\nUSER_SPECIFIED testng/othervm -Djava.security.manager\=allow SocketPermissionTest\n │ │ │ │ │ source=SocketPermissionTest.java │ │ │ │ │ title=SocketPermission tests for legacy socket types. │ │ │ │ │ │ │ │ │ │ #-----environment----- │ │ │ │ │ │ │ │ │ │ #-----testresult----- │ │ │ │ │ description=file\:/build/reproducible-path/openjdk-21-21.0.13+9/test/jdk/java/net/SocketPermission/SocketPermissionTest.java │ │ │ │ │ -elapsed=659 0\:00\:00.659 │ │ │ │ │ -end=Thu Oct 22 23\:55\:26 UTC 2026 │ │ │ │ │ +elapsed=469 0\:00\:00.469 │ │ │ │ │ +end=Mon Oct 26 06\:46\:28 UTC 2026 │ │ │ │ │ environment=regtest │ │ │ │ │ execStatus=Failed. Execution failed\: `main' threw exception\: java.lang.Exception\: config failures\: 0, test failures\: 2 │ │ │ │ │ harnessLoaderMode=Classpath Loader │ │ │ │ │ harnessVariety=Full Bundle │ │ │ │ │ hostname=sbuild │ │ │ │ │ javatestOS=Linux 6.12.113+deb13-amd64 (amd64) │ │ │ │ │ javatestVersion=6.0-ea+b26-2026-03-18-${BUILT_FROM_COMMIT} │ │ │ │ │ jtregVersion=jtreg 8.3 src 1 │ │ │ │ │ script=com.sun.javatest.regtest.exec.RegressionScript │ │ │ │ │ sections=script_messages build build testng │ │ │ │ │ -start=Thu Oct 22 23\:55\:25 UTC 2026 │ │ │ │ │ +start=Mon Oct 26 06\:46\:27 UTC 2026 │ │ │ │ │ test=java/net/SocketPermission/SocketPermissionTest.java │ │ │ │ │ testJDK=/build/reproducible-path/openjdk-21-21.0.13+9/build/bootcycle-build/images/jdk │ │ │ │ │ -testJDK_OS=[name\:Linux,arch\:amd64,version\:6.12.113+deb13-amd64,family\:linux,simple_arch\:x64,simple_version\:6.12,processors\:6,maxMemory\:16775897088,maxSwap\:182536105984] │ │ │ │ │ +testJDK_OS=[name\:Linux,arch\:amd64,version\:6.12.113+deb13-amd64,family\:linux,simple_arch\:x64,simple_version\:6.12,processors\:4,maxMemory\:33662730240,maxSwap\:34359734272] │ │ │ │ │ testJDK_os.arch=amd64 │ │ │ │ │ testJDK_os.name=Linux │ │ │ │ │ testJDK_os.version=6.12.113+deb13-amd64 │ │ │ │ │ -totalTime=661 │ │ │ │ │ +totalTime=469 │ │ │ │ │ user.name=sbuild │ │ │ │ │ work=/tmp/jdk/JTwork/java/net/SocketPermission │ │ │ │ │ │ │ │ │ │ #section:script_messages │ │ │ │ │ ----------messages:(7/472)---------- │ │ │ │ │ JDK under test: /build/reproducible-path/openjdk-21-21.0.13+9/build/bootcycle-build/images/jdk │ │ │ │ │ openjdk version "21.0.13" 2026-10-20 │ │ │ │ │ OpenJDK Runtime Environment (build 21.0.13+9-1-Debian) │ │ │ │ │ OpenJDK 64-Bit Server VM (build 21.0.13+9-1-Debian, mixed mode, sharing) │ │ │ │ │ Library /test/lib; kind: packages │ │ │ │ │ source directory: /build/reproducible-path/openjdk-21-21.0.13+9/test/lib │ │ │ │ │ class directory: /tmp/jdk/JTwork/classes/java/net/SocketPermission/SocketPermissionTest.d/test/lib │ │ │ │ │ │ │ │ │ │ #section:build │ │ │ │ │ -----------messages:(5/284)---------- │ │ │ │ │ +----------messages:(5/282)---------- │ │ │ │ │ command: build jdk.test.lib.NetworkConfiguration jdk.test.lib.Platform │ │ │ │ │ reason: User specified action: run build jdk.test.lib.NetworkConfiguration jdk.test.lib.Platform │ │ │ │ │ -started: Thu Oct 22 23:55:25.993 UTC 2026 │ │ │ │ │ -finished: Thu Oct 22 23:55:25.994 UTC 2026 │ │ │ │ │ -elapsed time (seconds): 0.001 │ │ │ │ │ +started: Mon Oct 26 06:46:27.646 UTC 2026 │ │ │ │ │ +finished: Mon Oct 26 06:46:27.646 UTC 2026 │ │ │ │ │ +elapsed time (seconds): 0.0 │ │ │ │ │ result: Passed. All files up to date │ │ │ │ │ │ │ │ │ │ #section:build │ │ │ │ │ -----------messages:(5/190)---------- │ │ │ │ │ +----------messages:(5/188)---------- │ │ │ │ │ command: build SocketPermissionTest │ │ │ │ │ reason: Named class compiled on demand │ │ │ │ │ -started: Thu Oct 22 23:55:25.994 UTC 2026 │ │ │ │ │ -finished: Thu Oct 22 23:55:25.995 UTC 2026 │ │ │ │ │ -elapsed time (seconds): 0.001 │ │ │ │ │ +started: Mon Oct 26 06:46:27.647 UTC 2026 │ │ │ │ │ +finished: Mon Oct 26 06:46:27.647 UTC 2026 │ │ │ │ │ +elapsed time (seconds): 0.0 │ │ │ │ │ result: Passed. All files up to date │ │ │ │ │ │ │ │ │ │ #section:testng │ │ │ │ │ ----------messages:(7/339)---------- │ │ │ │ │ command: testng -Djava.security.manager=allow SocketPermissionTest │ │ │ │ │ reason: User specified action: run testng/othervm -Djava.security.manager=allow SocketPermissionTest │ │ │ │ │ -started: Thu Oct 22 23:55:25.995 UTC 2026 │ │ │ │ │ +started: Mon Oct 26 06:46:27.647 UTC 2026 │ │ │ │ │ Mode: othervm [/othervm specified] │ │ │ │ │ -Process id: 3533519 │ │ │ │ │ -finished: Thu Oct 22 23:55:26.644 UTC 2026 │ │ │ │ │ -elapsed time (seconds): 0.649 │ │ │ │ │ +Process id: 1026300 │ │ │ │ │ +finished: Mon Oct 26 06:46:28.109 UTC 2026 │ │ │ │ │ +elapsed time (seconds): 0.462 │ │ │ │ │ ----------configuration:(0/0)---------- │ │ │ │ │ ----------System.out:(97/6917)---------- │ │ │ │ │ -[23:55:26.494] config SocketPermissionTest.setupSecurityManager(): success [0ms] │ │ │ │ │ -[23:55:26.522] test SocketPermissionTest.acceptServerSocketTest(): success [21ms] │ │ │ │ │ -[23:55:26.523] config SocketPermissionTest.setupSecurityManager(): success [0ms] │ │ │ │ │ -[23:55:26.536] test SocketPermissionTest.connectDatagramSocketTest(): success [12ms] │ │ │ │ │ -[23:55:26.537] config SocketPermissionTest.setupSecurityManager(): success [0ms] │ │ │ │ │ -[23:55:26.539] test SocketPermissionTest.connectSocketTest(): success [2ms] │ │ │ │ │ -[23:55:26.540] config SocketPermissionTest.setupSecurityManager(): success [0ms] │ │ │ │ │ -[23:55:26.548] test SocketPermissionTest.joinGroupMulticastTest(): failure [8ms] │ │ │ │ │ +[06:46:27.962] config SocketPermissionTest.setupSecurityManager(): success [0ms] │ │ │ │ │ +[06:46:27.984] test SocketPermissionTest.acceptServerSocketTest(): success [18ms] │ │ │ │ │ +[06:46:27.986] config SocketPermissionTest.setupSecurityManager(): success [0ms] │ │ │ │ │ +[06:46:27.996] test SocketPermissionTest.connectDatagramSocketTest(): success [10ms] │ │ │ │ │ +[06:46:27.997] config SocketPermissionTest.setupSecurityManager(): success [0ms] │ │ │ │ │ +[06:46:28.000] test SocketPermissionTest.connectSocketTest(): success [2ms] │ │ │ │ │ +[06:46:28.001] config SocketPermissionTest.setupSecurityManager(): success [0ms] │ │ │ │ │ +[06:46:28.007] test SocketPermissionTest.joinGroupMulticastTest(): failure [7ms] │ │ │ │ │ java.util.NoSuchElementException: No value present │ │ │ │ │ at java.base/java.util.Optional.get(Optional.java:143) │ │ │ │ │ at SocketPermissionTest.joinGroupMulticastTest(SocketPermissionTest.java:227) │ │ │ │ │ at java.base/jdk.internal.reflect.DirectMethodHandleAccessor.invoke(DirectMethodHandleAccessor.java:103) │ │ │ │ │ at java.base/java.lang.reflect.Method.invoke(Method.java:580) │ │ │ │ │ at org.testng.internal.invokers.MethodInvocationHelper.invokeMethod(MethodInvocationHelper.java:136) │ │ │ │ │ at org.testng.internal.invokers.TestInvoker.invokeMethod(TestInvoker.java:658) │ │ │ │ │ @@ -111,22 +111,22 @@ │ │ │ │ │ at org.testng.TestNG.run(TestNG.java:1060) │ │ │ │ │ at com.sun.javatest.regtest.agent.TestNGRunner.main(TestNGRunner.java:109) │ │ │ │ │ at com.sun.javatest.regtest.agent.TestNGRunner.main(TestNGRunner.java:65) │ │ │ │ │ at java.base/jdk.internal.reflect.DirectMethodHandleAccessor.invoke(DirectMethodHandleAccessor.java:103) │ │ │ │ │ at java.base/java.lang.reflect.Method.invoke(Method.java:580) │ │ │ │ │ at com.sun.javatest.regtest.agent.MainWrapper$MainTask.run(MainWrapper.java:143) │ │ │ │ │ at java.base/java.lang.Thread.run(Thread.java:1583) │ │ │ │ │ -[23:55:26.551] config SocketPermissionTest.setupSecurityManager(): success [0ms] │ │ │ │ │ -[23:55:26.553] test SocketPermissionTest.listenDatagramSocketTest(): success [1ms] │ │ │ │ │ -[23:55:26.553] config SocketPermissionTest.setupSecurityManager(): success [0ms] │ │ │ │ │ -[23:55:26.555] test SocketPermissionTest.listenMulticastSocketTest(): success [0ms] │ │ │ │ │ -[23:55:26.555] config SocketPermissionTest.setupSecurityManager(): success [0ms] │ │ │ │ │ -[23:55:26.556] test SocketPermissionTest.listenServerSocketTest(): success [0ms] │ │ │ │ │ -[23:55:26.557] config SocketPermissionTest.setupSecurityManager(): success [0ms] │ │ │ │ │ -[23:55:26.558] test SocketPermissionTest.sendDatagramPacketTest(): failure [1ms] │ │ │ │ │ +[06:46:28.009] config SocketPermissionTest.setupSecurityManager(): success [0ms] │ │ │ │ │ +[06:46:28.011] test SocketPermissionTest.listenDatagramSocketTest(): success [1ms] │ │ │ │ │ +[06:46:28.012] config SocketPermissionTest.setupSecurityManager(): success [0ms] │ │ │ │ │ +[06:46:28.014] test SocketPermissionTest.listenMulticastSocketTest(): success [1ms] │ │ │ │ │ +[06:46:28.015] config SocketPermissionTest.setupSecurityManager(): success [0ms] │ │ │ │ │ +[06:46:28.016] test SocketPermissionTest.listenServerSocketTest(): success [1ms] │ │ │ │ │ +[06:46:28.017] config SocketPermissionTest.setupSecurityManager(): success [0ms] │ │ │ │ │ +[06:46:28.018] test SocketPermissionTest.sendDatagramPacketTest(): failure [1ms] │ │ │ │ │ java.security.PrivilegedActionException: java.net.SocketException: Network is unreachable │ │ │ │ │ at java.base/java.security.AccessController.doPrivileged(AccessController.java:718) │ │ │ │ │ at SocketPermissionTest.sendDatagramPacketTest(SocketPermissionTest.java:195) │ │ │ │ │ at java.base/jdk.internal.reflect.DirectMethodHandleAccessor.invoke(DirectMethodHandleAccessor.java:103) │ │ │ │ │ at java.base/java.lang.reflect.Method.invoke(Method.java:580) │ │ │ │ │ at org.testng.internal.invokers.MethodInvocationHelper.invokeMethod(MethodInvocationHelper.java:136) │ │ │ │ │ at org.testng.internal.invokers.TestInvoker.invokeMethod(TestInvoker.java:658) │ │ │ │ ├── jtreg-test-output/jdk/JTwork/sun/security/krb5/auto/Addresses.jtr │ │ │ │ │ @@ -1,44 +1,44 @@ │ │ │ │ │ #Test Results (version 2) │ │ │ │ │ -#Thu Oct 22 23:55:29 UTC 2026 │ │ │ │ │ +#Mon Oct 26 06:46:30 UTC 2026 │ │ │ │ │ #-----testdescription----- │ │ │ │ │ $file=/build/reproducible-path/openjdk-21-21.0.13+9/test/jdk/sun/security/krb5/auto/Addresses.java │ │ │ │ │ $root=/build/reproducible-path/openjdk-21-21.0.13+9/test/jdk │ │ │ │ │ keywords=bug8031111 bug8194486 othervm │ │ │ │ │ library=/test/lib │ │ │ │ │ modules=java.base/jdk.internal.misc java.base/sun.security.util java.security.jgss/sun.security.jgss java.security.jgss/sun.security.jgss.krb5 java.security.jgss/sun.security.krb5\:+open java.security.jgss/sun.security.krb5.internal\:+open java.security.jgss/sun.security.krb5.internal.ccache java.security.jgss/sun.security.krb5.internal.rcache java.security.jgss/sun.security.krb5.internal.crypto java.security.jgss/sun.security.krb5.internal.ktab jdk.security.auth jdk.security.jgss │ │ │ │ │ run=USER_SPECIFIED compile -XDignore.symbol.file Addresses.java\nUSER_SPECIFIED main jdk.test.lib.FileInstaller TestHosts TestHosts\nUSER_SPECIFIED main/othervm -Djdk.net.hosts.file\=TestHosts Addresses\n │ │ │ │ │ source=Addresses.java │ │ │ │ │ title=fix krb5 caddr │ │ │ │ │ │ │ │ │ │ #-----environment----- │ │ │ │ │ │ │ │ │ │ #-----testresult----- │ │ │ │ │ description=file\:/build/reproducible-path/openjdk-21-21.0.13+9/test/jdk/sun/security/krb5/auto/Addresses.java │ │ │ │ │ -elapsed=3110 0\:00\:03.110 │ │ │ │ │ -end=Thu Oct 22 23\:55\:29 UTC 2026 │ │ │ │ │ +elapsed=2301 0\:00\:02.301 │ │ │ │ │ +end=Mon Oct 26 06\:46\:30 UTC 2026 │ │ │ │ │ environment=regtest │ │ │ │ │ execStatus=Failed. Execution failed\: `main' threw exception\: java.lang.Exception │ │ │ │ │ harnessLoaderMode=Classpath Loader │ │ │ │ │ harnessVariety=Full Bundle │ │ │ │ │ hostname=sbuild │ │ │ │ │ javatestOS=Linux 6.12.113+deb13-amd64 (amd64) │ │ │ │ │ javatestVersion=6.0-ea+b26-2026-03-18-${BUILT_FROM_COMMIT} │ │ │ │ │ jtregVersion=jtreg 8.3 src 1 │ │ │ │ │ modules=java.base/jdk.internal.misc java.base/sun.security.util java.security.jgss/sun.security.jgss java.security.jgss/sun.security.jgss.krb5 java.security.jgss/sun.security.krb5\:+open java.security.jgss/sun.security.krb5.internal\:+open java.security.jgss/sun.security.krb5.internal.ccache java.security.jgss/sun.security.krb5.internal.rcache java.security.jgss/sun.security.krb5.internal.crypto java.security.jgss/sun.security.krb5.internal.ktab jdk.security.auth jdk.security.jgss │ │ │ │ │ script=com.sun.javatest.regtest.exec.RegressionScript │ │ │ │ │ sections=script_messages compile build main build main │ │ │ │ │ -start=Thu Oct 22 23\:55\:26 UTC 2026 │ │ │ │ │ +start=Mon Oct 26 06\:46\:28 UTC 2026 │ │ │ │ │ test=sun/security/krb5/auto/Addresses.java │ │ │ │ │ testJDK=/build/reproducible-path/openjdk-21-21.0.13+9/build/bootcycle-build/images/jdk │ │ │ │ │ -testJDK_OS=[name\:Linux,arch\:amd64,version\:6.12.113+deb13-amd64,family\:linux,simple_arch\:x64,simple_version\:6.12,processors\:6,maxMemory\:16775897088,maxSwap\:182536105984] │ │ │ │ │ +testJDK_OS=[name\:Linux,arch\:amd64,version\:6.12.113+deb13-amd64,family\:linux,simple_arch\:x64,simple_version\:6.12,processors\:4,maxMemory\:33662730240,maxSwap\:34359734272] │ │ │ │ │ testJDK_os.arch=amd64 │ │ │ │ │ testJDK_os.name=Linux │ │ │ │ │ testJDK_os.version=6.12.113+deb13-amd64 │ │ │ │ │ -totalTime=3112 │ │ │ │ │ +totalTime=2304 │ │ │ │ │ user.name=sbuild │ │ │ │ │ work=/tmp/jdk/JTwork/sun/security/krb5/auto │ │ │ │ │ │ │ │ │ │ #section:script_messages │ │ │ │ │ ----------messages:(7/458)---------- │ │ │ │ │ JDK under test: /build/reproducible-path/openjdk-21-21.0.13+9/build/bootcycle-build/images/jdk │ │ │ │ │ openjdk version "21.0.13" 2026-10-20 │ │ │ │ │ @@ -48,21 +48,21 @@ │ │ │ │ │ source directory: /build/reproducible-path/openjdk-21-21.0.13+9/test/lib │ │ │ │ │ class directory: /tmp/jdk/JTwork/classes/sun/security/krb5/auto/Addresses.d/test/lib │ │ │ │ │ │ │ │ │ │ #section:compile │ │ │ │ │ ----------messages:(9/1175)---------- │ │ │ │ │ command: compile -XDignore.symbol.file /build/reproducible-path/openjdk-21-21.0.13+9/test/jdk/sun/security/krb5/auto/Addresses.java │ │ │ │ │ reason: User specified action: run compile -XDignore.symbol.file Addresses.java │ │ │ │ │ -started: Thu Oct 22 23:55:26.659 UTC 2026 │ │ │ │ │ +started: Mon Oct 26 06:46:28.142 UTC 2026 │ │ │ │ │ Additional options from @modules: --add-modules java.base,java.security.jgss,jdk.security.auth,jdk.security.jgss --add-exports java.base/jdk.internal.misc=ALL-UNNAMED --add-exports java.base/sun.security.util=ALL-UNNAMED --add-exports java.security.jgss/sun.security.jgss=ALL-UNNAMED --add-exports java.security.jgss/sun.security.jgss.krb5=ALL-UNNAMED --add-exports java.security.jgss/sun.security.krb5=ALL-UNNAMED --add-exports java.security.jgss/sun.security.krb5.internal=ALL-UNNAMED --add-exports java.security.jgss/sun.security.krb5.internal.ccache=ALL-UNNAMED --add-exports java.security.jgss/sun.security.krb5.internal.rcache=ALL-UNNAMED --add-exports java.security.jgss/sun.security.krb5.internal.crypto=ALL-UNNAMED --add-exports java.security.jgss/sun.security.krb5.internal.ktab=ALL-UNNAMED │ │ │ │ │ Mode: agentvm │ │ │ │ │ Agent id: 2 │ │ │ │ │ -Process id: 3533546 │ │ │ │ │ -finished: Thu Oct 22 23:55:27.884 UTC 2026 │ │ │ │ │ -elapsed time (seconds): 1.225 │ │ │ │ │ +Process id: 1026325 │ │ │ │ │ +finished: Mon Oct 26 06:46:28.877 UTC 2026 │ │ │ │ │ +elapsed time (seconds): 0.735 │ │ │ │ │ ----------configuration:(23/1523)---------- │ │ │ │ │ Boot Layer (javac runtime environment) │ │ │ │ │ class path: /usr/share/jtreg/lib/javatest.jar │ │ │ │ │ /usr/share/jtreg/lib/jtreg.jar │ │ │ │ │ patch: java.base /tmp/jdk/JTwork/patches/java.base │ │ │ │ │ │ │ │ │ │ javac compilation environment │ │ │ │ │ @@ -132,34 +132,34 @@ │ │ │ │ │ -classpath /build/reproducible-path/openjdk-21-21.0.13+9/test/jdk/sun/security/krb5/auto:/tmp/jdk/JTwork/classes/sun/security/krb5/auto/Addresses.d:/tmp/jdk/JTwork/classes/sun/security/krb5/auto/Addresses.d/test/lib \\ │ │ │ │ │ -XDignore.symbol.file /build/reproducible-path/openjdk-21-21.0.13+9/test/jdk/sun/security/krb5/auto/Addresses.java │ │ │ │ │ ----------stdout:(0/0)---------- │ │ │ │ │ ----------stderr:(0/0)---------- │ │ │ │ │ result: Passed. Compilation successful │ │ │ │ │ │ │ │ │ │ #section:build │ │ │ │ │ -----------messages:(5/196)---------- │ │ │ │ │ +----------messages:(5/194)---------- │ │ │ │ │ command: build jdk.test.lib.FileInstaller │ │ │ │ │ reason: Named class compiled on demand │ │ │ │ │ -started: Thu Oct 22 23:55:27.885 UTC 2026 │ │ │ │ │ -finished: Thu Oct 22 23:55:27.886 UTC 2026 │ │ │ │ │ -elapsed time (seconds): 0.001 │ │ │ │ │ +started: Mon Oct 26 06:46:28.877 UTC 2026 │ │ │ │ │ +finished: Mon Oct 26 06:46:28.877 UTC 2026 │ │ │ │ │ +elapsed time (seconds): 0.0 │ │ │ │ │ result: Passed. All files up to date │ │ │ │ │ │ │ │ │ │ #section:main │ │ │ │ │ ----------messages:(10/925)---------- │ │ │ │ │ command: main jdk.test.lib.FileInstaller TestHosts TestHosts │ │ │ │ │ reason: User specified action: run main jdk.test.lib.FileInstaller TestHosts TestHosts │ │ │ │ │ -started: Thu Oct 22 23:55:27.886 UTC 2026 │ │ │ │ │ +started: Mon Oct 26 06:46:28.877 UTC 2026 │ │ │ │ │ Mode: agentvm │ │ │ │ │ Agent id: 1 │ │ │ │ │ -Process id: 3533426 │ │ │ │ │ +Process id: 1026207 │ │ │ │ │ Additional exports to unnamed modules from @modules: java.base/jdk.internal.misc java.base/sun.security.util java.security.jgss/sun.security.jgss java.security.jgss/sun.security.jgss.krb5 java.security.jgss/sun.security.krb5 java.security.jgss/sun.security.krb5.internal java.security.jgss/sun.security.krb5.internal.ccache java.security.jgss/sun.security.krb5.internal.rcache java.security.jgss/sun.security.krb5.internal.crypto java.security.jgss/sun.security.krb5.internal.ktab │ │ │ │ │ Additional opens to unnamed modules from @modules: java.security.jgss/sun.security.krb5 java.security.jgss/sun.security.krb5.internal │ │ │ │ │ -finished: Thu Oct 22 23:55:27.957 UTC 2026 │ │ │ │ │ -elapsed time (seconds): 0.071 │ │ │ │ │ +finished: Mon Oct 26 06:46:28.944 UTC 2026 │ │ │ │ │ +elapsed time (seconds): 0.067 │ │ │ │ │ ----------configuration:(29/1782)---------- │ │ │ │ │ Boot Layer │ │ │ │ │ class path: /usr/share/jtreg/lib/javatest.jar │ │ │ │ │ /usr/share/jtreg/lib/jtreg.jar │ │ │ │ │ /usr/share/jtreg/lib/junit-platform-console-standalone.jar │ │ │ │ │ /usr/share/jtreg/lib/testng.jar │ │ │ │ │ /usr/share/jtreg/lib/guice.jar │ │ │ │ │ @@ -227,29 +227,29 @@ │ │ │ │ │ │ │ │ │ │ result: Passed. Execution successful │ │ │ │ │ │ │ │ │ │ #section:build │ │ │ │ │ ----------messages:(5/177)---------- │ │ │ │ │ command: build Addresses │ │ │ │ │ reason: Named class compiled on demand │ │ │ │ │ -started: Thu Oct 22 23:55:27.958 UTC 2026 │ │ │ │ │ -finished: Thu Oct 22 23:55:27.958 UTC 2026 │ │ │ │ │ +started: Mon Oct 26 06:46:28.944 UTC 2026 │ │ │ │ │ +finished: Mon Oct 26 06:46:28.944 UTC 2026 │ │ │ │ │ elapsed time (seconds): 0.0 │ │ │ │ │ result: Passed. All files up to date │ │ │ │ │ │ │ │ │ │ #section:main │ │ │ │ │ ----------messages:(8/1247)---------- │ │ │ │ │ command: main -Djdk.net.hosts.file=TestHosts Addresses │ │ │ │ │ reason: User specified action: run main/othervm -Djdk.net.hosts.file=TestHosts Addresses │ │ │ │ │ -started: Thu Oct 22 23:55:27.958 UTC 2026 │ │ │ │ │ +started: Mon Oct 26 06:46:28.944 UTC 2026 │ │ │ │ │ Mode: othervm [/othervm specified] │ │ │ │ │ Additional options from @modules: --add-modules java.base,java.security.jgss,jdk.security.auth,jdk.security.jgss --add-exports java.base/jdk.internal.misc=ALL-UNNAMED --add-exports java.base/sun.security.util=ALL-UNNAMED --add-exports java.security.jgss/sun.security.jgss=ALL-UNNAMED --add-exports java.security.jgss/sun.security.jgss.krb5=ALL-UNNAMED --add-exports java.security.jgss/sun.security.krb5=ALL-UNNAMED --add-opens java.security.jgss/sun.security.krb5=ALL-UNNAMED --add-exports java.security.jgss/sun.security.krb5.internal=ALL-UNNAMED --add-opens java.security.jgss/sun.security.krb5.internal=ALL-UNNAMED --add-exports java.security.jgss/sun.security.krb5.internal.ccache=ALL-UNNAMED --add-exports java.security.jgss/sun.security.krb5.internal.rcache=ALL-UNNAMED --add-exports java.security.jgss/sun.security.krb5.internal.crypto=ALL-UNNAMED --add-exports java.security.jgss/sun.security.krb5.internal.ktab=ALL-UNNAMED │ │ │ │ │ -Process id: 3533574 │ │ │ │ │ -finished: Thu Oct 22 23:55:29.764 UTC 2026 │ │ │ │ │ -elapsed time (seconds): 1.806 │ │ │ │ │ +Process id: 1026351 │ │ │ │ │ +finished: Mon Oct 26 06:46:30.440 UTC 2026 │ │ │ │ │ +elapsed time (seconds): 1.496 │ │ │ │ │ ----------configuration:(15/1053)---------- │ │ │ │ │ Boot Layer │ │ │ │ │ add modules: java.base java.security.jgss jdk.security.auth jdk.security.jgss │ │ │ │ │ add exports: java.base/jdk.internal.misc ALL-UNNAMED │ │ │ │ │ java.base/sun.security.util ALL-UNNAMED │ │ │ │ │ java.security.jgss/sun.security.jgss ALL-UNNAMED │ │ │ │ │ java.security.jgss/sun.security.jgss.krb5 ALL-UNNAMED │ │ │ │ │ @@ -259,27 +259,27 @@ │ │ │ │ │ java.security.jgss/sun.security.krb5.internal.crypto ALL-UNNAMED │ │ │ │ │ java.security.jgss/sun.security.krb5.internal.ktab ALL-UNNAMED │ │ │ │ │ java.security.jgss/sun.security.krb5.internal.rcache ALL-UNNAMED │ │ │ │ │ add opens: java.security.jgss/sun.security.krb5 ALL-UNNAMED │ │ │ │ │ java.security.jgss/sun.security.krb5.internal ALL-UNNAMED │ │ │ │ │ │ │ │ │ │ ----------System.out:(24/852)---------- │ │ │ │ │ -Start KDC on 12531 │ │ │ │ │ +Start KDC on 13668 │ │ │ │ │ ----------------------------------------------- │ │ │ │ │ >>>>> UDP packet received │ │ │ │ │ -RABBIT.HOLE:12531> dummy@RABBIT.HOLE sends AS-REQ for krbtgt/RABBIT.HOLE@RABBIT.HOLE, KDCOptions: │ │ │ │ │ +RABBIT.HOLE:13668> dummy@RABBIT.HOLE sends AS-REQ for krbtgt/RABBIT.HOLE@RABBIT.HOLE, KDCOptions: │ │ │ │ │ KrbException: Additional pre-authentication required (25) │ │ │ │ │ at KDC.processAsReq(KDC.java:1335) │ │ │ │ │ at KDC.processMessage(KDC.java:809) │ │ │ │ │ at KDC$1.run(KDC.java:1565) │ │ │ │ │ Error 25 Additional pre-authentication required │ │ │ │ │ >>>>> UDP request honored │ │ │ │ │ ----------------------------------------------- │ │ │ │ │ >>>>> UDP packet received │ │ │ │ │ -RABBIT.HOLE:12531> dummy@RABBIT.HOLE sends AS-REQ for krbtgt/RABBIT.HOLE@RABBIT.HOLE, KDCOptions: │ │ │ │ │ +RABBIT.HOLE:13668> dummy@RABBIT.HOLE sends AS-REQ for krbtgt/RABBIT.HOLE@RABBIT.HOLE, KDCOptions: │ │ │ │ │ Return dummy@RABBIT.HOLE ticket for krbtgt/RABBIT.HOLE@RABBIT.HOLE, flags INITIAL;PRE-AUTHENT │ │ │ │ │ >>>>> UDP request honored │ │ │ │ │ /10.0.0.10 │ │ │ │ │ extra1 found │ │ │ │ │ /10.0.0.11 │ │ │ │ │ extra2 found │ │ │ │ │ /10.0.0.12 │ │ ├── ./usr/share/doc/openjdk-21-jre-headless/test-amd64/jtreg-summary-hotspot.log │ │ │ @@ -1,9 +1,9 @@ │ │ │ --------------- jtreg console summary for hotspot --------------- │ │ │ -Test results: passed: 3,150; skipped: 4; excluded: 42; did not match keywords: 75; did not meet platform requirements: 179 │ │ │ +Test results: passed: 3,165; skipped: 4; excluded: 42; did not match keywords: 75; did not meet platform requirements: 164 │ │ │ Framework-based tests: 2,176 = 1,909 TestNG + 267 JUnit │ │ │ [debian/tests/jtreg-autopkgtest.sh] nothing to cleanup │ │ │ Unable to compare jtreg results: no build jtreport found for hotspot/amd64. │ │ │ Reason: '/usr/share/doc/openjdk-21-jre-headless//test-amd64/jtreport-hotspot.tar.gz' does not exist. │ │ │ --------------- jtreg console summary for langtools --------------- │ │ │ Test results: passed: 4,434; skipped: 1; excluded: 12; did not match keywords: 1; did not meet platform requirements: 1 │ │ │ Framework-based tests: 4,129 = 3,147 TestNG + 982 JUnit │ │ │ @@ -22,16 +22,16 @@ │ │ │ FAILED: java/net/MulticastSocket/Promiscuous.java │ │ │ FAILED: java/net/MulticastSocket/SetLoopbackMode.java │ │ │ FAILED: java/net/MulticastSocket/SetLoopbackModeIPv4.java │ │ │ FAILED: java/net/MulticastSocket/Test.java │ │ │ FAILED: java/net/SocketOption/OptionsTest.java │ │ │ FAILED: java/net/SocketPermission/SocketPermissionTest.java │ │ │ FAILED: sun/security/krb5/auto/Addresses.java │ │ │ -Test results: passed: 6,501; failed: 9; skipped: 115; excluded: 38; did not match keywords: 37; did not meet module requirements: 3; did not meet platform requirements: 101 │ │ │ -Framework-based tests: 335,210 = 164,236 TestNG + 170,974 JUnit │ │ │ +Test results: passed: 6,503; failed: 9; skipped: 115; excluded: 38; did not match keywords: 37; did not meet module requirements: 3; did not meet platform requirements: 99 │ │ │ +Framework-based tests: 335,229 = 164,255 TestNG + 170,974 JUnit │ │ │ FAILED: java/net/MulticastSocket/B6427403.java │ │ │ FAILED: java/net/MulticastSocket/NoLoopbackPackets.java │ │ │ FAILED: java/net/MulticastSocket/Promiscuous.java │ │ │ FAILED: java/net/MulticastSocket/SetLoopbackMode.java │ │ │ FAILED: java/net/MulticastSocket/SetLoopbackModeIPv4.java │ │ │ FAILED: java/net/MulticastSocket/Test.java │ │ │ FAILED: java/net/SocketOption/OptionsTest.java │ │ ├── ./usr/share/doc/openjdk-21-jre-headless/test-amd64/jtreg_output-hotspot.log.gz │ │ │ ├── jtreg_output-hotspot.log │ │ │ │ @@ -289,14 +289,16 @@ │ │ │ │ Passed: compiler/intrinsics/Test8005419.java │ │ │ │ Passed: compiler/intrinsics/Test8215792.java │ │ │ │ Passed: compiler/intrinsics/Test8237524.java │ │ │ │ Passed: compiler/intrinsics/TestArraysHashCode.java │ │ │ │ Passed: compiler/intrinsics/TestBitShuffleOpers.java │ │ │ │ Passed: compiler/intrinsics/TestCheckIndex.java │ │ │ │ Passed: compiler/intrinsics/TestCompareUnsigned.java │ │ │ │ +Passed: compiler/intrinsics/TestDoubleIsInfinite.java │ │ │ │ +Passed: compiler/intrinsics/TestFloatIsInfinite.java │ │ │ │ Passed: compiler/intrinsics/TestIntegerUnsignedDivMod.java │ │ │ │ Passed: compiler/intrinsics/TestLongUnsignedDivMod.java │ │ │ │ Passed: compiler/intrinsics/TestReferenceGetWithNull.java │ │ │ │ Passed: compiler/intrinsics/TestReferenceRefersTo.java │ │ │ │ Passed: compiler/intrinsics/TestRotate.java │ │ │ │ Passed: compiler/intrinsics/VectorizedMismatchTest.java │ │ │ │ Passed: compiler/intrinsics/zip/TestAdler32.java │ │ │ │ @@ -1541,18 +1543,21 @@ │ │ │ │ Passed: compiler/intrinsics/sha/sanity/TestSHA3Intrinsics.java │ │ │ │ Passed: compiler/intrinsics/sha/sanity/TestSHA3MultiBlockIntrinsics.java │ │ │ │ Passed: compiler/intrinsics/sha/sanity/TestSHA512Intrinsics.java │ │ │ │ Passed: compiler/intrinsics/sha/sanity/TestSHA512MultiBlockIntrinsics.java │ │ │ │ Passed: compiler/intrinsics/sha/TestDigest.java │ │ │ │ Passed: compiler/intrinsics/string/TestCopyValueOf.java │ │ │ │ Passed: compiler/intrinsics/string/TestCountPositives.java#id0 │ │ │ │ +Passed: compiler/intrinsics/string/TestCountPositives.java#id1 │ │ │ │ Passed: compiler/intrinsics/string/TestEncodeIntrinsics.java │ │ │ │ Passed: compiler/intrinsics/string/TestHasNegatives.java#id0 │ │ │ │ +Passed: compiler/intrinsics/string/TestHasNegatives.java#id1 │ │ │ │ Passed: compiler/intrinsics/string/TestStringConstruction.java │ │ │ │ Passed: compiler/intrinsics/string/TestStringConstructionIntrinsics.java#id0 │ │ │ │ +Passed: compiler/intrinsics/string/TestStringConstructionIntrinsics.java#id1 │ │ │ │ Passed: compiler/intrinsics/string/TestStringEqualsBadLength.java │ │ │ │ Passed: compiler/intrinsics/string/TestStringIndexOfCharIntrinsics.java │ │ │ │ Passed: compiler/intrinsics/string/TestStringIntrinsicMemoryFlow.java │ │ │ │ Passed: compiler/intrinsics/string/TestStringIntrinsicRangeChecks.java │ │ │ │ Passed: compiler/intrinsics/string/TestStringIntrinsics.java │ │ │ │ Passed: compiler/intrinsics/string/TestStringIntrinsics2.java │ │ │ │ Passed: compiler/intrinsics/string/TestStringLatin1IndexOfChar.java │ │ │ │ @@ -1715,14 +1720,22 @@ │ │ │ │ Passed: compiler/loopopts/superword/TestDependencyOffsets.java#avx1-v016-U │ │ │ │ Passed: compiler/loopopts/superword/TestDependencyOffsets.java#avx1-v032-A │ │ │ │ Passed: compiler/loopopts/superword/TestDependencyOffsets.java#avx1-v032-U │ │ │ │ Passed: compiler/loopopts/superword/TestDependencyOffsets.java#avx2-v016-A │ │ │ │ Passed: compiler/loopopts/superword/TestDependencyOffsets.java#avx2-v016-U │ │ │ │ Passed: compiler/loopopts/superword/TestDependencyOffsets.java#avx2-v032-A │ │ │ │ Passed: compiler/loopopts/superword/TestDependencyOffsets.java#avx2-v032-U │ │ │ │ +Passed: compiler/loopopts/superword/TestDependencyOffsets.java#avx512bw-v032-A │ │ │ │ +Passed: compiler/loopopts/superword/TestDependencyOffsets.java#avx512bw-v032-U │ │ │ │ +Passed: compiler/loopopts/superword/TestDependencyOffsets.java#avx512bw-v064-A │ │ │ │ +Passed: compiler/loopopts/superword/TestDependencyOffsets.java#avx512bw-v064-U │ │ │ │ +Passed: compiler/loopopts/superword/TestDependencyOffsets.java#avx512-v032-A │ │ │ │ +Passed: compiler/loopopts/superword/TestDependencyOffsets.java#avx512-v032-U │ │ │ │ +Passed: compiler/loopopts/superword/TestDependencyOffsets.java#avx512-v064-A │ │ │ │ +Passed: compiler/loopopts/superword/TestDependencyOffsets.java#avx512-v064-U │ │ │ │ Passed: compiler/loopopts/superword/TestDependencyOffsets.java#sse4-v002-A │ │ │ │ Passed: compiler/loopopts/superword/TestDependencyOffsets.java#sse4-v002-U │ │ │ │ Passed: compiler/loopopts/superword/TestDependencyOffsets.java#sse4-v004-A │ │ │ │ Passed: compiler/loopopts/superword/TestDependencyOffsets.java#sse4-v004-U │ │ │ │ Passed: compiler/loopopts/superword/TestDependencyOffsets.java#sse4-v008-A │ │ │ │ Passed: compiler/loopopts/superword/TestDependencyOffsets.java#sse4-v008-U │ │ │ │ Passed: compiler/loopopts/superword/TestDependencyOffsets.java#sse4-v016-A │ │ │ │ @@ -2018,19 +2031,21 @@ │ │ │ │ Passed: compiler/vectorization/TestNaNVector.java │ │ │ │ Passed: compiler/vectorization/TestNarrowedIntegerReverseBytes.java │ │ │ │ Passed: compiler/vectorization/TestNumberOfContinuousZeros.java │ │ │ │ Passed: compiler/vectorization/TestOptionVectorize.java │ │ │ │ Passed: compiler/vectorization/TestOptionVectorizeIR.java │ │ │ │ Passed: compiler/vectorization/TestOverlappingMismatchedAccesses.java │ │ │ │ Passed: compiler/vectorization/TestPopCountVector.java │ │ │ │ +Passed: compiler/vectorization/TestPopCountVectorLong.java │ │ │ │ Passed: compiler/vectorization/TestPopulateIndex.java │ │ │ │ Passed: compiler/vectorization/TestReplicateLoopIV.java │ │ │ │ Passed: compiler/vectorization/TestReverseBitsVector.java │ │ │ │ Passed: compiler/vectorization/TestReverseBytes.java │ │ │ │ Passed: compiler/vectorization/TestRotateByteAndShortVector.java │ │ │ │ +Passed: compiler/vectorization/TestRoundVectDouble.java │ │ │ │ Passed: compiler/vectorization/TestRoundVectFloat.java │ │ │ │ Passed: compiler/vectorization/TestSignumVector.java │ │ │ │ Passed: compiler/vectorization/TestSmallVectorPopIndex.java │ │ │ │ Passed: compiler/vectorization/TestSubwordReverseBytes.java │ │ │ │ Passed: compiler/vectorization/TestUnexpectedLoadOrdering.java │ │ │ │ Passed: compiler/vectorization/TestVectorsNotSavedAtSafepoint.java │ │ │ │ Passed: compiler/vectorization/TestVectorUnalignedOffset.java │ │ │ │ @@ -3161,41 +3176,41 @@ │ │ │ │ Passed: serviceability/tmtools/jstat/GcCapacityTest.java │ │ │ │ Passed: serviceability/tmtools/jstat/GcCauseTest01.java │ │ │ │ Passed: serviceability/tmtools/jstat/GcCauseTest02.java │ │ │ │ Passed: serviceability/tmtools/jstat/GcCauseTest03.java │ │ │ │ Passed: serviceability/tmtools/jstat/GcNewTest.java │ │ │ │ Passed: serviceability/tmtools/jstat/GcTest01.java │ │ │ │ Passed: serviceability/tmtools/jstat/GcTest02.java │ │ │ │ -Test results: passed: 3,150; skipped: 4; excluded: 42; did not match keywords: 75; did not meet platform requirements: 179 │ │ │ │ +Test results: passed: 3,165; skipped: 4; excluded: 42; did not match keywords: 75; did not meet platform requirements: 164 │ │ │ │ Framework-based tests: 2,176 = 1,909 TestNG + 267 JUnit │ │ │ │ Report written to /build/reproducible-path/openjdk-21-21.0.13+9/jtreg-test-output/hotspot/0/JTreport/html/report.html │ │ │ │ Results written to /tmp/hotspot/JTwork │ │ │ │ [debian/tests/jtreg-autopkgtest.sh] nothing to cleanup │ │ │ │ grep: debian/tests/hotspot-archs: No such file or directory │ │ │ │ Unable to compare jtreg results: no build jtreport found for hotspot/amd64. │ │ │ │ Reason: '/usr/share/doc/openjdk-21-jre-headless//test-amd64/jtreport-hotspot.tar.gz' does not exist. │ │ │ │ Command exited with non-zero status 77 │ │ │ │ Command being timed: "debian/tests/hotspot" │ │ │ │ - User time (seconds): 14045.26 │ │ │ │ - System time (seconds): 2012.39 │ │ │ │ - Percent of CPU this job got: 131% │ │ │ │ - Elapsed (wall clock) time (h:mm:ss or m:ss): 3:24:01 │ │ │ │ + User time (seconds): 9771.61 │ │ │ │ + System time (seconds): 1386.64 │ │ │ │ + Percent of CPU this job got: 110% │ │ │ │ + Elapsed (wall clock) time (h:mm:ss or m:ss): 2:48:43 │ │ │ │ Average shared text size (kbytes): 0 │ │ │ │ Average unshared data size (kbytes): 0 │ │ │ │ Average stack size (kbytes): 0 │ │ │ │ Average total size (kbytes): 0 │ │ │ │ - Maximum resident set size (kbytes): 4029904 │ │ │ │ + Maximum resident set size (kbytes): 6830412 │ │ │ │ Average resident set size (kbytes): 0 │ │ │ │ - Major (requiring I/O) page faults: 8040 │ │ │ │ - Minor (reclaiming a frame) page faults: 129322869 │ │ │ │ - Voluntary context switches: 47916456 │ │ │ │ - Involuntary context switches: 6439642 │ │ │ │ + Major (requiring I/O) page faults: 405 │ │ │ │ + Minor (reclaiming a frame) page faults: 138383730 │ │ │ │ + Voluntary context switches: 66278353 │ │ │ │ + Involuntary context switches: 37137844 │ │ │ │ Swaps: 0 │ │ │ │ - File system inputs: 1917904 │ │ │ │ - File system outputs: 0 │ │ │ │ + File system inputs: 285864 │ │ │ │ + File system outputs: 26244208 │ │ │ │ Socket messages sent: 0 │ │ │ │ Socket messages received: 0 │ │ │ │ Signals delivered: 0 │ │ │ │ Page size (bytes): 4096 │ │ │ │ Exit status: 77 │ │ │ │ ===== END check-hotspot ===== │ │ │ │ ===== START check-langtools ===== │ │ │ │ @@ -7654,31 +7669,31 @@ │ │ │ │ Results written to /tmp/langtools/JTwork │ │ │ │ [debian/tests/jtreg-autopkgtest.sh] nothing to cleanup │ │ │ │ grep: debian/tests/hotspot-archs: No such file or directory │ │ │ │ Unable to compare jtreg results: no build jtreport found for hotspot/amd64. │ │ │ │ Reason: '/usr/share/doc/openjdk-21-jre-headless//test-amd64/jtreport-hotspot.tar.gz' does not exist. │ │ │ │ Command exited with non-zero status 77 │ │ │ │ Command being timed: "debian/tests/langtools" │ │ │ │ - User time (seconds): 4231.64 │ │ │ │ - System time (seconds): 323.56 │ │ │ │ - Percent of CPU this job got: 159% │ │ │ │ - Elapsed (wall clock) time (h:mm:ss or m:ss): 47:33.38 │ │ │ │ + User time (seconds): 2859.64 │ │ │ │ + System time (seconds): 195.53 │ │ │ │ + Percent of CPU this job got: 128% │ │ │ │ + Elapsed (wall clock) time (h:mm:ss or m:ss): 39:40.88 │ │ │ │ Average shared text size (kbytes): 0 │ │ │ │ Average unshared data size (kbytes): 0 │ │ │ │ Average stack size (kbytes): 0 │ │ │ │ Average total size (kbytes): 0 │ │ │ │ - Maximum resident set size (kbytes): 3326464 │ │ │ │ + Maximum resident set size (kbytes): 7633664 │ │ │ │ Average resident set size (kbytes): 0 │ │ │ │ - Major (requiring I/O) page faults: 131 │ │ │ │ - Minor (reclaiming a frame) page faults: 14665266 │ │ │ │ - Voluntary context switches: 3904399 │ │ │ │ - Involuntary context switches: 174951 │ │ │ │ + Major (requiring I/O) page faults: 15 │ │ │ │ + Minor (reclaiming a frame) page faults: 18694471 │ │ │ │ + Voluntary context switches: 3608727 │ │ │ │ + Involuntary context switches: 1023460 │ │ │ │ Swaps: 0 │ │ │ │ - File system inputs: 203296 │ │ │ │ - File system outputs: 0 │ │ │ │ + File system inputs: 106104 │ │ │ │ + File system outputs: 3166072 │ │ │ │ Socket messages sent: 0 │ │ │ │ Socket messages received: 0 │ │ │ │ Signals delivered: 0 │ │ │ │ Page size (bytes): 4096 │ │ │ │ Exit status: 77 │ │ │ │ ===== END check-langtools ===== │ │ │ │ ===== START check-jaxp ===== │ │ │ │ @@ -8204,62 +8219,62 @@ │ │ │ │ Results written to /tmp/jaxp/JTwork │ │ │ │ [debian/tests/jtreg-autopkgtest.sh] nothing to cleanup │ │ │ │ grep: debian/tests/hotspot-archs: No such file or directory │ │ │ │ Unable to compare jtreg results: no build jtreport found for hotspot/amd64. │ │ │ │ Reason: '/usr/share/doc/openjdk-21-jre-headless//test-amd64/jtreport-hotspot.tar.gz' does not exist. │ │ │ │ Command exited with non-zero status 77 │ │ │ │ Command being timed: "debian/tests/jaxp" │ │ │ │ - User time (seconds): 3454.10 │ │ │ │ - System time (seconds): 200.51 │ │ │ │ - Percent of CPU this job got: 254% │ │ │ │ - Elapsed (wall clock) time (h:mm:ss or m:ss): 23:57.83 │ │ │ │ + User time (seconds): 2037.89 │ │ │ │ + System time (seconds): 134.64 │ │ │ │ + Percent of CPU this job got: 238% │ │ │ │ + Elapsed (wall clock) time (h:mm:ss or m:ss): 15:12.64 │ │ │ │ Average shared text size (kbytes): 0 │ │ │ │ Average unshared data size (kbytes): 0 │ │ │ │ Average stack size (kbytes): 0 │ │ │ │ Average total size (kbytes): 0 │ │ │ │ - Maximum resident set size (kbytes): 304992 │ │ │ │ + Maximum resident set size (kbytes): 451264 │ │ │ │ Average resident set size (kbytes): 0 │ │ │ │ - Major (requiring I/O) page faults: 3 │ │ │ │ - Minor (reclaiming a frame) page faults: 21766375 │ │ │ │ - Voluntary context switches: 2615135 │ │ │ │ - Involuntary context switches: 29417 │ │ │ │ + Major (requiring I/O) page faults: 6 │ │ │ │ + Minor (reclaiming a frame) page faults: 22200894 │ │ │ │ + Voluntary context switches: 2593325 │ │ │ │ + Involuntary context switches: 186899 │ │ │ │ Swaps: 0 │ │ │ │ - File system inputs: 204776 │ │ │ │ - File system outputs: 0 │ │ │ │ + File system inputs: 137864 │ │ │ │ + File system outputs: 2967336 │ │ │ │ Socket messages sent: 0 │ │ │ │ Socket messages received: 0 │ │ │ │ Signals delivered: 0 │ │ │ │ Page size (bytes): 4096 │ │ │ │ Exit status: 77 │ │ │ │ ===== END check-jaxp ===== │ │ │ │ ===== START check-jdk ===== │ │ │ │ mkdir -p jtreg-test-output/jdk │ │ │ │ BOOTJDK_HOME=/usr/lib/jvm/java-21-openjdk-amd64 JTREG_OPTIONS= VMNAME=hotspot JDK_TO_TEST=build/bootcycle-build/images/jdk \ │ │ │ │ AUTOPKGTEST_TMP=/tmp/ AUTOPKGTEST_ARTIFACTS=jtreg-test-output/ \ │ │ │ │ /usr/bin/time -v debian/tests/jdk | tee jtreg-test-output/check-jdk.log │ │ │ │ - │ │ │ │ -(xfwm4:3059185): atspi-WARNING **: 19:29:58.566: AT-SPI: Error retrieving accessibility bus address: org.freedesktop.DBus.Error.ServiceUnknown: The name org.a11y.Bus was not provided by any .service files │ │ │ │ -dbus-daemon[3059174]: [session uid=999 pid=3059174 pidfd=5] Activating service name='org.xfce.Xfconf' requested by ':1.1' (uid=999 pid=3059185 comm="xfwm4") │ │ │ │ -dbus-daemon[3059174]: [session uid=999 pid=3059174 pidfd=5] Successfully activated service 'org.xfce.Xfconf' │ │ │ │ -WARNING: Glycin running without sandbox. Bubblewrap (bwrap) doesn't work in the environment. │ │ │ │ dpkg: error: --compare-versions takes three arguments: │ │ │ │ │ │ │ │ Type dpkg --help for help about installing and deinstalling packages [*]; │ │ │ │ Use 'apt' or 'aptitude' for user-friendly package management; │ │ │ │ Type dpkg -Dhelp for a list of dpkg debug flag values; │ │ │ │ Type dpkg --force-help for a list of forcing options; │ │ │ │ Type dpkg-deb --help for help about manipulating *.deb files; │ │ │ │ │ │ │ │ Options marked [*] produce a lot of output - pipe it through 'less' or 'more' ! │ │ │ │ - │ │ │ │ -(xfwm4:3059185): xfwm4-WARNING **: 19:30:01.119: Another compositing manager is running on screen 0 │ │ │ │ - │ │ │ │ -(xfwm4:3059185): xfwm4-WARNING **: 19:30:01.125: Failed to connect to session manager: Failed to connect to the session manager: SESSION_MANAGER environment variable not defined │ │ │ │ Directory "/tmp/jdk/JTwork" not found: creating │ │ │ │ Directory "jtreg-test-output/jdk/0/JTreport" not found: creating │ │ │ │ + │ │ │ │ +(xfwm4:561614): atspi-WARNING **: 02:54:17.476: AT-SPI: Error retrieving accessibility bus address: org.freedesktop.DBus.Error.ServiceUnknown: The name org.a11y.Bus was not provided by any .service files │ │ │ │ +dbus-daemon[561603]: [session uid=999 pid=561603 pidfd=5] Activating service name='org.xfce.Xfconf' requested by ':1.1' (uid=999 pid=561614 comm="xfwm4") │ │ │ │ +dbus-daemon[561603]: [session uid=999 pid=561603 pidfd=5] Successfully activated service 'org.xfce.Xfconf' │ │ │ │ +WARNING: Glycin running without sandbox. Bubblewrap (bwrap) doesn't work in the environment. │ │ │ │ + │ │ │ │ +(xfwm4:561614): xfwm4-WARNING **: 02:54:24.284: Another compositing manager is running on screen 0 │ │ │ │ + │ │ │ │ +(xfwm4:561614): xfwm4-WARNING **: 02:54:24.286: Failed to connect to session manager: Failed to connect to the session manager: SESSION_MANAGER environment variable not defined │ │ │ │ Passed: com/sun/jdi/AcceptTimeout.java │ │ │ │ Passed: com/sun/jdi/AccessSpecifierTest.java │ │ │ │ Passed: com/sun/jdi/AfterThreadDeathTest.java │ │ │ │ Passed: com/sun/jdi/ArrayRangeTest.java │ │ │ │ Passed: com/sun/jdi/ConstantPoolInfo.java │ │ │ │ Passed: com/sun/jdi/CountFilterTest.java │ │ │ │ Passed: com/sun/jdi/EarlyReturnNegativeTest.java │ │ │ │ @@ -8923,14 +8938,15 @@ │ │ │ │ Passed: java/io/File/ListRoots.java │ │ │ │ Passed: java/io/File/ListSpace.java │ │ │ │ Passed: java/io/File/MaxPathLength.java │ │ │ │ Passed: java/io/File/Mkdir.java │ │ │ │ Passed: java/io/File/NulFile.java │ │ │ │ Passed: java/io/File/NullArgs.java │ │ │ │ Passed: java/io/File/SetAccess.java │ │ │ │ +Passed: java/io/File/SetLastModified.java │ │ │ │ Passed: java/io/File/SetReadOnly.java │ │ │ │ Passed: java/io/File/SymLinks.java │ │ │ │ Passed: java/io/File/TempDirDoesNotExist.java │ │ │ │ Passed: java/io/File/TimeZoneLastModified.java │ │ │ │ Passed: java/io/File/ToURI.java │ │ │ │ Passed: java/io/File/ToURL.java │ │ │ │ Passed: java/io/File/Unicode.java │ │ │ │ @@ -10926,14 +10942,15 @@ │ │ │ │ Passed: java/nio/channels/AsynchronousSocketChannel/StressLoopback.java │ │ │ │ Passed: java/nio/channels/Channels/Basic.java │ │ │ │ Passed: java/nio/channels/Channels/Basic2.java │ │ │ │ Passed: java/nio/channels/Channels/CloseWriterOnFailedFlush.java │ │ │ │ Passed: java/nio/channels/Channels/EncodingTest.java │ │ │ │ Passed: java/nio/channels/Channels/ReadByte.java │ │ │ │ Passed: java/nio/channels/Channels/ReadOffset.java │ │ │ │ +Passed: java/nio/channels/Channels/ReadXBytes.java │ │ │ │ Passed: java/nio/channels/Channels/ShortWrite.java │ │ │ │ Passed: java/nio/channels/Channels/SocketChannelStreams.java │ │ │ │ Passed: java/nio/channels/Channels/TinyBuffers.java │ │ │ │ Passed: java/nio/channels/Channels/TransferTo_2GB_transferFrom.java │ │ │ │ Passed: java/nio/channels/Channels/TransferTo_2GB_transferTo.java │ │ │ │ Passed: java/nio/channels/Channels/TransferTo.java │ │ │ │ Passed: java/nio/channels/Channels/TransferTo2.java │ │ │ │ @@ -14762,32 +14779,32 @@ │ │ │ │ Passed: tools/launcher/TestXcheckJNIWarnings.java#jdwp-agent │ │ │ │ Passed: tools/launcher/TestXcheckJNIWarnings.java#noagent │ │ │ │ Passed: tools/launcher/ToolsOpts.java │ │ │ │ Passed: tools/launcher/TooSmallStackSize.java │ │ │ │ Passed: tools/launcher/UnicodeTest.java │ │ │ │ Passed: tools/launcher/UnresolvedExceptions.java │ │ │ │ Passed: tools/launcher/VersionCheck.java │ │ │ │ -Test results: passed: 6,501; failed: 9; skipped: 115; excluded: 38; did not match keywords: 37; did not meet module requirements: 3; did not meet platform requirements: 101 │ │ │ │ -Framework-based tests: 335,210 = 164,236 TestNG + 170,974 JUnit │ │ │ │ +Test results: passed: 6,503; failed: 9; skipped: 115; excluded: 38; did not match keywords: 37; did not meet module requirements: 3; did not meet platform requirements: 99 │ │ │ │ Error: Some tests failed or other problems occurred. │ │ │ │ +Framework-based tests: 335,229 = 164,255 TestNG + 170,974 JUnit │ │ │ │ Report written to /build/reproducible-path/openjdk-21-21.0.13+9/jtreg-test-output/jdk/0/JTreport/html/report.html │ │ │ │ Results written to /tmp/jdk/JTwork │ │ │ │ Directory "jtreg-test-output/jdk/1/JTreport" not found: creating │ │ │ │ FAILED: java/net/MulticastSocket/B6427403.java │ │ │ │ FAILED: java/net/MulticastSocket/NoLoopbackPackets.java │ │ │ │ FAILED: java/net/MulticastSocket/Promiscuous.java │ │ │ │ FAILED: java/net/MulticastSocket/SetLoopbackMode.java │ │ │ │ FAILED: java/net/MulticastSocket/SetLoopbackModeIPv4.java │ │ │ │ FAILED: java/net/MulticastSocket/Test.java │ │ │ │ FAILED: java/net/SocketOption/OptionsTest.java │ │ │ │ FAILED: java/net/SocketPermission/SocketPermissionTest.java │ │ │ │ FAILED: sun/security/krb5/auto/Addresses.java │ │ │ │ Test results: failed: 9; excluded: 38; did not match keywords: 37; did not match prior status: 6,605 │ │ │ │ -Framework-based tests: 8 = 8 TestNG + 0 JUnit │ │ │ │ Error: Some tests failed or other problems occurred. │ │ │ │ +Framework-based tests: 8 = 8 TestNG + 0 JUnit │ │ │ │ Report written to /build/reproducible-path/openjdk-21-21.0.13+9/jtreg-test-output/jdk/1/JTreport/html/report.html │ │ │ │ Results written to /tmp/jdk/JTwork │ │ │ │ Directory "jtreg-test-output/jdk/2/JTreport" not found: creating │ │ │ │ FAILED: java/net/MulticastSocket/B6427403.java │ │ │ │ FAILED: java/net/MulticastSocket/NoLoopbackPackets.java │ │ │ │ FAILED: java/net/MulticastSocket/Promiscuous.java │ │ │ │ FAILED: java/net/MulticastSocket/SetLoopbackMode.java │ │ │ │ @@ -14800,44 +14817,44 @@ │ │ │ │ Framework-based tests: 8 = 8 TestNG + 0 JUnit │ │ │ │ Report written to /build/reproducible-path/openjdk-21-21.0.13+9/jtreg-test-output/jdk/2/JTreport/html/report.html │ │ │ │ Results written to /tmp/jdk/JTwork │ │ │ │ Error: Some tests failed or other problems occurred. │ │ │ │ [debian/tests/jtreg-autopkgtest.sh] nothing to cleanup │ │ │ │ Command exited with non-zero status 2 │ │ │ │ Command being timed: "debian/tests/jdk" │ │ │ │ - User time (seconds): 22494.83 │ │ │ │ - System time (seconds): 1739.43 │ │ │ │ - Percent of CPU this job got: 151% │ │ │ │ - Elapsed (wall clock) time (h:mm:ss or m:ss): 4:26:00 │ │ │ │ + User time (seconds): 15467.92 │ │ │ │ + System time (seconds): 1233.61 │ │ │ │ + Percent of CPU this job got: 119% │ │ │ │ + Elapsed (wall clock) time (h:mm:ss or m:ss): 3:52:34 │ │ │ │ Average shared text size (kbytes): 0 │ │ │ │ Average unshared data size (kbytes): 0 │ │ │ │ Average stack size (kbytes): 0 │ │ │ │ Average total size (kbytes): 0 │ │ │ │ - Maximum resident set size (kbytes): 8312192 │ │ │ │ + Maximum resident set size (kbytes): 15809892 │ │ │ │ Average resident set size (kbytes): 0 │ │ │ │ - Major (requiring I/O) page faults: 2656 │ │ │ │ - Minor (reclaiming a frame) page faults: 132562979 │ │ │ │ - Voluntary context switches: 32526854 │ │ │ │ - Involuntary context switches: 1683195 │ │ │ │ + Major (requiring I/O) page faults: 125 │ │ │ │ + Minor (reclaiming a frame) page faults: 132527284 │ │ │ │ + Voluntary context switches: 36115333 │ │ │ │ + Involuntary context switches: 5520020 │ │ │ │ Swaps: 0 │ │ │ │ - File system inputs: 1932728 │ │ │ │ - File system outputs: 0 │ │ │ │ + File system inputs: 1929240 │ │ │ │ + File system outputs: 87752088 │ │ │ │ Socket messages sent: 0 │ │ │ │ Socket messages received: 0 │ │ │ │ Signals delivered: 0 │ │ │ │ Page size (bytes): 4096 │ │ │ │ Exit status: 2 │ │ │ │ Killed │ │ │ │ ===== END check-jdk ===== │ │ │ │ for i in hotspot langtools jaxp jdk; do \ │ │ │ │ echo "--------------- jtreg console summary for $i ---------------"; \ │ │ │ │ egrep -v '^(Passed:|Directory|Re[a-z]+\ written\ to)' jtreg-test-output/check-$i.log; \ │ │ │ │ done | tee jtreg-test-output/jtreg-summary.log │ │ │ │ --------------- jtreg console summary for hotspot --------------- │ │ │ │ -Test results: passed: 3,150; skipped: 4; excluded: 42; did not match keywords: 75; did not meet platform requirements: 179 │ │ │ │ +Test results: passed: 3,165; skipped: 4; excluded: 42; did not match keywords: 75; did not meet platform requirements: 164 │ │ │ │ Framework-based tests: 2,176 = 1,909 TestNG + 267 JUnit │ │ │ │ [debian/tests/jtreg-autopkgtest.sh] nothing to cleanup │ │ │ │ Unable to compare jtreg results: no build jtreport found for hotspot/amd64. │ │ │ │ Reason: '/usr/share/doc/openjdk-21-jre-headless//test-amd64/jtreport-hotspot.tar.gz' does not exist. │ │ │ │ --------------- jtreg console summary for langtools --------------- │ │ │ │ Test results: passed: 4,434; skipped: 1; excluded: 12; did not match keywords: 1; did not meet platform requirements: 1 │ │ │ │ Framework-based tests: 4,129 = 3,147 TestNG + 982 JUnit │ │ │ │ @@ -14856,16 +14873,16 @@ │ │ │ │ FAILED: java/net/MulticastSocket/Promiscuous.java │ │ │ │ FAILED: java/net/MulticastSocket/SetLoopbackMode.java │ │ │ │ FAILED: java/net/MulticastSocket/SetLoopbackModeIPv4.java │ │ │ │ FAILED: java/net/MulticastSocket/Test.java │ │ │ │ FAILED: java/net/SocketOption/OptionsTest.java │ │ │ │ FAILED: java/net/SocketPermission/SocketPermissionTest.java │ │ │ │ FAILED: sun/security/krb5/auto/Addresses.java │ │ │ │ -Test results: passed: 6,501; failed: 9; skipped: 115; excluded: 38; did not match keywords: 37; did not meet module requirements: 3; did not meet platform requirements: 101 │ │ │ │ -Framework-based tests: 335,210 = 164,236 TestNG + 170,974 JUnit │ │ │ │ +Test results: passed: 6,503; failed: 9; skipped: 115; excluded: 38; did not match keywords: 37; did not meet module requirements: 3; did not meet platform requirements: 99 │ │ │ │ +Framework-based tests: 335,229 = 164,255 TestNG + 170,974 JUnit │ │ │ │ FAILED: java/net/MulticastSocket/B6427403.java │ │ │ │ FAILED: java/net/MulticastSocket/NoLoopbackPackets.java │ │ │ │ FAILED: java/net/MulticastSocket/Promiscuous.java │ │ │ │ FAILED: java/net/MulticastSocket/SetLoopbackMode.java │ │ │ │ FAILED: java/net/MulticastSocket/SetLoopbackModeIPv4.java │ │ │ │ FAILED: java/net/MulticastSocket/Test.java │ │ │ │ FAILED: java/net/SocketOption/OptionsTest.java │ │ │ │ @@ -14883,29 +14900,29 @@ │ │ │ │ FAILED: java/net/SocketPermission/SocketPermissionTest.java │ │ │ │ FAILED: sun/security/krb5/auto/Addresses.java │ │ │ │ Test results: failed: 9; excluded: 38; did not match keywords: 37; did not match prior status: 6,605 │ │ │ │ Framework-based tests: 8 = 8 TestNG + 0 JUnit │ │ │ │ [debian/tests/jtreg-autopkgtest.sh] nothing to cleanup │ │ │ │ make[2]: Leaving directory '/build/reproducible-path/openjdk-21-21.0.13+9' │ │ │ │ Command being timed: "/usr/bin/make -f debian/rules -k jtregcheck TEST_SUITES=hotspot langtools jaxp jdk JTREG_OPTIONS=" │ │ │ │ - User time (seconds): 44226.94 │ │ │ │ - System time (seconds): 4277.18 │ │ │ │ - Percent of CPU this job got: 149% │ │ │ │ - Elapsed (wall clock) time (h:mm:ss or m:ss): 9:01:35 │ │ │ │ + User time (seconds): 30137.74 │ │ │ │ + System time (seconds): 2951.14 │ │ │ │ + Percent of CPU this job got: 120% │ │ │ │ + Elapsed (wall clock) time (h:mm:ss or m:ss): 7:36:13 │ │ │ │ Average shared text size (kbytes): 0 │ │ │ │ Average unshared data size (kbytes): 0 │ │ │ │ Average stack size (kbytes): 0 │ │ │ │ Average total size (kbytes): 0 │ │ │ │ - Maximum resident set size (kbytes): 8312192 │ │ │ │ + Maximum resident set size (kbytes): 15809892 │ │ │ │ Average resident set size (kbytes): 0 │ │ │ │ - Major (requiring I/O) page faults: 10865 │ │ │ │ - Minor (reclaiming a frame) page faults: 298348317 │ │ │ │ - Voluntary context switches: 86977922 │ │ │ │ - Involuntary context switches: 8327266 │ │ │ │ + Major (requiring I/O) page faults: 551 │ │ │ │ + Minor (reclaiming a frame) page faults: 311837427 │ │ │ │ + Voluntary context switches: 108610736 │ │ │ │ + Involuntary context switches: 43872217 │ │ │ │ Swaps: 0 │ │ │ │ - File system inputs: 4260624 │ │ │ │ - File system outputs: 0 │ │ │ │ + File system inputs: 2460408 │ │ │ │ + File system outputs: 120137328 │ │ │ │ Socket messages sent: 0 │ │ │ │ Socket messages received: 0 │ │ │ │ Signals delivered: 0 │ │ │ │ Page size (bytes): 4096 │ │ │ │ Exit status: 0 │ │ ├── ./usr/share/doc/openjdk-21-jre-headless/test-amd64/jtreport-hotspot.tar.gz │ │ │ ├── jtreport-hotspot.tar │ │ │ │ ├── file list │ │ │ │ │ @@ -1,230 +1,230 @@ │ │ │ │ │ -lrwxrwxrwx 0 sbuild (999) sbuild (999) 0 2026-10-22 23:55:58.000000 jtreg-test-output/jdk/JTreport -> 2/JTreport │ │ │ │ │ -drwxr-xr-x 0 sbuild (999) sbuild (999) 0 2026-10-22 23:55:34.000000 jtreg-test-output/jdk/2/JTreport/ │ │ │ │ │ --rw-r--r-- 0 sbuild (999) sbuild (999) 708 2026-10-22 23:55:34.000000 jtreg-test-output/jdk/2/JTreport/index.html │ │ │ │ │ --rw-r--r-- 0 sbuild (999) sbuild (999) 0 2026-10-22 23:55:34.000000 jtreg-test-output/jdk/2/JTreport/reportdir.dat │ │ │ │ │ -drwxr-xr-x 0 sbuild (999) sbuild (999) 0 2026-10-22 23:55:34.000000 jtreg-test-output/jdk/2/JTreport/html/ │ │ │ │ │ --rw-r--r-- 0 sbuild (999) sbuild (999) 762781 2026-10-22 23:55:34.000000 jtreg-test-output/jdk/2/JTreport/html/notRun_gr.html │ │ │ │ │ --rw-r--r-- 0 sbuild (999) sbuild (999) 762508 2026-10-22 23:55:34.000000 jtreg-test-output/jdk/2/JTreport/html/notRun.html │ │ │ │ │ --rw-r--r-- 0 sbuild (999) sbuild (999) 522 2026-10-22 23:55:34.000000 jtreg-test-output/jdk/2/JTreport/html/error_gr.html │ │ │ │ │ --rw-r--r-- 0 sbuild (999) sbuild (999) 474 2026-10-22 23:55:34.000000 jtreg-test-output/jdk/2/JTreport/html/error.html │ │ │ │ │ --rw-r--r-- 0 sbuild (999) sbuild (999) 2751 2026-10-22 23:55:34.000000 jtreg-test-output/jdk/2/JTreport/html/failed_gr.html │ │ │ │ │ --rw-r--r-- 0 sbuild (999) sbuild (999) 2021 2026-10-22 23:55:34.000000 jtreg-test-output/jdk/2/JTreport/html/failed.html │ │ │ │ │ --rw-r--r-- 0 sbuild (999) sbuild (999) 1251149 2026-10-22 23:55:34.000000 jtreg-test-output/jdk/2/JTreport/html/passed_gr.html │ │ │ │ │ --rw-r--r-- 0 sbuild (999) sbuild (999) 1250106 2026-10-22 23:55:34.000000 jtreg-test-output/jdk/2/JTreport/html/passed.html │ │ │ │ │ --rw-r--r-- 0 sbuild (999) sbuild (999) 83175 2026-10-22 23:55:34.000000 jtreg-test-output/jdk/2/JTreport/html/excluded.html │ │ │ │ │ --rw-r--r-- 0 sbuild (999) sbuild (999) 4215 2026-10-22 23:55:34.000000 jtreg-test-output/jdk/2/JTreport/html/env.html │ │ │ │ │ --rw-r--r-- 0 sbuild (999) sbuild (999) 24356 2026-10-22 23:55:34.000000 jtreg-test-output/jdk/2/JTreport/html/config.html │ │ │ │ │ --rw-r--r-- 0 sbuild (999) sbuild (999) 307 2026-10-22 23:55:34.000000 jtreg-test-output/jdk/2/JTreport/html/report.css │ │ │ │ │ --rw-r--r-- 0 sbuild (999) sbuild (999) 1101115 2026-10-22 23:55:34.000000 jtreg-test-output/jdk/2/JTreport/html/index.html │ │ │ │ │ --rw-r--r-- 0 sbuild (999) sbuild (999) 1101115 2026-10-22 23:55:34.000000 jtreg-test-output/jdk/2/JTreport/html/report.html │ │ │ │ │ -drwxr-xr-x 0 sbuild (999) sbuild (999) 0 2026-10-22 23:55:34.000000 jtreg-test-output/jdk/2/JTreport/text/ │ │ │ │ │ --rw-r--r-- 0 sbuild (999) sbuild (999) 132 2026-10-22 23:55:34.000000 jtreg-test-output/jdk/2/JTreport/text/testng.txt │ │ │ │ │ --rw-r--r-- 0 sbuild (999) sbuild (999) 1023561 2026-10-22 23:55:34.000000 jtreg-test-output/jdk/2/JTreport/text/notRun.txt │ │ │ │ │ --rw-r--r-- 0 sbuild (999) sbuild (999) 101 2026-10-22 23:55:34.000000 jtreg-test-output/jdk/2/JTreport/text/stats.txt │ │ │ │ │ --rw-r--r-- 0 sbuild (999) sbuild (999) 116 2026-10-22 23:55:34.000000 jtreg-test-output/jdk/2/JTreport/text/timeStats.txt │ │ │ │ │ --rw-r--r-- 0 sbuild (999) sbuild (999) 21 2026-10-22 23:55:34.000000 jtreg-test-output/jdk/2/JTreport/text/tc_newfailures.txt │ │ │ │ │ --rw-r--r-- 0 sbuild (999) sbuild (999) 21 2026-10-22 23:55:34.000000 jtreg-test-output/jdk/2/JTreport/text/tc_fail2notrun.txt │ │ │ │ │ --rw-r--r-- 0 sbuild (999) sbuild (999) 20 2026-10-22 23:55:34.000000 jtreg-test-output/jdk/2/JTreport/text/tc_fail2error.txt │ │ │ │ │ --rw-r--r-- 0 sbuild (999) sbuild (999) 19 2026-10-22 23:55:34.000000 jtreg-test-output/jdk/2/JTreport/text/tc_fail2pass.txt │ │ │ │ │ --rw-r--r-- 0 sbuild (999) sbuild (999) 22 2026-10-22 23:55:34.000000 jtreg-test-output/jdk/2/JTreport/text/tc_fail2missing.txt │ │ │ │ │ --rw-r--r-- 0 sbuild (999) sbuild (999) 19 2026-10-22 23:55:34.000000 jtreg-test-output/jdk/2/JTreport/text/other_errors.txt │ │ │ │ │ --rw-r--r-- 0 sbuild (999) sbuild (999) 416 2026-10-22 23:55:34.000000 jtreg-test-output/jdk/2/JTreport/text/newfailures.txt │ │ │ │ │ --rw-r--r-- 0 sbuild (999) sbuild (999) 16 2026-10-22 23:55:34.000000 jtreg-test-output/jdk/2/JTreport/text/fail2fail.txt │ │ │ │ │ --rw-r--r-- 0 sbuild (999) sbuild (999) 18 2026-10-22 23:55:34.000000 jtreg-test-output/jdk/2/JTreport/text/fail2notrun.txt │ │ │ │ │ --rw-r--r-- 0 sbuild (999) sbuild (999) 17 2026-10-22 23:55:34.000000 jtreg-test-output/jdk/2/JTreport/text/faiL2error.txt │ │ │ │ │ --rw-r--r-- 0 sbuild (999) sbuild (999) 16 2026-10-22 23:55:34.000000 jtreg-test-output/jdk/2/JTreport/text/fail2pass.txt │ │ │ │ │ --rw-r--r-- 0 sbuild (999) sbuild (999) 19 2026-10-22 23:55:34.000000 jtreg-test-output/jdk/2/JTreport/text/fail2missing.txt │ │ │ │ │ --rw-r--r-- 0 sbuild (999) sbuild (999) 889846 2026-10-22 23:55:34.000000 jtreg-test-output/jdk/2/JTreport/text/summary.txt │ │ │ │ │ --rw-r--r-- 0 sbuild (999) sbuild (999) 548 2026-10-22 23:55:19.000000 jtreg-test-output/jdk/2/JTreport/text/cmdArgs.txt │ │ │ │ │ -drwxr-xr-x 0 sbuild (999) sbuild (999) 0 2026-10-22 23:54:55.000000 jtreg-test-output/jdk/1/JTreport/ │ │ │ │ │ --rw-r--r-- 0 sbuild (999) sbuild (999) 708 2026-10-22 23:54:55.000000 jtreg-test-output/jdk/1/JTreport/index.html │ │ │ │ │ --rw-r--r-- 0 sbuild (999) sbuild (999) 0 2026-10-22 23:54:55.000000 jtreg-test-output/jdk/1/JTreport/reportdir.dat │ │ │ │ │ -drwxr-xr-x 0 sbuild (999) sbuild (999) 0 2026-10-22 23:54:55.000000 jtreg-test-output/jdk/1/JTreport/html/ │ │ │ │ │ --rw-r--r-- 0 sbuild (999) sbuild (999) 762781 2026-10-22 23:54:55.000000 jtreg-test-output/jdk/1/JTreport/html/notRun_gr.html │ │ │ │ │ --rw-r--r-- 0 sbuild (999) sbuild (999) 762508 2026-10-22 23:54:55.000000 jtreg-test-output/jdk/1/JTreport/html/notRun.html │ │ │ │ │ --rw-r--r-- 0 sbuild (999) sbuild (999) 522 2026-10-22 23:54:55.000000 jtreg-test-output/jdk/1/JTreport/html/error_gr.html │ │ │ │ │ --rw-r--r-- 0 sbuild (999) sbuild (999) 474 2026-10-22 23:54:55.000000 jtreg-test-output/jdk/1/JTreport/html/error.html │ │ │ │ │ --rw-r--r-- 0 sbuild (999) sbuild (999) 2751 2026-10-22 23:54:55.000000 jtreg-test-output/jdk/1/JTreport/html/failed_gr.html │ │ │ │ │ --rw-r--r-- 0 sbuild (999) sbuild (999) 2021 2026-10-22 23:54:55.000000 jtreg-test-output/jdk/1/JTreport/html/failed.html │ │ │ │ │ --rw-r--r-- 0 sbuild (999) sbuild (999) 1251149 2026-10-22 23:54:55.000000 jtreg-test-output/jdk/1/JTreport/html/passed_gr.html │ │ │ │ │ --rw-r--r-- 0 sbuild (999) sbuild (999) 1250106 2026-10-22 23:54:55.000000 jtreg-test-output/jdk/1/JTreport/html/passed.html │ │ │ │ │ --rw-r--r-- 0 sbuild (999) sbuild (999) 83175 2026-10-22 23:54:55.000000 jtreg-test-output/jdk/1/JTreport/html/excluded.html │ │ │ │ │ --rw-r--r-- 0 sbuild (999) sbuild (999) 4215 2026-10-22 23:54:55.000000 jtreg-test-output/jdk/1/JTreport/html/env.html │ │ │ │ │ --rw-r--r-- 0 sbuild (999) sbuild (999) 24356 2026-10-22 23:54:55.000000 jtreg-test-output/jdk/1/JTreport/html/config.html │ │ │ │ │ --rw-r--r-- 0 sbuild (999) sbuild (999) 307 2026-10-22 23:54:55.000000 jtreg-test-output/jdk/1/JTreport/html/report.css │ │ │ │ │ --rw-r--r-- 0 sbuild (999) sbuild (999) 1101115 2026-10-22 23:54:55.000000 jtreg-test-output/jdk/1/JTreport/html/index.html │ │ │ │ │ --rw-r--r-- 0 sbuild (999) sbuild (999) 1101115 2026-10-22 23:54:55.000000 jtreg-test-output/jdk/1/JTreport/html/report.html │ │ │ │ │ -drwxr-xr-x 0 sbuild (999) sbuild (999) 0 2026-10-22 23:54:55.000000 jtreg-test-output/jdk/1/JTreport/text/ │ │ │ │ │ --rw-r--r-- 0 sbuild (999) sbuild (999) 132 2026-10-22 23:54:55.000000 jtreg-test-output/jdk/1/JTreport/text/testng.txt │ │ │ │ │ --rw-r--r-- 0 sbuild (999) sbuild (999) 1023561 2026-10-22 23:54:55.000000 jtreg-test-output/jdk/1/JTreport/text/notRun.txt │ │ │ │ │ --rw-r--r-- 0 sbuild (999) sbuild (999) 101 2026-10-22 23:54:55.000000 jtreg-test-output/jdk/1/JTreport/text/stats.txt │ │ │ │ │ --rw-r--r-- 0 sbuild (999) sbuild (999) 116 2026-10-22 23:54:55.000000 jtreg-test-output/jdk/1/JTreport/text/timeStats.txt │ │ │ │ │ --rw-r--r-- 0 sbuild (999) sbuild (999) 21 2026-10-22 23:54:55.000000 jtreg-test-output/jdk/1/JTreport/text/tc_newfailures.txt │ │ │ │ │ --rw-r--r-- 0 sbuild (999) sbuild (999) 21 2026-10-22 23:54:55.000000 jtreg-test-output/jdk/1/JTreport/text/tc_fail2notrun.txt │ │ │ │ │ --rw-r--r-- 0 sbuild (999) sbuild (999) 20 2026-10-22 23:54:55.000000 jtreg-test-output/jdk/1/JTreport/text/tc_fail2error.txt │ │ │ │ │ --rw-r--r-- 0 sbuild (999) sbuild (999) 19 2026-10-22 23:54:55.000000 jtreg-test-output/jdk/1/JTreport/text/tc_fail2pass.txt │ │ │ │ │ --rw-r--r-- 0 sbuild (999) sbuild (999) 22 2026-10-22 23:54:55.000000 jtreg-test-output/jdk/1/JTreport/text/tc_fail2missing.txt │ │ │ │ │ --rw-r--r-- 0 sbuild (999) sbuild (999) 19 2026-10-22 23:54:55.000000 jtreg-test-output/jdk/1/JTreport/text/other_errors.txt │ │ │ │ │ --rw-r--r-- 0 sbuild (999) sbuild (999) 416 2026-10-22 23:54:55.000000 jtreg-test-output/jdk/1/JTreport/text/newfailures.txt │ │ │ │ │ --rw-r--r-- 0 sbuild (999) sbuild (999) 16 2026-10-22 23:54:55.000000 jtreg-test-output/jdk/1/JTreport/text/fail2fail.txt │ │ │ │ │ --rw-r--r-- 0 sbuild (999) sbuild (999) 18 2026-10-22 23:54:55.000000 jtreg-test-output/jdk/1/JTreport/text/fail2notrun.txt │ │ │ │ │ --rw-r--r-- 0 sbuild (999) sbuild (999) 17 2026-10-22 23:54:55.000000 jtreg-test-output/jdk/1/JTreport/text/faiL2error.txt │ │ │ │ │ --rw-r--r-- 0 sbuild (999) sbuild (999) 16 2026-10-22 23:54:55.000000 jtreg-test-output/jdk/1/JTreport/text/fail2pass.txt │ │ │ │ │ --rw-r--r-- 0 sbuild (999) sbuild (999) 19 2026-10-22 23:54:55.000000 jtreg-test-output/jdk/1/JTreport/text/fail2missing.txt │ │ │ │ │ --rw-r--r-- 0 sbuild (999) sbuild (999) 889846 2026-10-22 23:54:55.000000 jtreg-test-output/jdk/1/JTreport/text/summary.txt │ │ │ │ │ --rw-r--r-- 0 sbuild (999) sbuild (999) 548 2026-10-22 23:54:40.000000 jtreg-test-output/jdk/1/JTreport/text/cmdArgs.txt │ │ │ │ │ -drwxr-xr-x 0 sbuild (999) sbuild (999) 0 2026-10-22 23:54:16.000000 jtreg-test-output/jdk/0/JTreport/ │ │ │ │ │ --rw-r--r-- 0 sbuild (999) sbuild (999) 708 2026-10-22 23:54:16.000000 jtreg-test-output/jdk/0/JTreport/index.html │ │ │ │ │ --rw-r--r-- 0 sbuild (999) sbuild (999) 0 2026-10-22 23:54:16.000000 jtreg-test-output/jdk/0/JTreport/reportdir.dat │ │ │ │ │ -drwxr-xr-x 0 sbuild (999) sbuild (999) 0 2026-10-22 23:54:16.000000 jtreg-test-output/jdk/0/JTreport/html/ │ │ │ │ │ --rw-r--r-- 0 sbuild (999) sbuild (999) 20874 2026-10-22 23:54:16.000000 jtreg-test-output/jdk/0/JTreport/html/notRun_gr.html │ │ │ │ │ --rw-r--r-- 0 sbuild (999) sbuild (999) 20529 2026-10-22 23:54:16.000000 jtreg-test-output/jdk/0/JTreport/html/notRun.html │ │ │ │ │ --rw-r--r-- 0 sbuild (999) sbuild (999) 522 2026-10-22 23:54:16.000000 jtreg-test-output/jdk/0/JTreport/html/error_gr.html │ │ │ │ │ --rw-r--r-- 0 sbuild (999) sbuild (999) 474 2026-10-22 23:54:16.000000 jtreg-test-output/jdk/0/JTreport/html/error.html │ │ │ │ │ --rw-r--r-- 0 sbuild (999) sbuild (999) 2751 2026-10-22 23:54:16.000000 jtreg-test-output/jdk/0/JTreport/html/failed_gr.html │ │ │ │ │ --rw-r--r-- 0 sbuild (999) sbuild (999) 2021 2026-10-22 23:54:16.000000 jtreg-test-output/jdk/0/JTreport/html/failed.html │ │ │ │ │ --rw-r--r-- 0 sbuild (999) sbuild (999) 1251149 2026-10-22 23:54:16.000000 jtreg-test-output/jdk/0/JTreport/html/passed_gr.html │ │ │ │ │ --rw-r--r-- 0 sbuild (999) sbuild (999) 1250106 2026-10-22 23:54:16.000000 jtreg-test-output/jdk/0/JTreport/html/passed.html │ │ │ │ │ --rw-r--r-- 0 sbuild (999) sbuild (999) 83175 2026-10-22 23:54:15.000000 jtreg-test-output/jdk/0/JTreport/html/excluded.html │ │ │ │ │ --rw-r--r-- 0 sbuild (999) sbuild (999) 4196 2026-10-22 23:54:15.000000 jtreg-test-output/jdk/0/JTreport/html/env.html │ │ │ │ │ --rw-r--r-- 0 sbuild (999) sbuild (999) 23924 2026-10-22 23:54:15.000000 jtreg-test-output/jdk/0/JTreport/html/config.html │ │ │ │ │ --rw-r--r-- 0 sbuild (999) sbuild (999) 307 2026-10-22 23:54:15.000000 jtreg-test-output/jdk/0/JTreport/html/report.css │ │ │ │ │ --rw-r--r-- 0 sbuild (999) sbuild (999) 1123763 2026-10-22 23:54:15.000000 jtreg-test-output/jdk/0/JTreport/html/index.html │ │ │ │ │ --rw-r--r-- 0 sbuild (999) sbuild (999) 1123763 2026-10-22 23:54:15.000000 jtreg-test-output/jdk/0/JTreport/html/report.html │ │ │ │ │ -drwxr-xr-x 0 sbuild (999) sbuild (999) 0 2026-10-22 23:54:16.000000 jtreg-test-output/jdk/0/JTreport/text/ │ │ │ │ │ --rw-r--r-- 0 sbuild (999) sbuild (999) 86012 2026-10-22 23:54:16.000000 jtreg-test-output/jdk/0/JTreport/text/junit.txt │ │ │ │ │ --rw-r--r-- 0 sbuild (999) sbuild (999) 131792 2026-10-22 23:54:16.000000 jtreg-test-output/jdk/0/JTreport/text/testng.txt │ │ │ │ │ --rw-r--r-- 0 sbuild (999) sbuild (999) 26577 2026-10-22 23:54:16.000000 jtreg-test-output/jdk/0/JTreport/text/notRun.txt │ │ │ │ │ --rw-r--r-- 0 sbuild (999) sbuild (999) 173 2026-10-22 23:54:16.000000 jtreg-test-output/jdk/0/JTreport/text/stats.txt │ │ │ │ │ --rw-r--r-- 0 sbuild (999) sbuild (999) 982 2026-10-22 23:54:16.000000 jtreg-test-output/jdk/0/JTreport/text/timeStats.txt │ │ │ │ │ --rw-r--r-- 0 sbuild (999) sbuild (999) 21 2026-10-22 23:54:16.000000 jtreg-test-output/jdk/0/JTreport/text/tc_newfailures.txt │ │ │ │ │ --rw-r--r-- 0 sbuild (999) sbuild (999) 21 2026-10-22 23:54:16.000000 jtreg-test-output/jdk/0/JTreport/text/tc_fail2notrun.txt │ │ │ │ │ --rw-r--r-- 0 sbuild (999) sbuild (999) 20 2026-10-22 23:54:16.000000 jtreg-test-output/jdk/0/JTreport/text/tc_fail2error.txt │ │ │ │ │ --rw-r--r-- 0 sbuild (999) sbuild (999) 19 2026-10-22 23:54:16.000000 jtreg-test-output/jdk/0/JTreport/text/tc_fail2pass.txt │ │ │ │ │ --rw-r--r-- 0 sbuild (999) sbuild (999) 22 2026-10-22 23:54:16.000000 jtreg-test-output/jdk/0/JTreport/text/tc_fail2missing.txt │ │ │ │ │ --rw-r--r-- 0 sbuild (999) sbuild (999) 19 2026-10-22 23:54:16.000000 jtreg-test-output/jdk/0/JTreport/text/other_errors.txt │ │ │ │ │ --rw-r--r-- 0 sbuild (999) sbuild (999) 416 2026-10-22 23:54:16.000000 jtreg-test-output/jdk/0/JTreport/text/newfailures.txt │ │ │ │ │ --rw-r--r-- 0 sbuild (999) sbuild (999) 16 2026-10-22 23:54:16.000000 jtreg-test-output/jdk/0/JTreport/text/fail2fail.txt │ │ │ │ │ --rw-r--r-- 0 sbuild (999) sbuild (999) 18 2026-10-22 23:54:16.000000 jtreg-test-output/jdk/0/JTreport/text/fail2notrun.txt │ │ │ │ │ --rw-r--r-- 0 sbuild (999) sbuild (999) 17 2026-10-22 23:54:16.000000 jtreg-test-output/jdk/0/JTreport/text/faiL2error.txt │ │ │ │ │ --rw-r--r-- 0 sbuild (999) sbuild (999) 16 2026-10-22 23:54:16.000000 jtreg-test-output/jdk/0/JTreport/text/fail2pass.txt │ │ │ │ │ --rw-r--r-- 0 sbuild (999) sbuild (999) 19 2026-10-22 23:54:16.000000 jtreg-test-output/jdk/0/JTreport/text/fail2missing.txt │ │ │ │ │ --rw-r--r-- 0 sbuild (999) sbuild (999) 889846 2026-10-22 23:54:16.000000 jtreg-test-output/jdk/0/JTreport/text/summary.txt │ │ │ │ │ --rw-r--r-- 0 sbuild (999) sbuild (999) 529 2026-10-22 19:30:01.000000 jtreg-test-output/jdk/0/JTreport/text/cmdArgs.txt │ │ │ │ │ -lrwxrwxrwx 0 sbuild (999) sbuild (999) 0 2026-10-22 19:29:57.000000 jtreg-test-output/jaxp/JTreport -> 0/JTreport │ │ │ │ │ -drwxr-xr-x 0 sbuild (999) sbuild (999) 0 2026-10-22 19:29:56.000000 jtreg-test-output/jaxp/0/JTreport/ │ │ │ │ │ --rw-r--r-- 0 sbuild (999) sbuild (999) 710 2026-10-22 19:29:56.000000 jtreg-test-output/jaxp/0/JTreport/index.html │ │ │ │ │ --rw-r--r-- 0 sbuild (999) sbuild (999) 0 2026-10-22 19:29:56.000000 jtreg-test-output/jaxp/0/JTreport/reportdir.dat │ │ │ │ │ -drwxr-xr-x 0 sbuild (999) sbuild (999) 0 2026-10-22 19:29:56.000000 jtreg-test-output/jaxp/0/JTreport/html/ │ │ │ │ │ --rw-r--r-- 0 sbuild (999) sbuild (999) 695 2026-10-22 19:29:56.000000 jtreg-test-output/jaxp/0/JTreport/html/notRun_gr.html │ │ │ │ │ --rw-r--r-- 0 sbuild (999) sbuild (999) 573 2026-10-22 19:29:56.000000 jtreg-test-output/jaxp/0/JTreport/html/notRun.html │ │ │ │ │ --rw-r--r-- 0 sbuild (999) sbuild (999) 521 2026-10-22 19:29:56.000000 jtreg-test-output/jaxp/0/JTreport/html/error_gr.html │ │ │ │ │ --rw-r--r-- 0 sbuild (999) sbuild (999) 473 2026-10-22 19:29:56.000000 jtreg-test-output/jaxp/0/JTreport/html/error.html │ │ │ │ │ --rw-r--r-- 0 sbuild (999) sbuild (999) 513 2026-10-22 19:29:56.000000 jtreg-test-output/jaxp/0/JTreport/html/failed_gr.html │ │ │ │ │ --rw-r--r-- 0 sbuild (999) sbuild (999) 465 2026-10-22 19:29:56.000000 jtreg-test-output/jaxp/0/JTreport/html/failed.html │ │ │ │ │ --rw-r--r-- 0 sbuild (999) sbuild (999) 110062 2026-10-22 19:29:56.000000 jtreg-test-output/jaxp/0/JTreport/html/passed_gr.html │ │ │ │ │ --rw-r--r-- 0 sbuild (999) sbuild (999) 109973 2026-10-22 19:29:56.000000 jtreg-test-output/jaxp/0/JTreport/html/passed.html │ │ │ │ │ --rw-r--r-- 0 sbuild (999) sbuild (999) 3642 2026-10-22 19:29:56.000000 jtreg-test-output/jaxp/0/JTreport/html/excluded.html │ │ │ │ │ --rw-r--r-- 0 sbuild (999) sbuild (999) 4105 2026-10-22 19:29:56.000000 jtreg-test-output/jaxp/0/JTreport/html/env.html │ │ │ │ │ --rw-r--r-- 0 sbuild (999) sbuild (999) 4423 2026-10-22 19:29:56.000000 jtreg-test-output/jaxp/0/JTreport/html/config.html │ │ │ │ │ --rw-r--r-- 0 sbuild (999) sbuild (999) 307 2026-10-22 19:29:56.000000 jtreg-test-output/jaxp/0/JTreport/html/report.css │ │ │ │ │ --rw-r--r-- 0 sbuild (999) sbuild (999) 58492 2026-10-22 19:29:56.000000 jtreg-test-output/jaxp/0/JTreport/html/index.html │ │ │ │ │ --rw-r--r-- 0 sbuild (999) sbuild (999) 58492 2026-10-22 19:29:56.000000 jtreg-test-output/jaxp/0/JTreport/html/report.html │ │ │ │ │ -drwxr-xr-x 0 sbuild (999) sbuild (999) 0 2026-10-22 19:29:56.000000 jtreg-test-output/jaxp/0/JTreport/text/ │ │ │ │ │ --rw-r--r-- 0 sbuild (999) sbuild (999) 200 2026-10-22 19:29:56.000000 jtreg-test-output/jaxp/0/JTreport/text/junit.txt │ │ │ │ │ --rw-r--r-- 0 sbuild (999) sbuild (999) 69461 2026-10-22 19:29:56.000000 jtreg-test-output/jaxp/0/JTreport/text/testng.txt │ │ │ │ │ --rw-r--r-- 0 sbuild (999) sbuild (999) 116 2026-10-22 19:29:56.000000 jtreg-test-output/jaxp/0/JTreport/text/notRun.txt │ │ │ │ │ --rw-r--r-- 0 sbuild (999) sbuild (999) 65 2026-10-22 19:29:56.000000 jtreg-test-output/jaxp/0/JTreport/text/stats.txt │ │ │ │ │ --rw-r--r-- 0 sbuild (999) sbuild (999) 166 2026-10-22 19:29:56.000000 jtreg-test-output/jaxp/0/JTreport/text/timeStats.txt │ │ │ │ │ --rw-r--r-- 0 sbuild (999) sbuild (999) 21 2026-10-22 19:29:56.000000 jtreg-test-output/jaxp/0/JTreport/text/tc_newfailures.txt │ │ │ │ │ --rw-r--r-- 0 sbuild (999) sbuild (999) 21 2026-10-22 19:29:56.000000 jtreg-test-output/jaxp/0/JTreport/text/tc_fail2notrun.txt │ │ │ │ │ --rw-r--r-- 0 sbuild (999) sbuild (999) 20 2026-10-22 19:29:56.000000 jtreg-test-output/jaxp/0/JTreport/text/tc_fail2error.txt │ │ │ │ │ --rw-r--r-- 0 sbuild (999) sbuild (999) 19 2026-10-22 19:29:56.000000 jtreg-test-output/jaxp/0/JTreport/text/tc_fail2pass.txt │ │ │ │ │ --rw-r--r-- 0 sbuild (999) sbuild (999) 22 2026-10-22 19:29:56.000000 jtreg-test-output/jaxp/0/JTreport/text/tc_fail2missing.txt │ │ │ │ │ --rw-r--r-- 0 sbuild (999) sbuild (999) 19 2026-10-22 19:29:56.000000 jtreg-test-output/jaxp/0/JTreport/text/other_errors.txt │ │ │ │ │ --rw-r--r-- 0 sbuild (999) sbuild (999) 18 2026-10-22 19:29:56.000000 jtreg-test-output/jaxp/0/JTreport/text/newfailures.txt │ │ │ │ │ --rw-r--r-- 0 sbuild (999) sbuild (999) 16 2026-10-22 19:29:56.000000 jtreg-test-output/jaxp/0/JTreport/text/fail2fail.txt │ │ │ │ │ --rw-r--r-- 0 sbuild (999) sbuild (999) 18 2026-10-22 19:29:56.000000 jtreg-test-output/jaxp/0/JTreport/text/fail2notrun.txt │ │ │ │ │ --rw-r--r-- 0 sbuild (999) sbuild (999) 17 2026-10-22 19:29:56.000000 jtreg-test-output/jaxp/0/JTreport/text/faiL2error.txt │ │ │ │ │ --rw-r--r-- 0 sbuild (999) sbuild (999) 16 2026-10-22 19:29:56.000000 jtreg-test-output/jaxp/0/JTreport/text/fail2pass.txt │ │ │ │ │ --rw-r--r-- 0 sbuild (999) sbuild (999) 19 2026-10-22 19:29:56.000000 jtreg-test-output/jaxp/0/JTreport/text/fail2missing.txt │ │ │ │ │ --rw-r--r-- 0 sbuild (999) sbuild (999) 59118 2026-10-22 19:29:56.000000 jtreg-test-output/jaxp/0/JTreport/text/summary.txt │ │ │ │ │ --rw-r--r-- 0 sbuild (999) sbuild (999) 439 2026-10-22 19:06:00.000000 jtreg-test-output/jaxp/0/JTreport/text/cmdArgs.txt │ │ │ │ │ -lrwxrwxrwx 0 sbuild (999) sbuild (999) 0 2026-10-22 19:06:00.000000 jtreg-test-output/langtools/JTreport -> 0/JTreport │ │ │ │ │ -drwxr-xr-x 0 sbuild (999) sbuild (999) 0 2026-10-22 19:05:45.000000 jtreg-test-output/langtools/0/JTreport/ │ │ │ │ │ --rw-r--r-- 0 sbuild (999) sbuild (999) 720 2026-10-22 19:05:45.000000 jtreg-test-output/langtools/0/JTreport/index.html │ │ │ │ │ --rw-r--r-- 0 sbuild (999) sbuild (999) 0 2026-10-22 19:05:45.000000 jtreg-test-output/langtools/0/JTreport/reportdir.dat │ │ │ │ │ -drwxr-xr-x 0 sbuild (999) sbuild (999) 0 2026-10-22 19:05:45.000000 jtreg-test-output/langtools/0/JTreport/html/ │ │ │ │ │ --rw-r--r-- 0 sbuild (999) sbuild (999) 2463 2026-10-22 19:05:45.000000 jtreg-test-output/langtools/0/JTreport/html/notRun_gr.html │ │ │ │ │ --rw-r--r-- 0 sbuild (999) sbuild (999) 2174 2026-10-22 19:05:45.000000 jtreg-test-output/langtools/0/JTreport/html/notRun.html │ │ │ │ │ --rw-r--r-- 0 sbuild (999) sbuild (999) 521 2026-10-22 19:05:45.000000 jtreg-test-output/langtools/0/JTreport/html/error_gr.html │ │ │ │ │ --rw-r--r-- 0 sbuild (999) sbuild (999) 473 2026-10-22 19:05:45.000000 jtreg-test-output/langtools/0/JTreport/html/error.html │ │ │ │ │ --rw-r--r-- 0 sbuild (999) sbuild (999) 513 2026-10-22 19:05:45.000000 jtreg-test-output/langtools/0/JTreport/html/failed_gr.html │ │ │ │ │ --rw-r--r-- 0 sbuild (999) sbuild (999) 465 2026-10-22 19:05:45.000000 jtreg-test-output/langtools/0/JTreport/html/failed.html │ │ │ │ │ --rw-r--r-- 0 sbuild (999) sbuild (999) 885672 2026-10-22 19:05:45.000000 jtreg-test-output/langtools/0/JTreport/html/passed_gr.html │ │ │ │ │ --rw-r--r-- 0 sbuild (999) sbuild (999) 885347 2026-10-22 19:05:45.000000 jtreg-test-output/langtools/0/JTreport/html/passed.html │ │ │ │ │ --rw-r--r-- 0 sbuild (999) sbuild (999) 6195 2026-10-22 19:05:45.000000 jtreg-test-output/langtools/0/JTreport/html/excluded.html │ │ │ │ │ --rw-r--r-- 0 sbuild (999) sbuild (999) 4120 2026-10-22 19:05:45.000000 jtreg-test-output/langtools/0/JTreport/html/env.html │ │ │ │ │ --rw-r--r-- 0 sbuild (999) sbuild (999) 10783 2026-10-22 19:05:45.000000 jtreg-test-output/langtools/0/JTreport/html/config.html │ │ │ │ │ --rw-r--r-- 0 sbuild (999) sbuild (999) 307 2026-10-22 19:05:45.000000 jtreg-test-output/langtools/0/JTreport/html/report.css │ │ │ │ │ --rw-r--r-- 0 sbuild (999) sbuild (999) 541887 2026-10-22 19:05:45.000000 jtreg-test-output/langtools/0/JTreport/html/index.html │ │ │ │ │ --rw-r--r-- 0 sbuild (999) sbuild (999) 541887 2026-10-22 19:05:45.000000 jtreg-test-output/langtools/0/JTreport/html/report.html │ │ │ │ │ -drwxr-xr-x 0 sbuild (999) sbuild (999) 0 2026-10-22 19:05:45.000000 jtreg-test-output/langtools/0/JTreport/text/ │ │ │ │ │ --rw-r--r-- 0 sbuild (999) sbuild (999) 18737 2026-10-22 19:05:45.000000 jtreg-test-output/langtools/0/JTreport/text/junit.txt │ │ │ │ │ --rw-r--r-- 0 sbuild (999) sbuild (999) 9538 2026-10-22 19:05:45.000000 jtreg-test-output/langtools/0/JTreport/text/testng.txt │ │ │ │ │ --rw-r--r-- 0 sbuild (999) sbuild (999) 1921 2026-10-22 19:05:45.000000 jtreg-test-output/langtools/0/JTreport/text/notRun.txt │ │ │ │ │ --rw-r--r-- 0 sbuild (999) sbuild (999) 120 2026-10-22 19:05:45.000000 jtreg-test-output/langtools/0/JTreport/text/stats.txt │ │ │ │ │ --rw-r--r-- 0 sbuild (999) sbuild (999) 490 2026-10-22 19:05:45.000000 jtreg-test-output/langtools/0/JTreport/text/timeStats.txt │ │ │ │ │ --rw-r--r-- 0 sbuild (999) sbuild (999) 21 2026-10-22 19:05:45.000000 jtreg-test-output/langtools/0/JTreport/text/tc_newfailures.txt │ │ │ │ │ --rw-r--r-- 0 sbuild (999) sbuild (999) 21 2026-10-22 19:05:45.000000 jtreg-test-output/langtools/0/JTreport/text/tc_fail2notrun.txt │ │ │ │ │ --rw-r--r-- 0 sbuild (999) sbuild (999) 20 2026-10-22 19:05:45.000000 jtreg-test-output/langtools/0/JTreport/text/tc_fail2error.txt │ │ │ │ │ --rw-r--r-- 0 sbuild (999) sbuild (999) 19 2026-10-22 19:05:45.000000 jtreg-test-output/langtools/0/JTreport/text/tc_fail2pass.txt │ │ │ │ │ --rw-r--r-- 0 sbuild (999) sbuild (999) 22 2026-10-22 19:05:45.000000 jtreg-test-output/langtools/0/JTreport/text/tc_fail2missing.txt │ │ │ │ │ --rw-r--r-- 0 sbuild (999) sbuild (999) 19 2026-10-22 19:05:45.000000 jtreg-test-output/langtools/0/JTreport/text/other_errors.txt │ │ │ │ │ --rw-r--r-- 0 sbuild (999) sbuild (999) 18 2026-10-22 19:05:45.000000 jtreg-test-output/langtools/0/JTreport/text/newfailures.txt │ │ │ │ │ --rw-r--r-- 0 sbuild (999) sbuild (999) 16 2026-10-22 19:05:45.000000 jtreg-test-output/langtools/0/JTreport/text/fail2fail.txt │ │ │ │ │ --rw-r--r-- 0 sbuild (999) sbuild (999) 18 2026-10-22 19:05:45.000000 jtreg-test-output/langtools/0/JTreport/text/fail2notrun.txt │ │ │ │ │ --rw-r--r-- 0 sbuild (999) sbuild (999) 17 2026-10-22 19:05:45.000000 jtreg-test-output/langtools/0/JTreport/text/faiL2error.txt │ │ │ │ │ --rw-r--r-- 0 sbuild (999) sbuild (999) 16 2026-10-22 19:05:45.000000 jtreg-test-output/langtools/0/JTreport/text/fail2pass.txt │ │ │ │ │ --rw-r--r-- 0 sbuild (999) sbuild (999) 19 2026-10-22 19:05:45.000000 jtreg-test-output/langtools/0/JTreport/text/fail2missing.txt │ │ │ │ │ --rw-r--r-- 0 sbuild (999) sbuild (999) 643764 2026-10-22 19:05:45.000000 jtreg-test-output/langtools/0/JTreport/text/summary.txt │ │ │ │ │ --rw-r--r-- 0 sbuild (999) sbuild (999) 454 2026-10-22 18:18:27.000000 jtreg-test-output/langtools/0/JTreport/text/cmdArgs.txt │ │ │ │ │ -lrwxrwxrwx 0 sbuild (999) sbuild (999) 0 2026-10-22 18:18:26.000000 jtreg-test-output/hotspot/JTreport -> 0/JTreport │ │ │ │ │ -drwxr-xr-x 0 sbuild (999) sbuild (999) 0 2026-10-22 18:18:14.000000 jtreg-test-output/hotspot/0/JTreport/ │ │ │ │ │ --rw-r--r-- 0 sbuild (999) sbuild (999) 722 2026-10-22 18:18:14.000000 jtreg-test-output/hotspot/0/JTreport/index.html │ │ │ │ │ --rw-r--r-- 0 sbuild (999) sbuild (999) 0 2026-10-22 18:18:14.000000 jtreg-test-output/hotspot/0/JTreport/reportdir.dat │ │ │ │ │ -drwxr-xr-x 0 sbuild (999) sbuild (999) 0 2026-10-22 18:18:14.000000 jtreg-test-output/hotspot/0/JTreport/html/ │ │ │ │ │ --rw-r--r-- 0 sbuild (999) sbuild (999) 35827 2026-10-22 18:18:14.000000 jtreg-test-output/hotspot/0/JTreport/html/notRun_gr.html │ │ │ │ │ --rw-r--r-- 0 sbuild (999) sbuild (999) 35538 2026-10-22 18:18:14.000000 jtreg-test-output/hotspot/0/JTreport/html/notRun.html │ │ │ │ │ --rw-r--r-- 0 sbuild (999) sbuild (999) 521 2026-10-22 18:18:14.000000 jtreg-test-output/hotspot/0/JTreport/html/error_gr.html │ │ │ │ │ --rw-r--r-- 0 sbuild (999) sbuild (999) 473 2026-10-22 18:18:14.000000 jtreg-test-output/hotspot/0/JTreport/html/error.html │ │ │ │ │ --rw-r--r-- 0 sbuild (999) sbuild (999) 513 2026-10-22 18:18:14.000000 jtreg-test-output/hotspot/0/JTreport/html/failed_gr.html │ │ │ │ │ --rw-r--r-- 0 sbuild (999) sbuild (999) 465 2026-10-22 18:18:14.000000 jtreg-test-output/hotspot/0/JTreport/html/failed.html │ │ │ │ │ --rw-r--r-- 0 sbuild (999) sbuild (999) 636031 2026-10-22 18:18:14.000000 jtreg-test-output/hotspot/0/JTreport/html/passed_gr.html │ │ │ │ │ --rw-r--r-- 0 sbuild (999) sbuild (999) 635602 2026-10-22 18:18:14.000000 jtreg-test-output/hotspot/0/JTreport/html/passed.html │ │ │ │ │ --rw-r--r-- 0 sbuild (999) sbuild (999) 18324 2026-10-22 18:18:14.000000 jtreg-test-output/hotspot/0/JTreport/html/excluded.html │ │ │ │ │ --rw-r--r-- 0 sbuild (999) sbuild (999) 4217 2026-10-22 18:18:14.000000 jtreg-test-output/hotspot/0/JTreport/html/env.html │ │ │ │ │ --rw-r--r-- 0 sbuild (999) sbuild (999) 78257 2026-10-22 18:18:14.000000 jtreg-test-output/hotspot/0/JTreport/html/config.html │ │ │ │ │ --rw-r--r-- 0 sbuild (999) sbuild (999) 307 2026-10-22 18:18:14.000000 jtreg-test-output/hotspot/0/JTreport/html/report.css │ │ │ │ │ --rw-r--r-- 0 sbuild (999) sbuild (999) 526907 2026-10-22 18:18:14.000000 jtreg-test-output/hotspot/0/JTreport/html/index.html │ │ │ │ │ --rw-r--r-- 0 sbuild (999) sbuild (999) 526907 2026-10-22 18:18:14.000000 jtreg-test-output/hotspot/0/JTreport/html/report.html │ │ │ │ │ -drwxr-xr-x 0 sbuild (999) sbuild (999) 0 2026-10-22 18:18:14.000000 jtreg-test-output/hotspot/0/JTreport/text/ │ │ │ │ │ --rw-r--r-- 0 sbuild (999) sbuild (999) 9713 2026-10-22 18:18:14.000000 jtreg-test-output/hotspot/0/JTreport/text/junit.txt │ │ │ │ │ --rw-r--r-- 0 sbuild (999) sbuild (999) 9190 2026-10-22 18:18:14.000000 jtreg-test-output/hotspot/0/JTreport/text/testng.txt │ │ │ │ │ --rw-r--r-- 0 sbuild (999) sbuild (999) 47247 2026-10-22 18:18:14.000000 jtreg-test-output/hotspot/0/JTreport/text/notRun.txt │ │ │ │ │ --rw-r--r-- 0 sbuild (999) sbuild (999) 123 2026-10-22 18:18:14.000000 jtreg-test-output/hotspot/0/JTreport/text/stats.txt │ │ │ │ │ --rw-r--r-- 0 sbuild (999) sbuild (999) 959 2026-10-22 18:18:14.000000 jtreg-test-output/hotspot/0/JTreport/text/timeStats.txt │ │ │ │ │ --rw-r--r-- 0 sbuild (999) sbuild (999) 21 2026-10-22 18:18:14.000000 jtreg-test-output/hotspot/0/JTreport/text/tc_newfailures.txt │ │ │ │ │ --rw-r--r-- 0 sbuild (999) sbuild (999) 21 2026-10-22 18:18:14.000000 jtreg-test-output/hotspot/0/JTreport/text/tc_fail2notrun.txt │ │ │ │ │ --rw-r--r-- 0 sbuild (999) sbuild (999) 20 2026-10-22 18:18:14.000000 jtreg-test-output/hotspot/0/JTreport/text/tc_fail2error.txt │ │ │ │ │ --rw-r--r-- 0 sbuild (999) sbuild (999) 19 2026-10-22 18:18:14.000000 jtreg-test-output/hotspot/0/JTreport/text/tc_fail2pass.txt │ │ │ │ │ --rw-r--r-- 0 sbuild (999) sbuild (999) 22 2026-10-22 18:18:14.000000 jtreg-test-output/hotspot/0/JTreport/text/tc_fail2missing.txt │ │ │ │ │ --rw-r--r-- 0 sbuild (999) sbuild (999) 19 2026-10-22 18:18:14.000000 jtreg-test-output/hotspot/0/JTreport/text/other_errors.txt │ │ │ │ │ --rw-r--r-- 0 sbuild (999) sbuild (999) 18 2026-10-22 18:18:14.000000 jtreg-test-output/hotspot/0/JTreport/text/newfailures.txt │ │ │ │ │ --rw-r--r-- 0 sbuild (999) sbuild (999) 16 2026-10-22 18:18:14.000000 jtreg-test-output/hotspot/0/JTreport/text/fail2fail.txt │ │ │ │ │ --rw-r--r-- 0 sbuild (999) sbuild (999) 18 2026-10-22 18:18:14.000000 jtreg-test-output/hotspot/0/JTreport/text/fail2notrun.txt │ │ │ │ │ --rw-r--r-- 0 sbuild (999) sbuild (999) 17 2026-10-22 18:18:14.000000 jtreg-test-output/hotspot/0/JTreport/text/faiL2error.txt │ │ │ │ │ --rw-r--r-- 0 sbuild (999) sbuild (999) 16 2026-10-22 18:18:14.000000 jtreg-test-output/hotspot/0/JTreport/text/fail2pass.txt │ │ │ │ │ --rw-r--r-- 0 sbuild (999) sbuild (999) 19 2026-10-22 18:18:14.000000 jtreg-test-output/hotspot/0/JTreport/text/fail2missing.txt │ │ │ │ │ --rw-r--r-- 0 sbuild (999) sbuild (999) 479051 2026-10-22 18:18:14.000000 jtreg-test-output/hotspot/0/JTreport/text/summary.txt │ │ │ │ │ --rw-r--r-- 0 sbuild (999) sbuild (999) 551 2026-10-22 14:54:25.000000 jtreg-test-output/hotspot/0/JTreport/text/cmdArgs.txt │ │ │ │ │ +drwxr-xr-x 0 sbuild (999) sbuild (999) 0 2026-10-26 06:46:35.000000 jtreg-test-output/jdk/2/JTreport/ │ │ │ │ │ +-rw-r--r-- 0 sbuild (999) sbuild (999) 708 2026-10-26 06:46:35.000000 jtreg-test-output/jdk/2/JTreport/index.html │ │ │ │ │ +drwxr-xr-x 0 sbuild (999) sbuild (999) 0 2026-10-26 06:46:34.000000 jtreg-test-output/jdk/2/JTreport/html/ │ │ │ │ │ +-rw-r--r-- 0 sbuild (999) sbuild (999) 1250431 2026-10-26 06:46:34.000000 jtreg-test-output/jdk/2/JTreport/html/passed.html │ │ │ │ │ +-rw-r--r-- 0 sbuild (999) sbuild (999) 24356 2026-10-26 06:46:34.000000 jtreg-test-output/jdk/2/JTreport/html/config.html │ │ │ │ │ +-rw-r--r-- 0 sbuild (999) sbuild (999) 2020 2026-10-26 06:46:34.000000 jtreg-test-output/jdk/2/JTreport/html/failed.html │ │ │ │ │ +-rw-r--r-- 0 sbuild (999) sbuild (999) 1101104 2026-10-26 06:46:34.000000 jtreg-test-output/jdk/2/JTreport/html/index.html │ │ │ │ │ +-rw-r--r-- 0 sbuild (999) sbuild (999) 4214 2026-10-26 06:46:34.000000 jtreg-test-output/jdk/2/JTreport/html/env.html │ │ │ │ │ +-rw-r--r-- 0 sbuild (999) sbuild (999) 473 2026-10-26 06:46:34.000000 jtreg-test-output/jdk/2/JTreport/html/error.html │ │ │ │ │ +-rw-r--r-- 0 sbuild (999) sbuild (999) 307 2026-10-26 06:46:34.000000 jtreg-test-output/jdk/2/JTreport/html/report.css │ │ │ │ │ +-rw-r--r-- 0 sbuild (999) sbuild (999) 2750 2026-10-26 06:46:34.000000 jtreg-test-output/jdk/2/JTreport/html/failed_gr.html │ │ │ │ │ +-rw-r--r-- 0 sbuild (999) sbuild (999) 521 2026-10-26 06:46:34.000000 jtreg-test-output/jdk/2/JTreport/html/error_gr.html │ │ │ │ │ +-rw-r--r-- 0 sbuild (999) sbuild (999) 762507 2026-10-26 06:46:34.000000 jtreg-test-output/jdk/2/JTreport/html/notRun.html │ │ │ │ │ +-rw-r--r-- 0 sbuild (999) sbuild (999) 1251614 2026-10-26 06:46:34.000000 jtreg-test-output/jdk/2/JTreport/html/passed_gr.html │ │ │ │ │ +-rw-r--r-- 0 sbuild (999) sbuild (999) 1101104 2026-10-26 06:46:34.000000 jtreg-test-output/jdk/2/JTreport/html/report.html │ │ │ │ │ +-rw-r--r-- 0 sbuild (999) sbuild (999) 83174 2026-10-26 06:46:34.000000 jtreg-test-output/jdk/2/JTreport/html/excluded.html │ │ │ │ │ +-rw-r--r-- 0 sbuild (999) sbuild (999) 762780 2026-10-26 06:46:34.000000 jtreg-test-output/jdk/2/JTreport/html/notRun_gr.html │ │ │ │ │ +-rw-r--r-- 0 sbuild (999) sbuild (999) 0 2026-10-26 06:46:35.000000 jtreg-test-output/jdk/2/JTreport/reportdir.dat │ │ │ │ │ +drwxr-xr-x 0 sbuild (999) sbuild (999) 0 2026-10-26 06:46:35.000000 jtreg-test-output/jdk/2/JTreport/text/ │ │ │ │ │ +-rw-r--r-- 0 sbuild (999) sbuild (999) 116 2026-10-26 06:46:35.000000 jtreg-test-output/jdk/2/JTreport/text/timeStats.txt │ │ │ │ │ +-rw-r--r-- 0 sbuild (999) sbuild (999) 16 2026-10-26 06:46:35.000000 jtreg-test-output/jdk/2/JTreport/text/fail2pass.txt │ │ │ │ │ +-rw-r--r-- 0 sbuild (999) sbuild (999) 19 2026-10-26 06:46:35.000000 jtreg-test-output/jdk/2/JTreport/text/tc_fail2pass.txt │ │ │ │ │ +-rw-r--r-- 0 sbuild (999) sbuild (999) 19 2026-10-26 06:46:35.000000 jtreg-test-output/jdk/2/JTreport/text/fail2missing.txt │ │ │ │ │ +-rw-r--r-- 0 sbuild (999) sbuild (999) 1023561 2026-10-26 06:46:35.000000 jtreg-test-output/jdk/2/JTreport/text/notRun.txt │ │ │ │ │ +-rw-r--r-- 0 sbuild (999) sbuild (999) 17 2026-10-26 06:46:35.000000 jtreg-test-output/jdk/2/JTreport/text/faiL2error.txt │ │ │ │ │ +-rw-r--r-- 0 sbuild (999) sbuild (999) 20 2026-10-26 06:46:35.000000 jtreg-test-output/jdk/2/JTreport/text/tc_fail2error.txt │ │ │ │ │ +-rw-r--r-- 0 sbuild (999) sbuild (999) 101 2026-10-26 06:46:35.000000 jtreg-test-output/jdk/2/JTreport/text/stats.txt │ │ │ │ │ +-rw-r--r-- 0 sbuild (999) sbuild (999) 16 2026-10-26 06:46:35.000000 jtreg-test-output/jdk/2/JTreport/text/fail2fail.txt │ │ │ │ │ +-rw-r--r-- 0 sbuild (999) sbuild (999) 22 2026-10-26 06:46:35.000000 jtreg-test-output/jdk/2/JTreport/text/tc_fail2missing.txt │ │ │ │ │ +-rw-r--r-- 0 sbuild (999) sbuild (999) 548 2026-10-26 06:46:22.000000 jtreg-test-output/jdk/2/JTreport/text/cmdArgs.txt │ │ │ │ │ +-rw-r--r-- 0 sbuild (999) sbuild (999) 21 2026-10-26 06:46:35.000000 jtreg-test-output/jdk/2/JTreport/text/tc_fail2notrun.txt │ │ │ │ │ +-rw-r--r-- 0 sbuild (999) sbuild (999) 416 2026-10-26 06:46:35.000000 jtreg-test-output/jdk/2/JTreport/text/newfailures.txt │ │ │ │ │ +-rw-r--r-- 0 sbuild (999) sbuild (999) 890216 2026-10-26 06:46:35.000000 jtreg-test-output/jdk/2/JTreport/text/summary.txt │ │ │ │ │ +-rw-r--r-- 0 sbuild (999) sbuild (999) 18 2026-10-26 06:46:35.000000 jtreg-test-output/jdk/2/JTreport/text/fail2notrun.txt │ │ │ │ │ +-rw-r--r-- 0 sbuild (999) sbuild (999) 21 2026-10-26 06:46:35.000000 jtreg-test-output/jdk/2/JTreport/text/tc_newfailures.txt │ │ │ │ │ +-rw-r--r-- 0 sbuild (999) sbuild (999) 132 2026-10-26 06:46:35.000000 jtreg-test-output/jdk/2/JTreport/text/testng.txt │ │ │ │ │ +-rw-r--r-- 0 sbuild (999) sbuild (999) 19 2026-10-26 06:46:35.000000 jtreg-test-output/jdk/2/JTreport/text/other_errors.txt │ │ │ │ │ +drwxr-xr-x 0 sbuild (999) sbuild (999) 0 2026-10-26 06:46:10.000000 jtreg-test-output/jdk/1/JTreport/ │ │ │ │ │ +-rw-r--r-- 0 sbuild (999) sbuild (999) 708 2026-10-26 06:46:10.000000 jtreg-test-output/jdk/1/JTreport/index.html │ │ │ │ │ +drwxr-xr-x 0 sbuild (999) sbuild (999) 0 2026-10-26 06:46:10.000000 jtreg-test-output/jdk/1/JTreport/html/ │ │ │ │ │ +-rw-r--r-- 0 sbuild (999) sbuild (999) 1250431 2026-10-26 06:46:10.000000 jtreg-test-output/jdk/1/JTreport/html/passed.html │ │ │ │ │ +-rw-r--r-- 0 sbuild (999) sbuild (999) 24356 2026-10-26 06:46:10.000000 jtreg-test-output/jdk/1/JTreport/html/config.html │ │ │ │ │ +-rw-r--r-- 0 sbuild (999) sbuild (999) 2020 2026-10-26 06:46:10.000000 jtreg-test-output/jdk/1/JTreport/html/failed.html │ │ │ │ │ +-rw-r--r-- 0 sbuild (999) sbuild (999) 1101104 2026-10-26 06:46:10.000000 jtreg-test-output/jdk/1/JTreport/html/index.html │ │ │ │ │ +-rw-r--r-- 0 sbuild (999) sbuild (999) 4214 2026-10-26 06:46:10.000000 jtreg-test-output/jdk/1/JTreport/html/env.html │ │ │ │ │ +-rw-r--r-- 0 sbuild (999) sbuild (999) 473 2026-10-26 06:46:10.000000 jtreg-test-output/jdk/1/JTreport/html/error.html │ │ │ │ │ +-rw-r--r-- 0 sbuild (999) sbuild (999) 307 2026-10-26 06:46:09.000000 jtreg-test-output/jdk/1/JTreport/html/report.css │ │ │ │ │ +-rw-r--r-- 0 sbuild (999) sbuild (999) 2750 2026-10-26 06:46:10.000000 jtreg-test-output/jdk/1/JTreport/html/failed_gr.html │ │ │ │ │ +-rw-r--r-- 0 sbuild (999) sbuild (999) 521 2026-10-26 06:46:10.000000 jtreg-test-output/jdk/1/JTreport/html/error_gr.html │ │ │ │ │ +-rw-r--r-- 0 sbuild (999) sbuild (999) 762507 2026-10-26 06:46:10.000000 jtreg-test-output/jdk/1/JTreport/html/notRun.html │ │ │ │ │ +-rw-r--r-- 0 sbuild (999) sbuild (999) 1251614 2026-10-26 06:46:10.000000 jtreg-test-output/jdk/1/JTreport/html/passed_gr.html │ │ │ │ │ +-rw-r--r-- 0 sbuild (999) sbuild (999) 1101104 2026-10-26 06:46:10.000000 jtreg-test-output/jdk/1/JTreport/html/report.html │ │ │ │ │ +-rw-r--r-- 0 sbuild (999) sbuild (999) 83174 2026-10-26 06:46:10.000000 jtreg-test-output/jdk/1/JTreport/html/excluded.html │ │ │ │ │ +-rw-r--r-- 0 sbuild (999) sbuild (999) 762780 2026-10-26 06:46:10.000000 jtreg-test-output/jdk/1/JTreport/html/notRun_gr.html │ │ │ │ │ +-rw-r--r-- 0 sbuild (999) sbuild (999) 0 2026-10-26 06:46:10.000000 jtreg-test-output/jdk/1/JTreport/reportdir.dat │ │ │ │ │ +drwxr-xr-x 0 sbuild (999) sbuild (999) 0 2026-10-26 06:46:10.000000 jtreg-test-output/jdk/1/JTreport/text/ │ │ │ │ │ +-rw-r--r-- 0 sbuild (999) sbuild (999) 116 2026-10-26 06:46:10.000000 jtreg-test-output/jdk/1/JTreport/text/timeStats.txt │ │ │ │ │ +-rw-r--r-- 0 sbuild (999) sbuild (999) 16 2026-10-26 06:46:10.000000 jtreg-test-output/jdk/1/JTreport/text/fail2pass.txt │ │ │ │ │ +-rw-r--r-- 0 sbuild (999) sbuild (999) 19 2026-10-26 06:46:10.000000 jtreg-test-output/jdk/1/JTreport/text/tc_fail2pass.txt │ │ │ │ │ +-rw-r--r-- 0 sbuild (999) sbuild (999) 19 2026-10-26 06:46:10.000000 jtreg-test-output/jdk/1/JTreport/text/fail2missing.txt │ │ │ │ │ +-rw-r--r-- 0 sbuild (999) sbuild (999) 1023561 2026-10-26 06:46:10.000000 jtreg-test-output/jdk/1/JTreport/text/notRun.txt │ │ │ │ │ +-rw-r--r-- 0 sbuild (999) sbuild (999) 17 2026-10-26 06:46:10.000000 jtreg-test-output/jdk/1/JTreport/text/faiL2error.txt │ │ │ │ │ +-rw-r--r-- 0 sbuild (999) sbuild (999) 20 2026-10-26 06:46:10.000000 jtreg-test-output/jdk/1/JTreport/text/tc_fail2error.txt │ │ │ │ │ +-rw-r--r-- 0 sbuild (999) sbuild (999) 101 2026-10-26 06:46:10.000000 jtreg-test-output/jdk/1/JTreport/text/stats.txt │ │ │ │ │ +-rw-r--r-- 0 sbuild (999) sbuild (999) 16 2026-10-26 06:46:10.000000 jtreg-test-output/jdk/1/JTreport/text/fail2fail.txt │ │ │ │ │ +-rw-r--r-- 0 sbuild (999) sbuild (999) 22 2026-10-26 06:46:10.000000 jtreg-test-output/jdk/1/JTreport/text/tc_fail2missing.txt │ │ │ │ │ +-rw-r--r-- 0 sbuild (999) sbuild (999) 548 2026-10-26 06:45:42.000000 jtreg-test-output/jdk/1/JTreport/text/cmdArgs.txt │ │ │ │ │ +-rw-r--r-- 0 sbuild (999) sbuild (999) 21 2026-10-26 06:46:10.000000 jtreg-test-output/jdk/1/JTreport/text/tc_fail2notrun.txt │ │ │ │ │ +-rw-r--r-- 0 sbuild (999) sbuild (999) 416 2026-10-26 06:46:10.000000 jtreg-test-output/jdk/1/JTreport/text/newfailures.txt │ │ │ │ │ +-rw-r--r-- 0 sbuild (999) sbuild (999) 890216 2026-10-26 06:46:10.000000 jtreg-test-output/jdk/1/JTreport/text/summary.txt │ │ │ │ │ +-rw-r--r-- 0 sbuild (999) sbuild (999) 18 2026-10-26 06:46:10.000000 jtreg-test-output/jdk/1/JTreport/text/fail2notrun.txt │ │ │ │ │ +-rw-r--r-- 0 sbuild (999) sbuild (999) 21 2026-10-26 06:46:10.000000 jtreg-test-output/jdk/1/JTreport/text/tc_newfailures.txt │ │ │ │ │ +-rw-r--r-- 0 sbuild (999) sbuild (999) 132 2026-10-26 06:46:10.000000 jtreg-test-output/jdk/1/JTreport/text/testng.txt │ │ │ │ │ +-rw-r--r-- 0 sbuild (999) sbuild (999) 19 2026-10-26 06:46:10.000000 jtreg-test-output/jdk/1/JTreport/text/other_errors.txt │ │ │ │ │ +drwxr-xr-x 0 sbuild (999) sbuild (999) 0 2026-10-26 06:43:51.000000 jtreg-test-output/jdk/0/JTreport/ │ │ │ │ │ +-rw-r--r-- 0 sbuild (999) sbuild (999) 708 2026-10-26 06:43:51.000000 jtreg-test-output/jdk/0/JTreport/index.html │ │ │ │ │ +drwxr-xr-x 0 sbuild (999) sbuild (999) 0 2026-10-26 06:43:51.000000 jtreg-test-output/jdk/0/JTreport/html/ │ │ │ │ │ +-rw-r--r-- 0 sbuild (999) sbuild (999) 1250431 2026-10-26 06:43:51.000000 jtreg-test-output/jdk/0/JTreport/html/passed.html │ │ │ │ │ +-rw-r--r-- 0 sbuild (999) sbuild (999) 23924 2026-10-26 06:43:51.000000 jtreg-test-output/jdk/0/JTreport/html/config.html │ │ │ │ │ +-rw-r--r-- 0 sbuild (999) sbuild (999) 2020 2026-10-26 06:43:51.000000 jtreg-test-output/jdk/0/JTreport/html/failed.html │ │ │ │ │ +-rw-r--r-- 0 sbuild (999) sbuild (999) 1123762 2026-10-26 06:43:51.000000 jtreg-test-output/jdk/0/JTreport/html/index.html │ │ │ │ │ +-rw-r--r-- 0 sbuild (999) sbuild (999) 4195 2026-10-26 06:43:51.000000 jtreg-test-output/jdk/0/JTreport/html/env.html │ │ │ │ │ +-rw-r--r-- 0 sbuild (999) sbuild (999) 473 2026-10-26 06:43:51.000000 jtreg-test-output/jdk/0/JTreport/html/error.html │ │ │ │ │ +-rw-r--r-- 0 sbuild (999) sbuild (999) 307 2026-10-26 06:43:51.000000 jtreg-test-output/jdk/0/JTreport/html/report.css │ │ │ │ │ +-rw-r--r-- 0 sbuild (999) sbuild (999) 2750 2026-10-26 06:43:51.000000 jtreg-test-output/jdk/0/JTreport/html/failed_gr.html │ │ │ │ │ +-rw-r--r-- 0 sbuild (999) sbuild (999) 521 2026-10-26 06:43:51.000000 jtreg-test-output/jdk/0/JTreport/html/error_gr.html │ │ │ │ │ +-rw-r--r-- 0 sbuild (999) sbuild (999) 20339 2026-10-26 06:43:51.000000 jtreg-test-output/jdk/0/JTreport/html/notRun.html │ │ │ │ │ +-rw-r--r-- 0 sbuild (999) sbuild (999) 1251614 2026-10-26 06:43:51.000000 jtreg-test-output/jdk/0/JTreport/html/passed_gr.html │ │ │ │ │ +-rw-r--r-- 0 sbuild (999) sbuild (999) 1123762 2026-10-26 06:43:51.000000 jtreg-test-output/jdk/0/JTreport/html/report.html │ │ │ │ │ +-rw-r--r-- 0 sbuild (999) sbuild (999) 83174 2026-10-26 06:43:51.000000 jtreg-test-output/jdk/0/JTreport/html/excluded.html │ │ │ │ │ +-rw-r--r-- 0 sbuild (999) sbuild (999) 20684 2026-10-26 06:43:51.000000 jtreg-test-output/jdk/0/JTreport/html/notRun_gr.html │ │ │ │ │ +-rw-r--r-- 0 sbuild (999) sbuild (999) 0 2026-10-26 06:43:51.000000 jtreg-test-output/jdk/0/JTreport/reportdir.dat │ │ │ │ │ +drwxr-xr-x 0 sbuild (999) sbuild (999) 0 2026-10-26 06:43:51.000000 jtreg-test-output/jdk/0/JTreport/text/ │ │ │ │ │ +-rw-r--r-- 0 sbuild (999) sbuild (999) 923 2026-10-26 06:43:51.000000 jtreg-test-output/jdk/0/JTreport/text/timeStats.txt │ │ │ │ │ +-rw-r--r-- 0 sbuild (999) sbuild (999) 16 2026-10-26 06:43:51.000000 jtreg-test-output/jdk/0/JTreport/text/fail2pass.txt │ │ │ │ │ +-rw-r--r-- 0 sbuild (999) sbuild (999) 19 2026-10-26 06:43:51.000000 jtreg-test-output/jdk/0/JTreport/text/tc_fail2pass.txt │ │ │ │ │ +-rw-r--r-- 0 sbuild (999) sbuild (999) 19 2026-10-26 06:43:51.000000 jtreg-test-output/jdk/0/JTreport/text/fail2missing.txt │ │ │ │ │ +-rw-r--r-- 0 sbuild (999) sbuild (999) 26283 2026-10-26 06:43:51.000000 jtreg-test-output/jdk/0/JTreport/text/notRun.txt │ │ │ │ │ +-rw-r--r-- 0 sbuild (999) sbuild (999) 17 2026-10-26 06:43:51.000000 jtreg-test-output/jdk/0/JTreport/text/faiL2error.txt │ │ │ │ │ +-rw-r--r-- 0 sbuild (999) sbuild (999) 20 2026-10-26 06:43:51.000000 jtreg-test-output/jdk/0/JTreport/text/tc_fail2error.txt │ │ │ │ │ +-rw-r--r-- 0 sbuild (999) sbuild (999) 172 2026-10-26 06:43:51.000000 jtreg-test-output/jdk/0/JTreport/text/stats.txt │ │ │ │ │ +-rw-r--r-- 0 sbuild (999) sbuild (999) 16 2026-10-26 06:43:51.000000 jtreg-test-output/jdk/0/JTreport/text/fail2fail.txt │ │ │ │ │ +-rw-r--r-- 0 sbuild (999) sbuild (999) 22 2026-10-26 06:43:51.000000 jtreg-test-output/jdk/0/JTreport/text/tc_fail2missing.txt │ │ │ │ │ +-rw-r--r-- 0 sbuild (999) sbuild (999) 529 2026-10-26 02:54:14.000000 jtreg-test-output/jdk/0/JTreport/text/cmdArgs.txt │ │ │ │ │ +-rw-r--r-- 0 sbuild (999) sbuild (999) 21 2026-10-26 06:43:51.000000 jtreg-test-output/jdk/0/JTreport/text/tc_fail2notrun.txt │ │ │ │ │ +-rw-r--r-- 0 sbuild (999) sbuild (999) 416 2026-10-26 06:43:51.000000 jtreg-test-output/jdk/0/JTreport/text/newfailures.txt │ │ │ │ │ +-rw-r--r-- 0 sbuild (999) sbuild (999) 890216 2026-10-26 06:43:51.000000 jtreg-test-output/jdk/0/JTreport/text/summary.txt │ │ │ │ │ +-rw-r--r-- 0 sbuild (999) sbuild (999) 18 2026-10-26 06:43:51.000000 jtreg-test-output/jdk/0/JTreport/text/fail2notrun.txt │ │ │ │ │ +-rw-r--r-- 0 sbuild (999) sbuild (999) 21 2026-10-26 06:43:51.000000 jtreg-test-output/jdk/0/JTreport/text/tc_newfailures.txt │ │ │ │ │ +-rw-r--r-- 0 sbuild (999) sbuild (999) 131917 2026-10-26 06:43:51.000000 jtreg-test-output/jdk/0/JTreport/text/testng.txt │ │ │ │ │ +-rw-r--r-- 0 sbuild (999) sbuild (999) 86012 2026-10-26 06:43:51.000000 jtreg-test-output/jdk/0/JTreport/text/junit.txt │ │ │ │ │ +-rw-r--r-- 0 sbuild (999) sbuild (999) 19 2026-10-26 06:43:51.000000 jtreg-test-output/jdk/0/JTreport/text/other_errors.txt │ │ │ │ │ +lrwxrwxrwx 0 sbuild (999) sbuild (999) 0 2026-10-26 06:46:45.000000 jtreg-test-output/jdk/JTreport -> 2/JTreport │ │ │ │ │ +drwxr-xr-x 0 sbuild (999) sbuild (999) 0 2026-10-26 01:59:10.000000 jtreg-test-output/hotspot/0/JTreport/ │ │ │ │ │ +-rw-r--r-- 0 sbuild (999) sbuild (999) 722 2026-10-26 01:59:10.000000 jtreg-test-output/hotspot/0/JTreport/index.html │ │ │ │ │ +drwxr-xr-x 0 sbuild (999) sbuild (999) 0 2026-10-26 01:59:10.000000 jtreg-test-output/hotspot/0/JTreport/html/ │ │ │ │ │ +-rw-r--r-- 0 sbuild (999) sbuild (999) 638983 2026-10-26 01:59:10.000000 jtreg-test-output/hotspot/0/JTreport/html/passed.html │ │ │ │ │ +-rw-r--r-- 0 sbuild (999) sbuild (999) 78257 2026-10-26 01:59:10.000000 jtreg-test-output/hotspot/0/JTreport/html/config.html │ │ │ │ │ +-rw-r--r-- 0 sbuild (999) sbuild (999) 465 2026-10-26 01:59:10.000000 jtreg-test-output/hotspot/0/JTreport/html/failed.html │ │ │ │ │ +-rw-r--r-- 0 sbuild (999) sbuild (999) 526917 2026-10-26 01:59:10.000000 jtreg-test-output/hotspot/0/JTreport/html/index.html │ │ │ │ │ +-rw-r--r-- 0 sbuild (999) sbuild (999) 4217 2026-10-26 01:59:10.000000 jtreg-test-output/hotspot/0/JTreport/html/env.html │ │ │ │ │ +-rw-r--r-- 0 sbuild (999) sbuild (999) 473 2026-10-26 01:59:10.000000 jtreg-test-output/hotspot/0/JTreport/html/error.html │ │ │ │ │ +-rw-r--r-- 0 sbuild (999) sbuild (999) 307 2026-10-26 01:59:10.000000 jtreg-test-output/hotspot/0/JTreport/html/report.css │ │ │ │ │ +-rw-r--r-- 0 sbuild (999) sbuild (999) 513 2026-10-26 01:59:10.000000 jtreg-test-output/hotspot/0/JTreport/html/failed_gr.html │ │ │ │ │ +-rw-r--r-- 0 sbuild (999) sbuild (999) 521 2026-10-26 01:59:10.000000 jtreg-test-output/hotspot/0/JTreport/html/error_gr.html │ │ │ │ │ +-rw-r--r-- 0 sbuild (999) sbuild (999) 33594 2026-10-26 01:59:10.000000 jtreg-test-output/hotspot/0/JTreport/html/notRun.html │ │ │ │ │ +-rw-r--r-- 0 sbuild (999) sbuild (999) 639412 2026-10-26 01:59:10.000000 jtreg-test-output/hotspot/0/JTreport/html/passed_gr.html │ │ │ │ │ +-rw-r--r-- 0 sbuild (999) sbuild (999) 526917 2026-10-26 01:59:10.000000 jtreg-test-output/hotspot/0/JTreport/html/report.html │ │ │ │ │ +-rw-r--r-- 0 sbuild (999) sbuild (999) 18324 2026-10-26 01:59:10.000000 jtreg-test-output/hotspot/0/JTreport/html/excluded.html │ │ │ │ │ +-rw-r--r-- 0 sbuild (999) sbuild (999) 33883 2026-10-26 01:59:10.000000 jtreg-test-output/hotspot/0/JTreport/html/notRun_gr.html │ │ │ │ │ +-rw-r--r-- 0 sbuild (999) sbuild (999) 0 2026-10-26 01:59:10.000000 jtreg-test-output/hotspot/0/JTreport/reportdir.dat │ │ │ │ │ +drwxr-xr-x 0 sbuild (999) sbuild (999) 0 2026-10-26 01:59:10.000000 jtreg-test-output/hotspot/0/JTreport/text/ │ │ │ │ │ +-rw-r--r-- 0 sbuild (999) sbuild (999) 803 2026-10-26 01:59:10.000000 jtreg-test-output/hotspot/0/JTreport/text/timeStats.txt │ │ │ │ │ +-rw-r--r-- 0 sbuild (999) sbuild (999) 16 2026-10-26 01:59:10.000000 jtreg-test-output/hotspot/0/JTreport/text/fail2pass.txt │ │ │ │ │ +-rw-r--r-- 0 sbuild (999) sbuild (999) 19 2026-10-26 01:59:10.000000 jtreg-test-output/hotspot/0/JTreport/text/tc_fail2pass.txt │ │ │ │ │ +-rw-r--r-- 0 sbuild (999) sbuild (999) 19 2026-10-26 01:59:10.000000 jtreg-test-output/hotspot/0/JTreport/text/fail2missing.txt │ │ │ │ │ +-rw-r--r-- 0 sbuild (999) sbuild (999) 44907 2026-10-26 01:59:10.000000 jtreg-test-output/hotspot/0/JTreport/text/notRun.txt │ │ │ │ │ +-rw-r--r-- 0 sbuild (999) sbuild (999) 17 2026-10-26 01:59:10.000000 jtreg-test-output/hotspot/0/JTreport/text/faiL2error.txt │ │ │ │ │ +-rw-r--r-- 0 sbuild (999) sbuild (999) 20 2026-10-26 01:59:10.000000 jtreg-test-output/hotspot/0/JTreport/text/tc_fail2error.txt │ │ │ │ │ +-rw-r--r-- 0 sbuild (999) sbuild (999) 123 2026-10-26 01:59:10.000000 jtreg-test-output/hotspot/0/JTreport/text/stats.txt │ │ │ │ │ +-rw-r--r-- 0 sbuild (999) sbuild (999) 16 2026-10-26 01:59:10.000000 jtreg-test-output/hotspot/0/JTreport/text/fail2fail.txt │ │ │ │ │ +-rw-r--r-- 0 sbuild (999) sbuild (999) 22 2026-10-26 01:59:10.000000 jtreg-test-output/hotspot/0/JTreport/text/tc_fail2missing.txt │ │ │ │ │ +-rw-r--r-- 0 sbuild (999) sbuild (999) 551 2026-10-25 23:10:34.000000 jtreg-test-output/hotspot/0/JTreport/text/cmdArgs.txt │ │ │ │ │ +-rw-r--r-- 0 sbuild (999) sbuild (999) 21 2026-10-26 01:59:10.000000 jtreg-test-output/hotspot/0/JTreport/text/tc_fail2notrun.txt │ │ │ │ │ +-rw-r--r-- 0 sbuild (999) sbuild (999) 18 2026-10-26 01:59:10.000000 jtreg-test-output/hotspot/0/JTreport/text/newfailures.txt │ │ │ │ │ +-rw-r--r-- 0 sbuild (999) sbuild (999) 481331 2026-10-26 01:59:10.000000 jtreg-test-output/hotspot/0/JTreport/text/summary.txt │ │ │ │ │ +-rw-r--r-- 0 sbuild (999) sbuild (999) 18 2026-10-26 01:59:10.000000 jtreg-test-output/hotspot/0/JTreport/text/fail2notrun.txt │ │ │ │ │ +-rw-r--r-- 0 sbuild (999) sbuild (999) 21 2026-10-26 01:59:10.000000 jtreg-test-output/hotspot/0/JTreport/text/tc_newfailures.txt │ │ │ │ │ +-rw-r--r-- 0 sbuild (999) sbuild (999) 9190 2026-10-26 01:59:10.000000 jtreg-test-output/hotspot/0/JTreport/text/testng.txt │ │ │ │ │ +-rw-r--r-- 0 sbuild (999) sbuild (999) 9713 2026-10-26 01:59:10.000000 jtreg-test-output/hotspot/0/JTreport/text/junit.txt │ │ │ │ │ +-rw-r--r-- 0 sbuild (999) sbuild (999) 19 2026-10-26 01:59:10.000000 jtreg-test-output/hotspot/0/JTreport/text/other_errors.txt │ │ │ │ │ +lrwxrwxrwx 0 sbuild (999) sbuild (999) 0 2026-10-26 01:59:17.000000 jtreg-test-output/hotspot/JTreport -> 0/JTreport │ │ │ │ │ +drwxr-xr-x 0 sbuild (999) sbuild (999) 0 2026-10-26 02:38:51.000000 jtreg-test-output/langtools/0/JTreport/ │ │ │ │ │ +-rw-r--r-- 0 sbuild (999) sbuild (999) 720 2026-10-26 02:38:51.000000 jtreg-test-output/langtools/0/JTreport/index.html │ │ │ │ │ +drwxr-xr-x 0 sbuild (999) sbuild (999) 0 2026-10-26 02:38:51.000000 jtreg-test-output/langtools/0/JTreport/html/ │ │ │ │ │ +-rw-r--r-- 0 sbuild (999) sbuild (999) 885347 2026-10-26 02:38:51.000000 jtreg-test-output/langtools/0/JTreport/html/passed.html │ │ │ │ │ +-rw-r--r-- 0 sbuild (999) sbuild (999) 10783 2026-10-26 02:38:50.000000 jtreg-test-output/langtools/0/JTreport/html/config.html │ │ │ │ │ +-rw-r--r-- 0 sbuild (999) sbuild (999) 465 2026-10-26 02:38:51.000000 jtreg-test-output/langtools/0/JTreport/html/failed.html │ │ │ │ │ +-rw-r--r-- 0 sbuild (999) sbuild (999) 541887 2026-10-26 02:38:50.000000 jtreg-test-output/langtools/0/JTreport/html/index.html │ │ │ │ │ +-rw-r--r-- 0 sbuild (999) sbuild (999) 4120 2026-10-26 02:38:50.000000 jtreg-test-output/langtools/0/JTreport/html/env.html │ │ │ │ │ +-rw-r--r-- 0 sbuild (999) sbuild (999) 473 2026-10-26 02:38:51.000000 jtreg-test-output/langtools/0/JTreport/html/error.html │ │ │ │ │ +-rw-r--r-- 0 sbuild (999) sbuild (999) 307 2026-10-26 02:38:50.000000 jtreg-test-output/langtools/0/JTreport/html/report.css │ │ │ │ │ +-rw-r--r-- 0 sbuild (999) sbuild (999) 513 2026-10-26 02:38:51.000000 jtreg-test-output/langtools/0/JTreport/html/failed_gr.html │ │ │ │ │ +-rw-r--r-- 0 sbuild (999) sbuild (999) 521 2026-10-26 02:38:51.000000 jtreg-test-output/langtools/0/JTreport/html/error_gr.html │ │ │ │ │ +-rw-r--r-- 0 sbuild (999) sbuild (999) 2174 2026-10-26 02:38:51.000000 jtreg-test-output/langtools/0/JTreport/html/notRun.html │ │ │ │ │ +-rw-r--r-- 0 sbuild (999) sbuild (999) 885672 2026-10-26 02:38:51.000000 jtreg-test-output/langtools/0/JTreport/html/passed_gr.html │ │ │ │ │ +-rw-r--r-- 0 sbuild (999) sbuild (999) 541887 2026-10-26 02:38:50.000000 jtreg-test-output/langtools/0/JTreport/html/report.html │ │ │ │ │ +-rw-r--r-- 0 sbuild (999) sbuild (999) 6195 2026-10-26 02:38:50.000000 jtreg-test-output/langtools/0/JTreport/html/excluded.html │ │ │ │ │ +-rw-r--r-- 0 sbuild (999) sbuild (999) 2463 2026-10-26 02:38:51.000000 jtreg-test-output/langtools/0/JTreport/html/notRun_gr.html │ │ │ │ │ +-rw-r--r-- 0 sbuild (999) sbuild (999) 0 2026-10-26 02:38:51.000000 jtreg-test-output/langtools/0/JTreport/reportdir.dat │ │ │ │ │ +drwxr-xr-x 0 sbuild (999) sbuild (999) 0 2026-10-26 02:38:51.000000 jtreg-test-output/langtools/0/JTreport/text/ │ │ │ │ │ +-rw-r--r-- 0 sbuild (999) sbuild (999) 454 2026-10-26 02:38:51.000000 jtreg-test-output/langtools/0/JTreport/text/timeStats.txt │ │ │ │ │ +-rw-r--r-- 0 sbuild (999) sbuild (999) 16 2026-10-26 02:38:51.000000 jtreg-test-output/langtools/0/JTreport/text/fail2pass.txt │ │ │ │ │ +-rw-r--r-- 0 sbuild (999) sbuild (999) 19 2026-10-26 02:38:51.000000 jtreg-test-output/langtools/0/JTreport/text/tc_fail2pass.txt │ │ │ │ │ +-rw-r--r-- 0 sbuild (999) sbuild (999) 19 2026-10-26 02:38:51.000000 jtreg-test-output/langtools/0/JTreport/text/fail2missing.txt │ │ │ │ │ +-rw-r--r-- 0 sbuild (999) sbuild (999) 1921 2026-10-26 02:38:51.000000 jtreg-test-output/langtools/0/JTreport/text/notRun.txt │ │ │ │ │ +-rw-r--r-- 0 sbuild (999) sbuild (999) 17 2026-10-26 02:38:51.000000 jtreg-test-output/langtools/0/JTreport/text/faiL2error.txt │ │ │ │ │ +-rw-r--r-- 0 sbuild (999) sbuild (999) 20 2026-10-26 02:38:51.000000 jtreg-test-output/langtools/0/JTreport/text/tc_fail2error.txt │ │ │ │ │ +-rw-r--r-- 0 sbuild (999) sbuild (999) 120 2026-10-26 02:38:51.000000 jtreg-test-output/langtools/0/JTreport/text/stats.txt │ │ │ │ │ +-rw-r--r-- 0 sbuild (999) sbuild (999) 16 2026-10-26 02:38:51.000000 jtreg-test-output/langtools/0/JTreport/text/fail2fail.txt │ │ │ │ │ +-rw-r--r-- 0 sbuild (999) sbuild (999) 22 2026-10-26 02:38:51.000000 jtreg-test-output/langtools/0/JTreport/text/tc_fail2missing.txt │ │ │ │ │ +-rw-r--r-- 0 sbuild (999) sbuild (999) 454 2026-10-26 01:59:18.000000 jtreg-test-output/langtools/0/JTreport/text/cmdArgs.txt │ │ │ │ │ +-rw-r--r-- 0 sbuild (999) sbuild (999) 21 2026-10-26 02:38:51.000000 jtreg-test-output/langtools/0/JTreport/text/tc_fail2notrun.txt │ │ │ │ │ +-rw-r--r-- 0 sbuild (999) sbuild (999) 18 2026-10-26 02:38:51.000000 jtreg-test-output/langtools/0/JTreport/text/newfailures.txt │ │ │ │ │ +-rw-r--r-- 0 sbuild (999) sbuild (999) 643764 2026-10-26 02:38:51.000000 jtreg-test-output/langtools/0/JTreport/text/summary.txt │ │ │ │ │ +-rw-r--r-- 0 sbuild (999) sbuild (999) 18 2026-10-26 02:38:51.000000 jtreg-test-output/langtools/0/JTreport/text/fail2notrun.txt │ │ │ │ │ +-rw-r--r-- 0 sbuild (999) sbuild (999) 21 2026-10-26 02:38:51.000000 jtreg-test-output/langtools/0/JTreport/text/tc_newfailures.txt │ │ │ │ │ +-rw-r--r-- 0 sbuild (999) sbuild (999) 9538 2026-10-26 02:38:51.000000 jtreg-test-output/langtools/0/JTreport/text/testng.txt │ │ │ │ │ +-rw-r--r-- 0 sbuild (999) sbuild (999) 18737 2026-10-26 02:38:51.000000 jtreg-test-output/langtools/0/JTreport/text/junit.txt │ │ │ │ │ +-rw-r--r-- 0 sbuild (999) sbuild (999) 19 2026-10-26 02:38:51.000000 jtreg-test-output/langtools/0/JTreport/text/other_errors.txt │ │ │ │ │ +lrwxrwxrwx 0 sbuild (999) sbuild (999) 0 2026-10-26 02:38:58.000000 jtreg-test-output/langtools/JTreport -> 0/JTreport │ │ │ │ │ +drwxr-xr-x 0 sbuild (999) sbuild (999) 0 2026-10-26 02:54:10.000000 jtreg-test-output/jaxp/0/JTreport/ │ │ │ │ │ +-rw-r--r-- 0 sbuild (999) sbuild (999) 710 2026-10-26 02:54:10.000000 jtreg-test-output/jaxp/0/JTreport/index.html │ │ │ │ │ +drwxr-xr-x 0 sbuild (999) sbuild (999) 0 2026-10-26 02:54:10.000000 jtreg-test-output/jaxp/0/JTreport/html/ │ │ │ │ │ +-rw-r--r-- 0 sbuild (999) sbuild (999) 109973 2026-10-26 02:54:10.000000 jtreg-test-output/jaxp/0/JTreport/html/passed.html │ │ │ │ │ +-rw-r--r-- 0 sbuild (999) sbuild (999) 4423 2026-10-26 02:54:10.000000 jtreg-test-output/jaxp/0/JTreport/html/config.html │ │ │ │ │ +-rw-r--r-- 0 sbuild (999) sbuild (999) 465 2026-10-26 02:54:10.000000 jtreg-test-output/jaxp/0/JTreport/html/failed.html │ │ │ │ │ +-rw-r--r-- 0 sbuild (999) sbuild (999) 58492 2026-10-26 02:54:10.000000 jtreg-test-output/jaxp/0/JTreport/html/index.html │ │ │ │ │ +-rw-r--r-- 0 sbuild (999) sbuild (999) 4105 2026-10-26 02:54:10.000000 jtreg-test-output/jaxp/0/JTreport/html/env.html │ │ │ │ │ +-rw-r--r-- 0 sbuild (999) sbuild (999) 473 2026-10-26 02:54:10.000000 jtreg-test-output/jaxp/0/JTreport/html/error.html │ │ │ │ │ +-rw-r--r-- 0 sbuild (999) sbuild (999) 307 2026-10-26 02:54:10.000000 jtreg-test-output/jaxp/0/JTreport/html/report.css │ │ │ │ │ +-rw-r--r-- 0 sbuild (999) sbuild (999) 513 2026-10-26 02:54:10.000000 jtreg-test-output/jaxp/0/JTreport/html/failed_gr.html │ │ │ │ │ +-rw-r--r-- 0 sbuild (999) sbuild (999) 521 2026-10-26 02:54:10.000000 jtreg-test-output/jaxp/0/JTreport/html/error_gr.html │ │ │ │ │ +-rw-r--r-- 0 sbuild (999) sbuild (999) 573 2026-10-26 02:54:10.000000 jtreg-test-output/jaxp/0/JTreport/html/notRun.html │ │ │ │ │ +-rw-r--r-- 0 sbuild (999) sbuild (999) 110062 2026-10-26 02:54:10.000000 jtreg-test-output/jaxp/0/JTreport/html/passed_gr.html │ │ │ │ │ +-rw-r--r-- 0 sbuild (999) sbuild (999) 58492 2026-10-26 02:54:10.000000 jtreg-test-output/jaxp/0/JTreport/html/report.html │ │ │ │ │ +-rw-r--r-- 0 sbuild (999) sbuild (999) 3642 2026-10-26 02:54:10.000000 jtreg-test-output/jaxp/0/JTreport/html/excluded.html │ │ │ │ │ +-rw-r--r-- 0 sbuild (999) sbuild (999) 695 2026-10-26 02:54:10.000000 jtreg-test-output/jaxp/0/JTreport/html/notRun_gr.html │ │ │ │ │ +-rw-r--r-- 0 sbuild (999) sbuild (999) 0 2026-10-26 02:54:10.000000 jtreg-test-output/jaxp/0/JTreport/reportdir.dat │ │ │ │ │ +drwxr-xr-x 0 sbuild (999) sbuild (999) 0 2026-10-26 02:54:10.000000 jtreg-test-output/jaxp/0/JTreport/text/ │ │ │ │ │ +-rw-r--r-- 0 sbuild (999) sbuild (999) 166 2026-10-26 02:54:10.000000 jtreg-test-output/jaxp/0/JTreport/text/timeStats.txt │ │ │ │ │ +-rw-r--r-- 0 sbuild (999) sbuild (999) 16 2026-10-26 02:54:10.000000 jtreg-test-output/jaxp/0/JTreport/text/fail2pass.txt │ │ │ │ │ +-rw-r--r-- 0 sbuild (999) sbuild (999) 19 2026-10-26 02:54:10.000000 jtreg-test-output/jaxp/0/JTreport/text/tc_fail2pass.txt │ │ │ │ │ +-rw-r--r-- 0 sbuild (999) sbuild (999) 19 2026-10-26 02:54:10.000000 jtreg-test-output/jaxp/0/JTreport/text/fail2missing.txt │ │ │ │ │ +-rw-r--r-- 0 sbuild (999) sbuild (999) 116 2026-10-26 02:54:10.000000 jtreg-test-output/jaxp/0/JTreport/text/notRun.txt │ │ │ │ │ +-rw-r--r-- 0 sbuild (999) sbuild (999) 17 2026-10-26 02:54:10.000000 jtreg-test-output/jaxp/0/JTreport/text/faiL2error.txt │ │ │ │ │ +-rw-r--r-- 0 sbuild (999) sbuild (999) 20 2026-10-26 02:54:10.000000 jtreg-test-output/jaxp/0/JTreport/text/tc_fail2error.txt │ │ │ │ │ +-rw-r--r-- 0 sbuild (999) sbuild (999) 65 2026-10-26 02:54:10.000000 jtreg-test-output/jaxp/0/JTreport/text/stats.txt │ │ │ │ │ +-rw-r--r-- 0 sbuild (999) sbuild (999) 16 2026-10-26 02:54:10.000000 jtreg-test-output/jaxp/0/JTreport/text/fail2fail.txt │ │ │ │ │ +-rw-r--r-- 0 sbuild (999) sbuild (999) 22 2026-10-26 02:54:10.000000 jtreg-test-output/jaxp/0/JTreport/text/tc_fail2missing.txt │ │ │ │ │ +-rw-r--r-- 0 sbuild (999) sbuild (999) 439 2026-10-26 02:38:58.000000 jtreg-test-output/jaxp/0/JTreport/text/cmdArgs.txt │ │ │ │ │ +-rw-r--r-- 0 sbuild (999) sbuild (999) 21 2026-10-26 02:54:10.000000 jtreg-test-output/jaxp/0/JTreport/text/tc_fail2notrun.txt │ │ │ │ │ +-rw-r--r-- 0 sbuild (999) sbuild (999) 18 2026-10-26 02:54:10.000000 jtreg-test-output/jaxp/0/JTreport/text/newfailures.txt │ │ │ │ │ +-rw-r--r-- 0 sbuild (999) sbuild (999) 59118 2026-10-26 02:54:10.000000 jtreg-test-output/jaxp/0/JTreport/text/summary.txt │ │ │ │ │ +-rw-r--r-- 0 sbuild (999) sbuild (999) 18 2026-10-26 02:54:10.000000 jtreg-test-output/jaxp/0/JTreport/text/fail2notrun.txt │ │ │ │ │ +-rw-r--r-- 0 sbuild (999) sbuild (999) 21 2026-10-26 02:54:10.000000 jtreg-test-output/jaxp/0/JTreport/text/tc_newfailures.txt │ │ │ │ │ +-rw-r--r-- 0 sbuild (999) sbuild (999) 69461 2026-10-26 02:54:10.000000 jtreg-test-output/jaxp/0/JTreport/text/testng.txt │ │ │ │ │ +-rw-r--r-- 0 sbuild (999) sbuild (999) 200 2026-10-26 02:54:10.000000 jtreg-test-output/jaxp/0/JTreport/text/junit.txt │ │ │ │ │ +-rw-r--r-- 0 sbuild (999) sbuild (999) 19 2026-10-26 02:54:10.000000 jtreg-test-output/jaxp/0/JTreport/text/other_errors.txt │ │ │ │ │ +lrwxrwxrwx 0 sbuild (999) sbuild (999) 0 2026-10-26 02:54:11.000000 jtreg-test-output/jaxp/JTreport -> 0/JTreport │ │ │ │ ├── jtreg-test-output/jdk/2/JTreport/index.html │ │ │ │ │ @@ -3,15 +3,15 @@ │ │ │ │ │ │ │ │ │ │ │ │ │ │ │ │ │ │ │ │ │ │ │ │ │ Report Index │ │ │ │ │ │ │ │ │ │

/build/reproducible-path/openjdk-21-21.0.13+9/test/jdk

│ │ │ │ │ -Date of report : 22 October 2026 23:55:34 │ │ │ │ │ +Date of report : 26 October 2026 06:46:35 │ │ │ │ │ │ │ │ │ │

│ │ │ │ │ HTML Report │ │ │ │ │
Standard JT Harness HTML report. Can show a summary of the results, configuration information, and environment values.

│ │ │ │ │

│ │ │ │ │ Plain Text Report │ │ │ │ │
Standard JT Harness text report showing only test names and their result status string. Suitable for parsing by external program.

│ │ │ │ │ ├── html2text {} │ │ │ │ │ │ @@ -1,8 +1,8 @@ │ │ │ │ │ │ ************ //bbuuiilldd//rreepprroodduucciibbllee--ppaatthh//ooppeennjjddkk--2211--2211..00..1133++99//tteesstt//jjddkk ************ │ │ │ │ │ │ -Date of report : 22 October 2026 23:55:34 │ │ │ │ │ │ +Date of report : 26 October 2026 06:46:35 │ │ │ │ │ │ _H_T_M_L_ _R_e_p_o_r_t │ │ │ │ │ │ Standard JT Harness HTML report. Can show a summary of the results, │ │ │ │ │ │ configuration information, and environment values. │ │ │ │ │ │ _P_l_a_i_n_ _T_e_x_t_ _R_e_p_o_r_t │ │ │ │ │ │ Standard JT Harness text report showing only test names and their result status │ │ │ │ │ │ string. Suitable for parsing by external program. │ │ │ │ ├── jtreg-test-output/jdk/2/JTreport/html/notRun_gr.html │ │ │ │ │ @@ -47657,18 +47657,18 @@ │ │ │ │ │ 000ba280: 2063 6f72 7265 6374 6c79 0a0a 3c6c 693e correctly..
  • │ │ │ │ │ 000ba290: 7375 6e2f 7365 6375 7269 7479 2f73 6d61 sun/security/sma │ │ │ │ │ 000ba2a0: 7274 6361 7264 696f 2f54 6573 7454 7261 rtcardio/TestTra │ │ │ │ │ 000ba2b0: 6e73 6d69 742e 6a61 7661 3a20 7465 7374 nsmit.java: test │ │ │ │ │ 000ba2c0: 2074 7261 6e73 6d69 7428 2920 776f 726b transmit() work │ │ │ │ │ 000ba2d0: 730a 3c2f 756c 3e0a 3c68 723e 0a3c 736d s..
    .Report gener │ │ │ │ │ -000ba2f0: 6174 6564 206f 6e20 4f63 7420 3232 2c20 ated on Oct 22, │ │ │ │ │ -000ba300: 3230 3236 2031 313a 3535 3a33 34e2 80af 2026 11:55:34... │ │ │ │ │ -000ba310: 504d 0a3c 6272 3e55 7369 6e67 204a 5420 PM.
    Using JT │ │ │ │ │ -000ba320: 4861 726e 6573 7320 362e 3020 6232 363b Harness 6.0 b26; │ │ │ │ │ -000ba330: 2062 7569 6c74 206f 6e20 4d61 7263 6820 built on March │ │ │ │ │ -000ba340: 3138 2c20 3230 3236 2c20 3132 3a30 303a 18, 2026, 12:00: │ │ │ │ │ -000ba350: 3030 e280 af41 4d20 5554 4320 7769 7468 00...AM UTC with │ │ │ │ │ -000ba360: 206f 7065 6e6a 646b 2076 6572 7369 6f6e openjdk version │ │ │ │ │ -000ba370: 2022 3235 2e30 2e33 2d65 6122 2032 3032 "25.0.3-ea" 202 │ │ │ │ │ -000ba380: 362d 3034 2d32 313c 2f73 6d61 6c6c 3e3c 6-04-21< │ │ │ │ │ -000ba390: 2f62 6f64 793e 3c2f 6874 6d6c 3e /body> │ │ │ │ │ +000ba2f0: 6174 6564 206f 6e20 4f63 7420 3236 2c20 ated on Oct 26, │ │ │ │ │ +000ba300: 3230 3236 2036 3a34 363a 3334 e280 af41 2026 6:46:34...A │ │ │ │ │ +000ba310: 4d0a 3c62 723e 5573 696e 6720 4a54 2048 M.
    Using JT H │ │ │ │ │ +000ba320: 6172 6e65 7373 2036 2e30 2062 3236 3b20 arness 6.0 b26; │ │ │ │ │ +000ba330: 6275 696c 7420 6f6e 204d 6172 6368 2031 built on March 1 │ │ │ │ │ +000ba340: 382c 2032 3032 362c 2031 323a 3030 3a30 8, 2026, 12:00:0 │ │ │ │ │ +000ba350: 30e2 80af 414d 2055 5443 2077 6974 6820 0...AM UTC with │ │ │ │ │ +000ba360: 6f70 656e 6a64 6b20 7665 7273 696f 6e20 openjdk version │ │ │ │ │ +000ba370: 2232 352e 302e 332d 6561 2220 3230 3236 "25.0.3-ea" 2026 │ │ │ │ │ +000ba380: 2d30 342d 3231 3c2f 736d 616c 6c3e 3c2f -04-21 │ │ │ │ │ ├── html2text {} │ │ │ │ │ │ @@ -13395,10 +13395,10 @@ │ │ │ │ │ │ ()/endExclusive() works │ │ │ │ │ │ * sun/security/smartcardio/TestMultiplePresent.java: test that │ │ │ │ │ │ CardTerminals.waitForCard() works │ │ │ │ │ │ * sun/security/smartcardio/TestPresent.java: test that the isCardPresent()/ │ │ │ │ │ │ waitForX() APIs work correctly │ │ │ │ │ │ * sun/security/smartcardio/TestTransmit.java: test transmit() works │ │ │ │ │ │ =============================================================================== │ │ │ │ │ │ -Report generated on Oct 22, 2026 11:55:34 PM │ │ │ │ │ │ +Report generated on Oct 26, 2026 6:46:34 AM │ │ │ │ │ │ Using JT Harness 6.0 b26; built on March 18, 2026, 12:00:00 AM UTC with openjdk │ │ │ │ │ │ version "25.0.3-ea" 2026-04-21 │ │ │ │ ├── jtreg-test-output/jdk/2/JTreport/html/notRun.html │ │ │ │ │ @@ -47640,18 +47640,18 @@ │ │ │ │ │ 000ba170: 6f64 756c 6573 2f76 616c 6964 6174 652f odules/validate/ │ │ │ │ │ 000ba180: 5661 6c69 6461 7465 4d6f 6475 6c65 7354 ValidateModulesT │ │ │ │ │ 000ba190: 6573 742e 6a61 7661 3a20 4261 7369 6320 est.java: Basic │ │ │ │ │ 000ba1a0: 7465 7374 2066 6f72 206a 6176 6120 2d2d test for java -- │ │ │ │ │ 000ba1b0: 7661 6c69 6461 7465 2d6d 6f64 756c 6573 validate-modules │ │ │ │ │ 000ba1c0: 0a3c 6272 0a3e 0a3c 6872 3e0a 3c73 6d61 ..
    .Report genera │ │ │ │ │ -000ba1e0: 7465 6420 6f6e 204f 6374 2032 322c 2032 ted on Oct 22, 2 │ │ │ │ │ -000ba1f0: 3032 3620 3131 3a35 353a 3334 e280 af50 026 11:55:34...P │ │ │ │ │ -000ba200: 4d0a 3c62 723e 5573 696e 6720 4a54 2048 M.
    Using JT H │ │ │ │ │ -000ba210: 6172 6e65 7373 2036 2e30 2062 3236 3b20 arness 6.0 b26; │ │ │ │ │ -000ba220: 6275 696c 7420 6f6e 204d 6172 6368 2031 built on March 1 │ │ │ │ │ -000ba230: 382c 2032 3032 362c 2031 323a 3030 3a30 8, 2026, 12:00:0 │ │ │ │ │ -000ba240: 30e2 80af 414d 2055 5443 2077 6974 6820 0...AM UTC with │ │ │ │ │ -000ba250: 6f70 656e 6a64 6b20 7665 7273 696f 6e20 openjdk version │ │ │ │ │ -000ba260: 2232 352e 302e 332d 6561 2220 3230 3236 "25.0.3-ea" 2026 │ │ │ │ │ -000ba270: 2d30 342d 3231 3c2f 736d 616c 6c3e 3c2f -04-21 │ │ │ │ │ +000ba1e0: 7465 6420 6f6e 204f 6374 2032 362c 2032 ted on Oct 26, 2 │ │ │ │ │ +000ba1f0: 3032 3620 363a 3436 3a33 34e2 80af 414d 026 6:46:34...AM │ │ │ │ │ +000ba200: 0a3c 6272 3e55 7369 6e67 204a 5420 4861 .
    Using JT Ha │ │ │ │ │ +000ba210: 726e 6573 7320 362e 3020 6232 363b 2062 rness 6.0 b26; b │ │ │ │ │ +000ba220: 7569 6c74 206f 6e20 4d61 7263 6820 3138 uilt on March 18 │ │ │ │ │ +000ba230: 2c20 3230 3236 2c20 3132 3a30 303a 3030 , 2026, 12:00:00 │ │ │ │ │ +000ba240: e280 af41 4d20 5554 4320 7769 7468 206f ...AM UTC with o │ │ │ │ │ +000ba250: 7065 6e6a 646b 2076 6572 7369 6f6e 2022 penjdk version " │ │ │ │ │ +000ba260: 3235 2e30 2e33 2d65 6122 2032 3032 362d 25.0.3-ea" 2026- │ │ │ │ │ +000ba270: 3034 2d32 313c 2f73 6d61 6c6c 3e3c 2f62 04-21 │ │ │ │ │ ├── html2text {} │ │ │ │ │ │ @@ -12775,10 +12775,10 @@ │ │ │ │ │ │ tools/launcher/modules/patch/systemmodules/PatchSystemModules.java: Patch │ │ │ │ │ │ java.base and user module with ModuleHashes attribute │ │ │ │ │ │ tools/launcher/modules/showmoduleresolution/ShowModuleResolutionTest.java: │ │ │ │ │ │ Basic test for java --show-module-resolution │ │ │ │ │ │ tools/launcher/modules/validate/ValidateModulesTest.java: Basic test for java - │ │ │ │ │ │ -validate-modules │ │ │ │ │ │ =============================================================================== │ │ │ │ │ │ -Report generated on Oct 22, 2026 11:55:34 PM │ │ │ │ │ │ +Report generated on Oct 26, 2026 6:46:34 AM │ │ │ │ │ │ Using JT Harness 6.0 b26; built on March 18, 2026, 12:00:00 AM UTC with openjdk │ │ │ │ │ │ version "25.0.3-ea" 2026-04-21 │ │ │ │ ├── jtreg-test-output/jdk/2/JTreport/html/error_gr.html │ │ │ │ │ @@ -6,9 +6,9 @@ │ │ │ │ │ │ │ │ │ │ JT Harness : Tests that had errors │ │ │ │ │ │ │ │ │ │ │ │ │ │ │ │ │ │ │ │

    JT Harness : Tests that had errors

    Tests are grouped by their final status message. │ │ │ │ │
    │ │ │ │ │ -Report generated on Oct 22, 2026 11:55:34 PM │ │ │ │ │ +Report generated on Oct 26, 2026 6:46:34 AM │ │ │ │ │
    Using JT Harness 6.0 b26; built on March 18, 2026, 12:00:00 AM UTC with openjdk version "25.0.3-ea" 2026-04-21
    │ │ │ │ │ ├── html2text {} │ │ │ │ │ │ @@ -1,6 +1,6 @@ │ │ │ │ │ │ ************ JJTT HHaarrnneessss :: TTeessttss tthhaatt hhaadd eerrrroorrss ************ │ │ │ │ │ │ Tests are grouped by their final status message. │ │ │ │ │ │ =============================================================================== │ │ │ │ │ │ -Report generated on Oct 22, 2026 11:55:34 PM │ │ │ │ │ │ +Report generated on Oct 26, 2026 6:46:34 AM │ │ │ │ │ │ Using JT Harness 6.0 b26; built on March 18, 2026, 12:00:00 AM UTC with openjdk │ │ │ │ │ │ version "25.0.3-ea" 2026-04-21 │ │ │ │ ├── jtreg-test-output/jdk/2/JTreport/html/error.html │ │ │ │ │ @@ -6,9 +6,9 @@ │ │ │ │ │ │ │ │ │ │ JT Harness : Tests that had errors │ │ │ │ │ │ │ │ │ │ │ │ │ │ │ │ │ │ │ │

    JT Harness : Tests that had errors

    │ │ │ │ │
    │ │ │ │ │ -Report generated on Oct 22, 2026 11:55:34 PM │ │ │ │ │ +Report generated on Oct 26, 2026 6:46:34 AM │ │ │ │ │
    Using JT Harness 6.0 b26; built on March 18, 2026, 12:00:00 AM UTC with openjdk version "25.0.3-ea" 2026-04-21
    │ │ │ │ │ ├── html2text {} │ │ │ │ │ │ @@ -1,5 +1,5 @@ │ │ │ │ │ │ ************ JJTT HHaarrnneessss :: TTeessttss tthhaatt hhaadd eerrrroorrss ************ │ │ │ │ │ │ =============================================================================== │ │ │ │ │ │ -Report generated on Oct 22, 2026 11:55:34 PM │ │ │ │ │ │ +Report generated on Oct 26, 2026 6:46:34 AM │ │ │ │ │ │ Using JT Harness 6.0 b26; built on March 18, 2026, 12:00:00 AM UTC with openjdk │ │ │ │ │ │ version "25.0.3-ea" 2026-04-21 │ │ │ │ ├── jtreg-test-output/jdk/2/JTreport/html/failed_gr.html │ │ │ │ │ @@ -56,9 +56,9 @@ │ │ │ │ │
  • │ │ │ │ │ java/net/MulticastSocket/SetLoopbackMode.java: Test MulticastSocket.setLoopbackMode │ │ │ │ │ │ │ │ │ │
  • │ │ │ │ │ java/net/MulticastSocket/SetLoopbackModeIPv4.java: Test MulticastSocket.setLoopbackMode with IPv4 addresses │ │ │ │ │ │ │ │ │ │
    │ │ │ │ │ -Report generated on Oct 22, 2026 11:55:34 PM │ │ │ │ │ +Report generated on Oct 26, 2026 6:46:34 AM │ │ │ │ │
    Using JT Harness 6.0 b26; built on March 18, 2026, 12:00:00 AM UTC with openjdk version "25.0.3-ea" 2026-04-21
    │ │ │ │ │ ├── html2text {} │ │ │ │ │ │ @@ -25,10 +25,10 @@ │ │ │ │ │ │ * _j_a_v_a_/_n_e_t_/_M_u_l_t_i_c_a_s_t_S_o_c_k_e_t_/_N_o_L_o_o_p_b_a_c_k_P_a_c_k_e_t_s_._j_a_v_a: Re-test IPv6 (and │ │ │ │ │ │ specifically MulticastSocket) with latest Linux & USAGI code │ │ │ │ │ │ * _j_a_v_a_/_n_e_t_/_M_u_l_t_i_c_a_s_t_S_o_c_k_e_t_/_S_e_t_L_o_o_p_b_a_c_k_M_o_d_e_._j_a_v_a: Test │ │ │ │ │ │ MulticastSocket.setLoopbackMode │ │ │ │ │ │ * _j_a_v_a_/_n_e_t_/_M_u_l_t_i_c_a_s_t_S_o_c_k_e_t_/_S_e_t_L_o_o_p_b_a_c_k_M_o_d_e_I_P_v_4_._j_a_v_a: Test │ │ │ │ │ │ MulticastSocket.setLoopbackMode with IPv4 addresses │ │ │ │ │ │ =============================================================================== │ │ │ │ │ │ -Report generated on Oct 22, 2026 11:55:34 PM │ │ │ │ │ │ +Report generated on Oct 26, 2026 6:46:34 AM │ │ │ │ │ │ Using JT Harness 6.0 b26; built on March 18, 2026, 12:00:00 AM UTC with openjdk │ │ │ │ │ │ version "25.0.3-ea" 2026-04-21 │ │ │ │ ├── jtreg-test-output/jdk/2/JTreport/html/failed.html │ │ │ │ │ @@ -33,9 +33,9 @@ │ │ │ │ │ java/net/SocketPermission/SocketPermissionTest.java: SocketPermission tests for legacy socket types. │ │ │ │ │
    │ │ │ │ │ sun/security/krb5/auto/Addresses.java: fix krb5 caddr │ │ │ │ │
    │ │ │ │ │
    │ │ │ │ │ -Report generated on Oct 22, 2026 11:55:34 PM │ │ │ │ │ +Report generated on Oct 26, 2026 6:46:34 AM │ │ │ │ │
    Using JT Harness 6.0 b26; built on March 18, 2026, 12:00:00 AM UTC with openjdk version "25.0.3-ea" 2026-04-21
    │ │ │ │ │ ├── html2text {} │ │ │ │ │ │ @@ -11,10 +11,10 @@ │ │ │ │ │ │ MulticastSocket.setLoopbackMode with IPv4 addresses │ │ │ │ │ │ _j_a_v_a_/_n_e_t_/_M_u_l_t_i_c_a_s_t_S_o_c_k_e_t_/_T_e_s_t_._j_a_v_a: IPv4 and IPv6 multicasting broken on Linux │ │ │ │ │ │ _j_a_v_a_/_n_e_t_/_S_o_c_k_e_t_O_p_t_i_o_n_/_O_p_t_i_o_n_s_T_e_s_t_._j_a_v_a: │ │ │ │ │ │ _j_a_v_a_/_n_e_t_/_S_o_c_k_e_t_P_e_r_m_i_s_s_i_o_n_/_S_o_c_k_e_t_P_e_r_m_i_s_s_i_o_n_T_e_s_t_._j_a_v_a: SocketPermission tests for │ │ │ │ │ │ legacy socket types. │ │ │ │ │ │ _s_u_n_/_s_e_c_u_r_i_t_y_/_k_r_b_5_/_a_u_t_o_/_A_d_d_r_e_s_s_e_s_._j_a_v_a: fix krb5 caddr │ │ │ │ │ │ =============================================================================== │ │ │ │ │ │ -Report generated on Oct 22, 2026 11:55:34 PM │ │ │ │ │ │ +Report generated on Oct 26, 2026 6:46:34 AM │ │ │ │ │ │ Using JT Harness 6.0 b26; built on March 18, 2026, 12:00:00 AM UTC with openjdk │ │ │ │ │ │ version "25.0.3-ea" 2026-04-21 │ │ │ │ ├── jtreg-test-output/jdk/2/JTreport/html/passed_gr.html │ │ │ │ │ @@ -241,77957 +241,77986 @@ │ │ │ │ │ 00000f00: 6c65 732e 6a74 7222 3e6a 646b 2f63 6c61 les.jtr">jdk/cla │ │ │ │ │ 00000f10: 7373 6669 6c65 2f65 7861 6d70 6c65 732f ssfile/examples/ │ │ │ │ │ 00000f20: 5472 616e 7366 6f72 6d45 7861 6d70 6c65 TransformExample │ │ │ │ │ 00000f30: 732e 6a61 7661 3c2f 613e 3a20 5465 7374 s.java: Test │ │ │ │ │ 00000f40: 696e 6720 436c 6173 7366 696c 6520 5472 ing Classfile Tr │ │ │ │ │ 00000f50: 616e 7366 6f72 6d45 7861 6d70 6c65 7320 ansformExamples │ │ │ │ │ 00000f60: 636f 6d70 696c 6174 696f 6e2e 0a3c 2f75 compilation....

    Executio │ │ │ │ │ -00000f80: 6e20 6661 696c 6564 2061 7320 6578 7065 n failed as expe │ │ │ │ │ -00000f90: 6374 6564 3c2f 6834 3e0a 0a3c 756c 3e0a cted

    ....

    E │ │ │ │ │ -00001670: 7865 6375 7469 6f6e 2073 7563 6365 7373 xecution success │ │ │ │ │ -00001680: 6675 6c3c 2f68 343e 0a0a 3c75 6c3e 0a3c ful

    ... │ │ │ │ │ +00001140: 0a3c 6834 3e45 7865 6375 7469 6f6e 2066 .

    Execution f │ │ │ │ │ +00001150: 6169 6c65 6420 6173 2065 7870 6563 7465 ailed as expecte │ │ │ │ │ +00001160: 643c 2f68 343e 0a0a 3c75 6c3e 0a3c 6c69 d

    ....

    Exec │ │ │ │ │ +00001840: 7574 696f 6e20 7375 6363 6573 7366 756c ution successful │ │ │ │ │ +00001850: 3c2f 6834 3e0a 0a3c 756c 3e0a 3c6c 693e

    ..