--- /srv/rebuilderd/tmp/rebuilderdWWycik/inputs/openjdk-21-jdk_21.0.13~8ea-1_arm64.deb +++ /srv/rebuilderd/tmp/rebuilderdWWycik/out/openjdk-21-jdk_21.0.13~8ea-1_arm64.deb ├── file list │ @@ -1,3 +1,3 @@ │ -rw-r--r-- 0 0 0 4 2026-10-08 06:37:43.000000 debian-binary │ -rw-r--r-- 0 0 0 1836 2026-10-08 06:37:43.000000 control.tar.xz │ --rw-r--r-- 0 0 0 3556704 2026-10-08 06:37:43.000000 data.tar.xz │ +-rw-r--r-- 0 0 0 3461756 2026-10-08 06:37:43.000000 data.tar.xz ├── control.tar.xz │ ├── control.tar │ │ ├── ./control │ │ │ @@ -1,13 +1,13 @@ │ │ │ Package: openjdk-21-jdk │ │ │ Source: openjdk-21 │ │ │ Version: 21.0.13~8ea-1 │ │ │ Architecture: arm64 │ │ │ Maintainer: OpenJDK Team │ │ │ -Installed-Size: 3780 │ │ │ +Installed-Size: 3788 │ │ │ Depends: openjdk-21-jre (= 21.0.13~8ea-1), openjdk-21-jdk-headless (= 21.0.13~8ea-1), libc6 (>= 2.34), zlib1g (>= 1:1.1.4) │ │ │ Recommends: libxt-dev │ │ │ Suggests: openjdk-21-demo, openjdk-21-source, visualvm │ │ │ Provides: java-compiler, java-sdk (= 21), java10-sdk, java11-sdk, java12-sdk, java13-sdk, java14-sdk, java15-sdk, java16-sdk, java17-sdk, java18-sdk, java19-sdk, java2-sdk, java20-sdk, java21-sdk, java5-sdk, java6-sdk, java7-sdk, java8-sdk, java9-sdk │ │ │ Section: java │ │ │ Priority: optional │ │ │ Multi-Arch: same │ │ ├── ./md5sums │ │ │ ├── ./md5sums │ │ │ │┄ Files differ ├── data.tar.xz │ ├── data.tar │ │ ├── file list │ │ │ @@ -17,13 +17,13 @@ │ │ │ drwxr-xr-x 0 root (0) root (0) 0 2026-10-08 06:37:43.000000 ./usr/share/doc/ │ │ │ drwxr-xr-x 0 root (0) root (0) 0 2026-10-08 06:37:43.000000 ./usr/share/doc/openjdk-21-jre-headless/ │ │ │ drwxr-xr-x 0 root (0) root (0) 0 2026-10-08 06:37:43.000000 ./usr/share/doc/openjdk-21-jre-headless/test-arm64/ │ │ │ -rw-r--r-- 0 root (0) root (0) 28685 2026-10-08 06:37:43.000000 ./usr/share/doc/openjdk-21-jre-headless/test-arm64/check-hotspot-hotspot.log.gz │ │ │ -rw-r--r-- 0 root (0) root (0) 3923 2026-10-08 06:37:43.000000 ./usr/share/doc/openjdk-21-jre-headless/test-arm64/check-jaxp-hotspot.log.gz │ │ │ -rw-r--r-- 0 root (0) root (0) 55744 2026-10-08 06:37:43.000000 ./usr/share/doc/openjdk-21-jre-headless/test-arm64/check-jdk-hotspot.log.gz │ │ │ -rw-r--r-- 0 root (0) root (0) 35230 2026-10-08 06:37:43.000000 ./usr/share/doc/openjdk-21-jre-headless/test-arm64/check-langtools-hotspot.log.gz │ │ │ --rw-r--r-- 0 root (0) root (0) 8578 2026-10-08 06:37:43.000000 ./usr/share/doc/openjdk-21-jre-headless/test-arm64/failed_tests-hotspot.tar.gz │ │ │ +-rw-r--r-- 0 root (0) root (0) 8576 2026-10-08 06:37:43.000000 ./usr/share/doc/openjdk-21-jre-headless/test-arm64/failed_tests-hotspot.tar.gz │ │ │ -rw-r--r-- 0 root (0) root (0) 3397 2026-10-08 06:37:43.000000 ./usr/share/doc/openjdk-21-jre-headless/test-arm64/jtreg-summary-hotspot.log │ │ │ --rw-r--r-- 0 root (0) root (0) 127839 2026-10-08 06:37:43.000000 ./usr/share/doc/openjdk-21-jre-headless/test-arm64/jtreg_output-hotspot.log.gz │ │ │ --rw-r--r-- 0 root (0) root (0) 3495005 2026-10-08 06:37:43.000000 ./usr/share/doc/openjdk-21-jre-headless/test-arm64/jtreport-hotspot.tar.gz │ │ │ +-rw-r--r-- 0 root (0) root (0) 127891 2026-10-08 06:37:43.000000 ./usr/share/doc/openjdk-21-jre-headless/test-arm64/jtreg_output-hotspot.log.gz │ │ │ +-rw-r--r-- 0 root (0) root (0) 3503899 2026-10-08 06:37:43.000000 ./usr/share/doc/openjdk-21-jre-headless/test-arm64/jtreport-hotspot.tar.gz │ │ │ lrwxrwxrwx 0 root (0) root (0) 0 2026-10-08 06:37:43.000000 ./usr/lib/jvm/openjdk-21/src.zip -> lib/src.zip │ │ │ lrwxrwxrwx 0 root (0) root (0) 0 2026-10-08 06:37:43.000000 ./usr/share/doc/openjdk-21-jdk -> openjdk-21-jre │ │ ├── ./usr/share/doc/openjdk-21-jre-headless/test-arm64/failed_tests-hotspot.tar.gz │ │ │ ├── failed_tests-hotspot.tar │ │ │ │ ├── file list │ │ │ │ │ @@ -1,9 +1,9 @@ │ │ │ │ │ --rw-r--r-- 0 sbuild (999) sbuild (999) 6816 2026-10-08 18:22:39.000000 jtreg-test-output/jdk/JTwork/java/net/MulticastSocket/B6427403.jtr │ │ │ │ │ --rw-r--r-- 0 sbuild (999) sbuild (999) 7841 2026-10-08 18:22:40.000000 jtreg-test-output/jdk/JTwork/java/net/MulticastSocket/NoLoopbackPackets.jtr │ │ │ │ │ --rw-r--r-- 0 sbuild (999) sbuild (999) 7849 2026-10-08 18:22:40.000000 jtreg-test-output/jdk/JTwork/java/net/MulticastSocket/Promiscuous.jtr │ │ │ │ │ --rw-r--r-- 0 sbuild (999) sbuild (999) 8464 2026-10-08 18:22:40.000000 jtreg-test-output/jdk/JTwork/java/net/MulticastSocket/SetLoopbackMode.jtr │ │ │ │ │ --rw-r--r-- 0 sbuild (999) sbuild (999) 8881 2026-10-08 18:22:40.000000 jtreg-test-output/jdk/JTwork/java/net/MulticastSocket/SetLoopbackModeIPv4.jtr │ │ │ │ │ --rw-r--r-- 0 sbuild (999) sbuild (999) 9737 2026-10-08 18:22:40.000000 jtreg-test-output/jdk/JTwork/java/net/MulticastSocket/Test.jtr │ │ │ │ │ --rw-r--r-- 0 sbuild (999) sbuild (999) 7486 2026-10-08 18:22:41.000000 jtreg-test-output/jdk/JTwork/java/net/SocketOption/OptionsTest.jtr │ │ │ │ │ --rw-r--r-- 0 sbuild (999) sbuild (999) 15170 2026-10-08 18:22:42.000000 jtreg-test-output/jdk/JTwork/java/net/SocketPermission/SocketPermissionTest.jtr │ │ │ │ │ --rw-r--r-- 0 sbuild (999) sbuild (999) 25792 2026-10-08 18:22:44.000000 jtreg-test-output/jdk/JTwork/sun/security/krb5/auto/Addresses.jtr │ │ │ │ │ +-rw-r--r-- 0 sbuild (999) sbuild (999) 6835 2026-10-15 15:31:33.000000 jtreg-test-output/jdk/JTwork/java/net/MulticastSocket/B6427403.jtr │ │ │ │ │ +-rw-r--r-- 0 sbuild (999) sbuild (999) 7863 2026-10-15 15:31:33.000000 jtreg-test-output/jdk/JTwork/java/net/MulticastSocket/NoLoopbackPackets.jtr │ │ │ │ │ +-rw-r--r-- 0 sbuild (999) sbuild (999) 7870 2026-10-15 15:31:33.000000 jtreg-test-output/jdk/JTwork/java/net/MulticastSocket/Promiscuous.jtr │ │ │ │ │ +-rw-r--r-- 0 sbuild (999) sbuild (999) 8483 2026-10-15 15:31:33.000000 jtreg-test-output/jdk/JTwork/java/net/MulticastSocket/SetLoopbackMode.jtr │ │ │ │ │ +-rw-r--r-- 0 sbuild (999) sbuild (999) 8900 2026-10-15 15:31:34.000000 jtreg-test-output/jdk/JTwork/java/net/MulticastSocket/SetLoopbackModeIPv4.jtr │ │ │ │ │ +-rw-r--r-- 0 sbuild (999) sbuild (999) 9758 2026-10-15 15:31:34.000000 jtreg-test-output/jdk/JTwork/java/net/MulticastSocket/Test.jtr │ │ │ │ │ +-rw-r--r-- 0 sbuild (999) sbuild (999) 7507 2026-10-15 15:31:34.000000 jtreg-test-output/jdk/JTwork/java/net/SocketOption/OptionsTest.jtr │ │ │ │ │ +-rw-r--r-- 0 sbuild (999) sbuild (999) 15191 2026-10-15 15:31:35.000000 jtreg-test-output/jdk/JTwork/java/net/SocketPermission/SocketPermissionTest.jtr │ │ │ │ │ +-rw-r--r-- 0 sbuild (999) sbuild (999) 25811 2026-10-15 15:31:38.000000 jtreg-test-output/jdk/JTwork/sun/security/krb5/auto/Addresses.jtr │ │ │ │ ├── jtreg-test-output/jdk/JTwork/java/net/MulticastSocket/B6427403.jtr │ │ │ │ │ @@ -1,70 +1,70 @@ │ │ │ │ │ #Test Results (version 2) │ │ │ │ │ -#Thu Oct 08 18:22:39 UTC 2026 │ │ │ │ │ +#Thu Oct 15 15:31:33 UTC 2026 │ │ │ │ │ #-----testdescription----- │ │ │ │ │ $file=/build/reproducible-path/openjdk-21-21.0.13~8ea/test/jdk/java/net/MulticastSocket/B6427403.java │ │ │ │ │ $root=/build/reproducible-path/openjdk-21-21.0.13~8ea/test/jdk │ │ │ │ │ keywords=bug6427403 │ │ │ │ │ run=USER_SPECIFIED main B6427403\n │ │ │ │ │ source=B6427403.java │ │ │ │ │ title=java.net.MulticastSocket.joinGroup() reports 'socket closed' │ │ │ │ │ │ │ │ │ │ #-----environment----- │ │ │ │ │ │ │ │ │ │ #-----testresult----- │ │ │ │ │ description=file\:/build/reproducible-path/openjdk-21-21.0.13~8ea/test/jdk/java/net/MulticastSocket/B6427403.java │ │ │ │ │ -elapsed=604 0\:00\:00.604 │ │ │ │ │ -end=Thu Oct 08 18\:22\:39 UTC 2026 │ │ │ │ │ +elapsed=756 0\:00\:00.756 │ │ │ │ │ +end=Thu Oct 15 15\:31\:33 UTC 2026 │ │ │ │ │ environment=regtest │ │ │ │ │ execStatus=Failed. Execution failed\: `main' threw exception\: java.net.SocketException\: No such device (setsockopt failed) │ │ │ │ │ harnessLoaderMode=Classpath Loader │ │ │ │ │ harnessVariety=Full Bundle │ │ │ │ │ hostname=sbuild │ │ │ │ │ -javatestOS=Linux 6.12.111+deb13-arm64 (aarch64) │ │ │ │ │ +javatestOS=Linux 6.12.111+deb13-cloud-arm64 (aarch64) │ │ │ │ │ javatestVersion=6.0-ea+b26-2026-03-18-${BUILT_FROM_COMMIT} │ │ │ │ │ jtregVersion=jtreg 8.3 src 1 │ │ │ │ │ script=com.sun.javatest.regtest.exec.RegressionScript │ │ │ │ │ sections=script_messages build main │ │ │ │ │ -start=Thu Oct 08 18\:22\:39 UTC 2026 │ │ │ │ │ +start=Thu Oct 15 15\:31\:32 UTC 2026 │ │ │ │ │ test=java/net/MulticastSocket/B6427403.java │ │ │ │ │ testJDK=/build/reproducible-path/openjdk-21-21.0.13~8ea/build/bootcycle-build/images/jdk │ │ │ │ │ -testJDK_OS=[name\:Linux,arch\:aarch64,version\:6.12.111+deb13-arm64,family\:linux,simple_arch\:aarch64,simple_version\:6.12,processors\:8,maxMemory\:25155862528,maxSwap\:182536105984] │ │ │ │ │ +testJDK_OS=[name\:Linux,arch\:aarch64,version\:6.12.111+deb13-cloud-arm64,family\:linux,simple_arch\:aarch64,simple_version\:6.12,processors\:12,maxMemory\:33596653568,maxSwap\:137438949376] │ │ │ │ │ testJDK_os.arch=aarch64 │ │ │ │ │ testJDK_os.name=Linux │ │ │ │ │ -testJDK_os.version=6.12.111+deb13-arm64 │ │ │ │ │ -totalTime=610 │ │ │ │ │ +testJDK_os.version=6.12.111+deb13-cloud-arm64 │ │ │ │ │ +totalTime=764 │ │ │ │ │ user.name=sbuild │ │ │ │ │ work=/tmp/jdk/JTwork/java/net/MulticastSocket │ │ │ │ │ │ │ │ │ │ #section:script_messages │ │ │ │ │ ----------messages:(4/271)---------- │ │ │ │ │ JDK under test: /build/reproducible-path/openjdk-21-21.0.13~8ea/build/bootcycle-build/images/jdk │ │ │ │ │ openjdk version "21.0.13-ea" 2026-10-20 │ │ │ │ │ OpenJDK Runtime Environment (build 21.0.13-ea+8-1-Debian) │ │ │ │ │ OpenJDK 64-Bit Server VM (build 21.0.13-ea+8-1-Debian, mixed mode, sharing) │ │ │ │ │ │ │ │ │ │ #section:build │ │ │ │ │ ----------messages:(5/178)---------- │ │ │ │ │ command: build B6427403 │ │ │ │ │ reason: Named class compiled on demand │ │ │ │ │ -started: Thu Oct 08 18:22:39.485 UTC 2026 │ │ │ │ │ -finished: Thu Oct 08 18:22:39.506 UTC 2026 │ │ │ │ │ -elapsed time (seconds): 0.021 │ │ │ │ │ +started: Thu Oct 15 15:31:32.696 UTC 2026 │ │ │ │ │ +finished: Thu Oct 15 15:31:32.727 UTC 2026 │ │ │ │ │ +elapsed time (seconds): 0.031 │ │ │ │ │ result: Passed. All files up to date │ │ │ │ │ │ │ │ │ │ #section:main │ │ │ │ │ ----------messages:(8/234)---------- │ │ │ │ │ command: main B6427403 │ │ │ │ │ reason: User specified action: run main B6427403 │ │ │ │ │ -started: Thu Oct 08 18:22:39.509 UTC 2026 │ │ │ │ │ +started: Thu Oct 15 15:31:32.731 UTC 2026 │ │ │ │ │ Mode: agentvm │ │ │ │ │ Agent id: 1 │ │ │ │ │ -Process id: 3139455 │ │ │ │ │ -finished: Thu Oct 08 18:22:39.945 UTC 2026 │ │ │ │ │ -elapsed time (seconds): 0.436 │ │ │ │ │ +Process id: 2807240 │ │ │ │ │ +finished: Thu Oct 15 15:31:33.289 UTC 2026 │ │ │ │ │ +elapsed time (seconds): 0.558 │ │ │ │ │ ----------configuration:(15/668)---------- │ │ │ │ │ Boot Layer │ │ │ │ │ class path: /usr/share/jtreg/lib/javatest.jar │ │ │ │ │ /usr/share/jtreg/lib/jtreg.jar │ │ │ │ │ /usr/share/jtreg/lib/junit-platform-console-standalone.jar │ │ │ │ │ /usr/share/jtreg/lib/testng.jar │ │ │ │ │ /usr/share/jtreg/lib/guice.jar │ │ │ │ ├── jtreg-test-output/jdk/JTwork/java/net/MulticastSocket/NoLoopbackPackets.jtr │ │ │ │ │ @@ -1,75 +1,75 @@ │ │ │ │ │ #Test Results (version 2) │ │ │ │ │ -#Thu Oct 08 18:22:40 UTC 2026 │ │ │ │ │ +#Thu Oct 15 15:31:33 UTC 2026 │ │ │ │ │ #-----testdescription----- │ │ │ │ │ $file=/build/reproducible-path/openjdk-21-21.0.13~8ea/test/jdk/java/net/MulticastSocket/NoLoopbackPackets.java │ │ │ │ │ $root=/build/reproducible-path/openjdk-21-21.0.13~8ea/test/jdk │ │ │ │ │ keywords=bug4742177 │ │ │ │ │ library=/test/lib │ │ │ │ │ requires=os.family \!\= "windows" │ │ │ │ │ run=ASSUMED_ACTION main NoLoopbackPackets\n │ │ │ │ │ source=NoLoopbackPackets.java │ │ │ │ │ title=Re-test IPv6 (and specifically MulticastSocket) with latest Linux & USAGI code │ │ │ │ │ │ │ │ │ │ #-----environment----- │ │ │ │ │ │ │ │ │ │ #-----testresult----- │ │ │ │ │ description=file\:/build/reproducible-path/openjdk-21-21.0.13~8ea/test/jdk/java/net/MulticastSocket/NoLoopbackPackets.java │ │ │ │ │ -elapsed=104 0\:00\:00.104 │ │ │ │ │ -end=Thu Oct 08 18\:22\:40 UTC 2026 │ │ │ │ │ +elapsed=98 0\:00\:00.098 │ │ │ │ │ +end=Thu Oct 15 15\:31\:33 UTC 2026 │ │ │ │ │ environment=regtest │ │ │ │ │ execStatus=Failed. Execution failed\: `main' threw exception\: java.net.SocketException\: No such device (setsockopt failed) │ │ │ │ │ harnessLoaderMode=Classpath Loader │ │ │ │ │ harnessVariety=Full Bundle │ │ │ │ │ hostname=sbuild │ │ │ │ │ -javatestOS=Linux 6.12.111+deb13-arm64 (aarch64) │ │ │ │ │ +javatestOS=Linux 6.12.111+deb13-cloud-arm64 (aarch64) │ │ │ │ │ javatestVersion=6.0-ea+b26-2026-03-18-${BUILT_FROM_COMMIT} │ │ │ │ │ jtregVersion=jtreg 8.3 src 1 │ │ │ │ │ script=com.sun.javatest.regtest.exec.RegressionScript │ │ │ │ │ sections=script_messages build main │ │ │ │ │ -start=Thu Oct 08 18\:22\:39 UTC 2026 │ │ │ │ │ +start=Thu Oct 15 15\:31\:33 UTC 2026 │ │ │ │ │ test=java/net/MulticastSocket/NoLoopbackPackets.java │ │ │ │ │ testJDK=/build/reproducible-path/openjdk-21-21.0.13~8ea/build/bootcycle-build/images/jdk │ │ │ │ │ -testJDK_OS=[name\:Linux,arch\:aarch64,version\:6.12.111+deb13-arm64,family\:linux,simple_arch\:aarch64,simple_version\:6.12,processors\:8,maxMemory\:25155862528,maxSwap\:182536105984] │ │ │ │ │ +testJDK_OS=[name\:Linux,arch\:aarch64,version\:6.12.111+deb13-cloud-arm64,family\:linux,simple_arch\:aarch64,simple_version\:6.12,processors\:12,maxMemory\:33596653568,maxSwap\:137438949376] │ │ │ │ │ testJDK_os.arch=aarch64 │ │ │ │ │ testJDK_os.name=Linux │ │ │ │ │ -testJDK_os.version=6.12.111+deb13-arm64 │ │ │ │ │ -totalTime=105 │ │ │ │ │ +testJDK_os.version=6.12.111+deb13-cloud-arm64 │ │ │ │ │ +totalTime=100 │ │ │ │ │ user.name=sbuild │ │ │ │ │ work=/tmp/jdk/JTwork/java/net/MulticastSocket │ │ │ │ │ │ │ │ │ │ #section:script_messages │ │ │ │ │ ----------messages:(7/481)---------- │ │ │ │ │ JDK under test: /build/reproducible-path/openjdk-21-21.0.13~8ea/build/bootcycle-build/images/jdk │ │ │ │ │ openjdk version "21.0.13-ea" 2026-10-20 │ │ │ │ │ OpenJDK Runtime Environment (build 21.0.13-ea+8-1-Debian) │ │ │ │ │ OpenJDK 64-Bit Server VM (build 21.0.13-ea+8-1-Debian, mixed mode, sharing) │ │ │ │ │ Library /test/lib; kind: packages │ │ │ │ │ source directory: /build/reproducible-path/openjdk-21-21.0.13~8ea/test/lib │ │ │ │ │ class directory: /tmp/jdk/JTwork/classes/java/net/MulticastSocket/NoLoopbackPackets.d/test/lib │ │ │ │ │ │ │ │ │ │ #section:build │ │ │ │ │ -----------messages:(5/185)---------- │ │ │ │ │ +----------messages:(5/187)---------- │ │ │ │ │ command: build NoLoopbackPackets │ │ │ │ │ reason: Named class compiled on demand │ │ │ │ │ -started: Thu Oct 08 18:22:39.959 UTC 2026 │ │ │ │ │ -finished: Thu Oct 08 18:22:39.959 UTC 2026 │ │ │ │ │ -elapsed time (seconds): 0.0 │ │ │ │ │ +started: Thu Oct 15 15:31:33.309 UTC 2026 │ │ │ │ │ +finished: Thu Oct 15 15:31:33.310 UTC 2026 │ │ │ │ │ +elapsed time (seconds): 0.001 │ │ │ │ │ result: Passed. All files up to date │ │ │ │ │ │ │ │ │ │ #section:main │ │ │ │ │ -----------messages:(8/262)---------- │ │ │ │ │ +----------messages:(8/264)---------- │ │ │ │ │ command: main NoLoopbackPackets │ │ │ │ │ reason: Assumed action based on file name: run main NoLoopbackPackets │ │ │ │ │ -started: Thu Oct 08 18:22:39.960 UTC 2026 │ │ │ │ │ +started: Thu Oct 15 15:31:33.310 UTC 2026 │ │ │ │ │ Mode: agentvm │ │ │ │ │ Agent id: 1 │ │ │ │ │ -Process id: 3139455 │ │ │ │ │ -finished: Thu Oct 08 18:22:40.060 UTC 2026 │ │ │ │ │ -elapsed time (seconds): 0.1 │ │ │ │ │ +Process id: 2807240 │ │ │ │ │ +finished: Thu Oct 15 15:31:33.401 UTC 2026 │ │ │ │ │ +elapsed time (seconds): 0.091 │ │ │ │ │ ----------configuration:(17/840)---------- │ │ │ │ │ Boot Layer │ │ │ │ │ class path: /usr/share/jtreg/lib/javatest.jar │ │ │ │ │ /usr/share/jtreg/lib/jtreg.jar │ │ │ │ │ /usr/share/jtreg/lib/junit-platform-console-standalone.jar │ │ │ │ │ /usr/share/jtreg/lib/testng.jar │ │ │ │ │ /usr/share/jtreg/lib/guice.jar │ │ │ │ │ @@ -113,15 +113,15 @@ │ │ │ │ │ -Dtest.class.path=/tmp/jdk/JTwork/classes/java/net/MulticastSocket/NoLoopbackPackets.d:/tmp/jdk/JTwork/classes/java/net/MulticastSocket/NoLoopbackPackets.d/test/lib \\ │ │ │ │ │ -Dtest.class.path.prefix=/tmp/jdk/JTwork/classes/java/net/MulticastSocket/NoLoopbackPackets.d:/build/reproducible-path/openjdk-21-21.0.13~8ea/test/jdk/java/net/MulticastSocket:/tmp/jdk/JTwork/classes/java/net/MulticastSocket/NoLoopbackPackets.d/test/lib \\ │ │ │ │ │ -classpath /tmp/jdk/JTwork/classes/java/net/MulticastSocket/NoLoopbackPackets.d:/build/reproducible-path/openjdk-21-21.0.13~8ea/test/jdk/java/net/MulticastSocket:/tmp/jdk/JTwork/classes/java/net/MulticastSocket/NoLoopbackPackets.d/test/lib:/build/reproducible-path/openjdk-21-21.0.13~8ea/test/lib:/usr/share/jtreg/lib/javatest.jar:/usr/share/jtreg/lib/jtreg.jar \\ │ │ │ │ │ NoLoopbackPackets │ │ │ │ │ ----------stdout:(0/0)---------- │ │ │ │ │ ----------stderr:(0/0)---------- │ │ │ │ │ ----------System.out:(1/32)---------- │ │ │ │ │ -joining group: /224.1.1.1:46065 │ │ │ │ │ +joining group: /224.1.1.1:42859 │ │ │ │ │ ----------System.err:(17/1050)---------- │ │ │ │ │ java.net.SocketException: No such device (setsockopt failed) │ │ │ │ │ at java.base/sun.nio.ch.Net.joinOrDrop4(Native Method) │ │ │ │ │ at java.base/sun.nio.ch.Net.join4(Net.java:720) │ │ │ │ │ at java.base/sun.nio.ch.DatagramChannelImpl.innerJoin(DatagramChannelImpl.java:1676) │ │ │ │ │ at java.base/sun.nio.ch.DatagramChannelImpl.join(DatagramChannelImpl.java:1694) │ │ │ │ │ at java.base/sun.nio.ch.DatagramSocketAdaptor.joinGroup(DatagramSocketAdaptor.java:494) │ │ │ │ ├── jtreg-test-output/jdk/JTwork/java/net/MulticastSocket/Promiscuous.jtr │ │ │ │ │ @@ -1,42 +1,42 @@ │ │ │ │ │ #Test Results (version 2) │ │ │ │ │ -#Thu Oct 08 18:22:40 UTC 2026 │ │ │ │ │ +#Thu Oct 15 15:31:33 UTC 2026 │ │ │ │ │ #-----testdescription----- │ │ │ │ │ $file=/build/reproducible-path/openjdk-21-21.0.13~8ea/test/jdk/java/net/MulticastSocket/Promiscuous.java │ │ │ │ │ $root=/build/reproducible-path/openjdk-21-21.0.13~8ea/test/jdk │ │ │ │ │ keywords=bug8014499 bug8219804 othervm │ │ │ │ │ library=/test/lib │ │ │ │ │ run=USER_SPECIFIED main Promiscuous\nUSER_SPECIFIED main/othervm -Djava.net.preferIPv4Stack\=true Promiscuous\n │ │ │ │ │ source=Promiscuous.java │ │ │ │ │ title=Test for interference when two sockets are bound to the same port but joined to different multicast groups │ │ │ │ │ │ │ │ │ │ #-----environment----- │ │ │ │ │ │ │ │ │ │ #-----testresult----- │ │ │ │ │ description=file\:/build/reproducible-path/openjdk-21-21.0.13~8ea/test/jdk/java/net/MulticastSocket/Promiscuous.java │ │ │ │ │ -elapsed=93 0\:00\:00.093 │ │ │ │ │ -end=Thu Oct 08 18\:22\:40 UTC 2026 │ │ │ │ │ +elapsed=133 0\:00\:00.133 │ │ │ │ │ +end=Thu Oct 15 15\:31\:33 UTC 2026 │ │ │ │ │ environment=regtest │ │ │ │ │ execStatus=Failed. Execution failed\: `main' threw exception\: java.net.SocketException\: Network is unreachable │ │ │ │ │ harnessLoaderMode=Classpath Loader │ │ │ │ │ harnessVariety=Full Bundle │ │ │ │ │ hostname=sbuild │ │ │ │ │ -javatestOS=Linux 6.12.111+deb13-arm64 (aarch64) │ │ │ │ │ +javatestOS=Linux 6.12.111+deb13-cloud-arm64 (aarch64) │ │ │ │ │ javatestVersion=6.0-ea+b26-2026-03-18-${BUILT_FROM_COMMIT} │ │ │ │ │ jtregVersion=jtreg 8.3 src 1 │ │ │ │ │ script=com.sun.javatest.regtest.exec.RegressionScript │ │ │ │ │ sections=script_messages build main │ │ │ │ │ -start=Thu Oct 08 18\:22\:40 UTC 2026 │ │ │ │ │ +start=Thu Oct 15 15\:31\:33 UTC 2026 │ │ │ │ │ test=java/net/MulticastSocket/Promiscuous.java │ │ │ │ │ testJDK=/build/reproducible-path/openjdk-21-21.0.13~8ea/build/bootcycle-build/images/jdk │ │ │ │ │ -testJDK_OS=[name\:Linux,arch\:aarch64,version\:6.12.111+deb13-arm64,family\:linux,simple_arch\:aarch64,simple_version\:6.12,processors\:8,maxMemory\:25155862528,maxSwap\:182536105984] │ │ │ │ │ +testJDK_OS=[name\:Linux,arch\:aarch64,version\:6.12.111+deb13-cloud-arm64,family\:linux,simple_arch\:aarch64,simple_version\:6.12,processors\:12,maxMemory\:33596653568,maxSwap\:137438949376] │ │ │ │ │ testJDK_os.arch=aarch64 │ │ │ │ │ testJDK_os.name=Linux │ │ │ │ │ -testJDK_os.version=6.12.111+deb13-arm64 │ │ │ │ │ -totalTime=95 │ │ │ │ │ +testJDK_os.version=6.12.111+deb13-cloud-arm64 │ │ │ │ │ +totalTime=135 │ │ │ │ │ user.name=sbuild │ │ │ │ │ work=/tmp/jdk/JTwork/java/net/MulticastSocket │ │ │ │ │ │ │ │ │ │ #section:script_messages │ │ │ │ │ ----------messages:(7/475)---------- │ │ │ │ │ JDK under test: /build/reproducible-path/openjdk-21-21.0.13~8ea/build/bootcycle-build/images/jdk │ │ │ │ │ openjdk version "21.0.13-ea" 2026-10-20 │ │ │ │ │ @@ -46,29 +46,29 @@ │ │ │ │ │ source directory: /build/reproducible-path/openjdk-21-21.0.13~8ea/test/lib │ │ │ │ │ class directory: /tmp/jdk/JTwork/classes/java/net/MulticastSocket/Promiscuous.d/test/lib │ │ │ │ │ │ │ │ │ │ #section:build │ │ │ │ │ ----------messages:(5/181)---------- │ │ │ │ │ command: build Promiscuous │ │ │ │ │ reason: Named class compiled on demand │ │ │ │ │ -started: Thu Oct 08 18:22:40.070 UTC 2026 │ │ │ │ │ -finished: Thu Oct 08 18:22:40.071 UTC 2026 │ │ │ │ │ +started: Thu Oct 15 15:31:33.413 UTC 2026 │ │ │ │ │ +finished: Thu Oct 15 15:31:33.414 UTC 2026 │ │ │ │ │ elapsed time (seconds): 0.001 │ │ │ │ │ result: Passed. All files up to date │ │ │ │ │ │ │ │ │ │ #section:main │ │ │ │ │ ----------messages:(8/240)---------- │ │ │ │ │ command: main Promiscuous │ │ │ │ │ reason: User specified action: run main Promiscuous │ │ │ │ │ -started: Thu Oct 08 18:22:40.071 UTC 2026 │ │ │ │ │ +started: Thu Oct 15 15:31:33.414 UTC 2026 │ │ │ │ │ Mode: agentvm │ │ │ │ │ Agent id: 1 │ │ │ │ │ -Process id: 3139455 │ │ │ │ │ -finished: Thu Oct 08 18:22:40.160 UTC 2026 │ │ │ │ │ -elapsed time (seconds): 0.089 │ │ │ │ │ +Process id: 2807240 │ │ │ │ │ +finished: Thu Oct 15 15:31:33.542 UTC 2026 │ │ │ │ │ +elapsed time (seconds): 0.128 │ │ │ │ │ ----------configuration:(17/828)---------- │ │ │ │ │ Boot Layer │ │ │ │ │ class path: /usr/share/jtreg/lib/javatest.jar │ │ │ │ │ /usr/share/jtreg/lib/jtreg.jar │ │ │ │ │ /usr/share/jtreg/lib/junit-platform-console-standalone.jar │ │ │ │ │ /usr/share/jtreg/lib/testng.jar │ │ │ │ │ /usr/share/jtreg/lib/guice.jar │ │ │ │ │ @@ -112,16 +112,16 @@ │ │ │ │ │ -Dtest.class.path=/tmp/jdk/JTwork/classes/java/net/MulticastSocket/Promiscuous.d:/tmp/jdk/JTwork/classes/java/net/MulticastSocket/Promiscuous.d/test/lib \\ │ │ │ │ │ -Dtest.class.path.prefix=/tmp/jdk/JTwork/classes/java/net/MulticastSocket/Promiscuous.d:/build/reproducible-path/openjdk-21-21.0.13~8ea/test/jdk/java/net/MulticastSocket:/tmp/jdk/JTwork/classes/java/net/MulticastSocket/Promiscuous.d/test/lib \\ │ │ │ │ │ -classpath /tmp/jdk/JTwork/classes/java/net/MulticastSocket/Promiscuous.d:/build/reproducible-path/openjdk-21-21.0.13~8ea/test/jdk/java/net/MulticastSocket:/tmp/jdk/JTwork/classes/java/net/MulticastSocket/Promiscuous.d/test/lib:/build/reproducible-path/openjdk-21-21.0.13~8ea/test/lib:/usr/share/jtreg/lib/javatest.jar:/usr/share/jtreg/lib/jtreg.jar \\ │ │ │ │ │ Promiscuous │ │ │ │ │ ----------stdout:(0/0)---------- │ │ │ │ │ ----------stderr:(0/0)---------- │ │ │ │ │ ----------System.out:(2/58)---------- │ │ │ │ │ -Using port: 45448 │ │ │ │ │ -Sending datagram to: /224.1.1.120/45448 │ │ │ │ │ +Using port: 37832 │ │ │ │ │ +Sending datagram to: /224.1.1.120/37832 │ │ │ │ │ ----------System.err:(18/1123)---------- │ │ │ │ │ java.net.SocketException: Network is unreachable │ │ │ │ │ at java.base/sun.nio.ch.DatagramChannelImpl.send0(Native Method) │ │ │ │ │ at java.base/sun.nio.ch.DatagramChannelImpl.sendFromNativeBuffer(DatagramChannelImpl.java:1005) │ │ │ │ │ at java.base/sun.nio.ch.DatagramChannelImpl.send(DatagramChannelImpl.java:966) │ │ │ │ │ at java.base/sun.nio.ch.DatagramChannelImpl.send(DatagramChannelImpl.java:889) │ │ │ │ │ at java.base/sun.nio.ch.DatagramChannelImpl.blockingSend(DatagramChannelImpl.java:952) │ │ │ │ ├── jtreg-test-output/jdk/JTwork/java/net/MulticastSocket/SetLoopbackMode.jtr │ │ │ │ │ @@ -1,44 +1,44 @@ │ │ │ │ │ #Test Results (version 2) │ │ │ │ │ -#Thu Oct 08 18:22:40 UTC 2026 │ │ │ │ │ +#Thu Oct 15 15:31:33 UTC 2026 │ │ │ │ │ #-----testdescription----- │ │ │ │ │ $file=/build/reproducible-path/openjdk-21-21.0.13~8ea/test/jdk/java/net/MulticastSocket/SetLoopbackMode.java │ │ │ │ │ $root=/build/reproducible-path/openjdk-21-21.0.13~8ea/test/jdk │ │ │ │ │ keywords=bug4686717 othervm │ │ │ │ │ library=/test/lib │ │ │ │ │ modules=java.base/java.net\:+open │ │ │ │ │ run=USER_SPECIFIED build jdk.test.lib.NetworkConfiguration jdk.test.lib.Platform\nUSER_SPECIFIED main/othervm SetLoopbackMode\n │ │ │ │ │ source=SetLoopbackMode.java │ │ │ │ │ title=Test MulticastSocket.setLoopbackMode │ │ │ │ │ │ │ │ │ │ #-----environment----- │ │ │ │ │ │ │ │ │ │ #-----testresult----- │ │ │ │ │ description=file\:/build/reproducible-path/openjdk-21-21.0.13~8ea/test/jdk/java/net/MulticastSocket/SetLoopbackMode.java │ │ │ │ │ -elapsed=239 0\:00\:00.239 │ │ │ │ │ -end=Thu Oct 08 18\:22\:40 UTC 2026 │ │ │ │ │ +elapsed=272 0\:00\:00.272 │ │ │ │ │ +end=Thu Oct 15 15\:31\:33 UTC 2026 │ │ │ │ │ environment=regtest │ │ │ │ │ execStatus=Failed. Execution failed\: `main' threw exception\: java.net.SocketException\: No such device (setsockopt failed) │ │ │ │ │ harnessLoaderMode=Classpath Loader │ │ │ │ │ harnessVariety=Full Bundle │ │ │ │ │ hostname=sbuild │ │ │ │ │ -javatestOS=Linux 6.12.111+deb13-arm64 (aarch64) │ │ │ │ │ +javatestOS=Linux 6.12.111+deb13-cloud-arm64 (aarch64) │ │ │ │ │ javatestVersion=6.0-ea+b26-2026-03-18-${BUILT_FROM_COMMIT} │ │ │ │ │ jtregVersion=jtreg 8.3 src 1 │ │ │ │ │ modules=java.base/java.net\:+open │ │ │ │ │ script=com.sun.javatest.regtest.exec.RegressionScript │ │ │ │ │ sections=script_messages build build main │ │ │ │ │ -start=Thu Oct 08 18\:22\:40 UTC 2026 │ │ │ │ │ +start=Thu Oct 15 15\:31\:33 UTC 2026 │ │ │ │ │ test=java/net/MulticastSocket/SetLoopbackMode.java │ │ │ │ │ testJDK=/build/reproducible-path/openjdk-21-21.0.13~8ea/build/bootcycle-build/images/jdk │ │ │ │ │ -testJDK_OS=[name\:Linux,arch\:aarch64,version\:6.12.111+deb13-arm64,family\:linux,simple_arch\:aarch64,simple_version\:6.12,processors\:8,maxMemory\:25155862528,maxSwap\:182536105984] │ │ │ │ │ +testJDK_OS=[name\:Linux,arch\:aarch64,version\:6.12.111+deb13-cloud-arm64,family\:linux,simple_arch\:aarch64,simple_version\:6.12,processors\:12,maxMemory\:33596653568,maxSwap\:137438949376] │ │ │ │ │ testJDK_os.arch=aarch64 │ │ │ │ │ testJDK_os.name=Linux │ │ │ │ │ -testJDK_os.version=6.12.111+deb13-arm64 │ │ │ │ │ -totalTime=241 │ │ │ │ │ +testJDK_os.version=6.12.111+deb13-cloud-arm64 │ │ │ │ │ +totalTime=275 │ │ │ │ │ user.name=sbuild │ │ │ │ │ work=/tmp/jdk/JTwork/java/net/MulticastSocket │ │ │ │ │ │ │ │ │ │ #section:script_messages │ │ │ │ │ ----------messages:(7/479)---------- │ │ │ │ │ JDK under test: /build/reproducible-path/openjdk-21-21.0.13~8ea/build/bootcycle-build/images/jdk │ │ │ │ │ openjdk version "21.0.13-ea" 2026-10-20 │ │ │ │ │ @@ -48,38 +48,38 @@ │ │ │ │ │ source directory: /build/reproducible-path/openjdk-21-21.0.13~8ea/test/lib │ │ │ │ │ class directory: /tmp/jdk/JTwork/classes/java/net/MulticastSocket/SetLoopbackMode.d/test/lib │ │ │ │ │ │ │ │ │ │ #section:build │ │ │ │ │ ----------messages:(5/284)---------- │ │ │ │ │ command: build jdk.test.lib.NetworkConfiguration jdk.test.lib.Platform │ │ │ │ │ reason: User specified action: run build jdk.test.lib.NetworkConfiguration jdk.test.lib.Platform │ │ │ │ │ -started: Thu Oct 08 18:22:40.171 UTC 2026 │ │ │ │ │ -finished: Thu Oct 08 18:22:40.172 UTC 2026 │ │ │ │ │ +started: Thu Oct 15 15:31:33.554 UTC 2026 │ │ │ │ │ +finished: Thu Oct 15 15:31:33.555 UTC 2026 │ │ │ │ │ elapsed time (seconds): 0.001 │ │ │ │ │ result: Passed. All files up to date │ │ │ │ │ │ │ │ │ │ #section:build │ │ │ │ │ ----------messages:(5/183)---------- │ │ │ │ │ command: build SetLoopbackMode │ │ │ │ │ reason: Named class compiled on demand │ │ │ │ │ -started: Thu Oct 08 18:22:40.173 UTC 2026 │ │ │ │ │ -finished: Thu Oct 08 18:22:40.173 UTC 2026 │ │ │ │ │ +started: Thu Oct 15 15:31:33.555 UTC 2026 │ │ │ │ │ +finished: Thu Oct 15 15:31:33.555 UTC 2026 │ │ │ │ │ elapsed time (seconds): 0.0 │ │ │ │ │ result: Passed. All files up to date │ │ │ │ │ │ │ │ │ │ #section:main │ │ │ │ │ ----------messages:(8/411)---------- │ │ │ │ │ command: main SetLoopbackMode │ │ │ │ │ reason: User specified action: run main/othervm SetLoopbackMode │ │ │ │ │ -started: Thu Oct 08 18:22:40.173 UTC 2026 │ │ │ │ │ +started: Thu Oct 15 15:31:33.556 UTC 2026 │ │ │ │ │ Mode: othervm [/othervm specified] │ │ │ │ │ Additional options from @modules: --add-modules java.base --add-exports java.base/java.net=ALL-UNNAMED --add-opens java.base/java.net=ALL-UNNAMED │ │ │ │ │ -Process id: 3139483 │ │ │ │ │ -finished: Thu Oct 08 18:22:40.406 UTC 2026 │ │ │ │ │ -elapsed time (seconds): 0.233 │ │ │ │ │ +Process id: 2807267 │ │ │ │ │ +finished: Thu Oct 15 15:31:33.821 UTC 2026 │ │ │ │ │ +elapsed time (seconds): 0.265 │ │ │ │ │ ----------configuration:(5/139)---------- │ │ │ │ │ Boot Layer │ │ │ │ │ add modules: java.base │ │ │ │ │ add exports: java.base/java.net ALL-UNNAMED │ │ │ │ │ add opens: java.base/java.net ALL-UNNAMED │ │ │ │ │ │ │ │ │ │ ----------System.out:(5/155)---------- │ │ │ │ ├── jtreg-test-output/jdk/JTwork/java/net/MulticastSocket/SetLoopbackModeIPv4.jtr │ │ │ │ │ @@ -1,44 +1,44 @@ │ │ │ │ │ #Test Results (version 2) │ │ │ │ │ -#Thu Oct 08 18:22:40 UTC 2026 │ │ │ │ │ +#Thu Oct 15 15:31:34 UTC 2026 │ │ │ │ │ #-----testdescription----- │ │ │ │ │ $file=/build/reproducible-path/openjdk-21-21.0.13~8ea/test/jdk/java/net/MulticastSocket/SetLoopbackModeIPv4.java │ │ │ │ │ $root=/build/reproducible-path/openjdk-21-21.0.13~8ea/test/jdk │ │ │ │ │ keywords=bug4686717 bug8241786 othervm │ │ │ │ │ library=/test/lib │ │ │ │ │ modules=java.base/java.net\:+open │ │ │ │ │ run=USER_SPECIFIED build jdk.test.lib.NetworkConfiguration jdk.test.lib.Platform SetLoopbackMode SetLoopbackModeIPv4\nUSER_SPECIFIED main/othervm -Djava.net.preferIPv4Stack\=true SetLoopbackModeIPv4\n │ │ │ │ │ source=SetLoopbackModeIPv4.java │ │ │ │ │ title=Test MulticastSocket.setLoopbackMode with IPv4 addresses │ │ │ │ │ │ │ │ │ │ #-----environment----- │ │ │ │ │ │ │ │ │ │ #-----testresult----- │ │ │ │ │ description=file\:/build/reproducible-path/openjdk-21-21.0.13~8ea/test/jdk/java/net/MulticastSocket/SetLoopbackModeIPv4.java │ │ │ │ │ -elapsed=222 0\:00\:00.222 │ │ │ │ │ -end=Thu Oct 08 18\:22\:40 UTC 2026 │ │ │ │ │ +elapsed=293 0\:00\:00.293 │ │ │ │ │ +end=Thu Oct 15 15\:31\:34 UTC 2026 │ │ │ │ │ environment=regtest │ │ │ │ │ execStatus=Failed. Execution failed\: `main' threw exception\: java.net.SocketException\: No such device (setsockopt failed) │ │ │ │ │ harnessLoaderMode=Classpath Loader │ │ │ │ │ harnessVariety=Full Bundle │ │ │ │ │ hostname=sbuild │ │ │ │ │ -javatestOS=Linux 6.12.111+deb13-arm64 (aarch64) │ │ │ │ │ +javatestOS=Linux 6.12.111+deb13-cloud-arm64 (aarch64) │ │ │ │ │ javatestVersion=6.0-ea+b26-2026-03-18-${BUILT_FROM_COMMIT} │ │ │ │ │ jtregVersion=jtreg 8.3 src 1 │ │ │ │ │ modules=java.base/java.net\:+open │ │ │ │ │ script=com.sun.javatest.regtest.exec.RegressionScript │ │ │ │ │ sections=script_messages build build main │ │ │ │ │ -start=Thu Oct 08 18\:22\:40 UTC 2026 │ │ │ │ │ +start=Thu Oct 15 15\:31\:33 UTC 2026 │ │ │ │ │ test=java/net/MulticastSocket/SetLoopbackModeIPv4.java │ │ │ │ │ testJDK=/build/reproducible-path/openjdk-21-21.0.13~8ea/build/bootcycle-build/images/jdk │ │ │ │ │ -testJDK_OS=[name\:Linux,arch\:aarch64,version\:6.12.111+deb13-arm64,family\:linux,simple_arch\:aarch64,simple_version\:6.12,processors\:8,maxMemory\:25155862528,maxSwap\:182536105984] │ │ │ │ │ +testJDK_OS=[name\:Linux,arch\:aarch64,version\:6.12.111+deb13-cloud-arm64,family\:linux,simple_arch\:aarch64,simple_version\:6.12,processors\:12,maxMemory\:33596653568,maxSwap\:137438949376] │ │ │ │ │ testJDK_os.arch=aarch64 │ │ │ │ │ testJDK_os.name=Linux │ │ │ │ │ -testJDK_os.version=6.12.111+deb13-arm64 │ │ │ │ │ -totalTime=223 │ │ │ │ │ +testJDK_os.version=6.12.111+deb13-cloud-arm64 │ │ │ │ │ +totalTime=295 │ │ │ │ │ user.name=sbuild │ │ │ │ │ work=/tmp/jdk/JTwork/java/net/MulticastSocket │ │ │ │ │ │ │ │ │ │ #section:script_messages │ │ │ │ │ ----------messages:(7/483)---------- │ │ │ │ │ JDK under test: /build/reproducible-path/openjdk-21-21.0.13~8ea/build/bootcycle-build/images/jdk │ │ │ │ │ openjdk version "21.0.13-ea" 2026-10-20 │ │ │ │ │ @@ -48,38 +48,38 @@ │ │ │ │ │ source directory: /build/reproducible-path/openjdk-21-21.0.13~8ea/test/lib │ │ │ │ │ class directory: /tmp/jdk/JTwork/classes/java/net/MulticastSocket/SetLoopbackModeIPv4.d/test/lib │ │ │ │ │ │ │ │ │ │ #section:build │ │ │ │ │ ----------messages:(5/356)---------- │ │ │ │ │ command: build jdk.test.lib.NetworkConfiguration jdk.test.lib.Platform SetLoopbackMode SetLoopbackModeIPv4 │ │ │ │ │ reason: User specified action: run build jdk.test.lib.NetworkConfiguration jdk.test.lib.Platform SetLoopbackMode SetLoopbackModeIPv4 │ │ │ │ │ -started: Thu Oct 08 18:22:40.416 UTC 2026 │ │ │ │ │ -finished: Thu Oct 08 18:22:40.418 UTC 2026 │ │ │ │ │ -elapsed time (seconds): 0.002 │ │ │ │ │ +started: Thu Oct 15 15:31:33.833 UTC 2026 │ │ │ │ │ +finished: Thu Oct 15 15:31:33.834 UTC 2026 │ │ │ │ │ +elapsed time (seconds): 0.001 │ │ │ │ │ result: Passed. All files up to date │ │ │ │ │ │ │ │ │ │ #section:build │ │ │ │ │ ----------messages:(5/187)---------- │ │ │ │ │ command: build SetLoopbackModeIPv4 │ │ │ │ │ reason: Named class compiled on demand │ │ │ │ │ -started: Thu Oct 08 18:22:40.418 UTC 2026 │ │ │ │ │ -finished: Thu Oct 08 18:22:40.418 UTC 2026 │ │ │ │ │ +started: Thu Oct 15 15:31:33.834 UTC 2026 │ │ │ │ │ +finished: Thu Oct 15 15:31:33.834 UTC 2026 │ │ │ │ │ elapsed time (seconds): 0.0 │ │ │ │ │ result: Passed. All files up to date │ │ │ │ │ │ │ │ │ │ #section:main │ │ │ │ │ ----------messages:(8/483)---------- │ │ │ │ │ command: main -Djava.net.preferIPv4Stack=true SetLoopbackModeIPv4 │ │ │ │ │ reason: User specified action: run main/othervm -Djava.net.preferIPv4Stack=true SetLoopbackModeIPv4 │ │ │ │ │ -started: Thu Oct 08 18:22:40.419 UTC 2026 │ │ │ │ │ +started: Thu Oct 15 15:31:33.835 UTC 2026 │ │ │ │ │ Mode: othervm [/othervm specified] │ │ │ │ │ Additional options from @modules: --add-modules java.base --add-exports java.base/java.net=ALL-UNNAMED --add-opens java.base/java.net=ALL-UNNAMED │ │ │ │ │ -Process id: 3139505 │ │ │ │ │ -finished: Thu Oct 08 18:22:40.634 UTC 2026 │ │ │ │ │ -elapsed time (seconds): 0.215 │ │ │ │ │ +Process id: 2807290 │ │ │ │ │ +finished: Thu Oct 15 15:31:34.122 UTC 2026 │ │ │ │ │ +elapsed time (seconds): 0.287 │ │ │ │ │ ----------configuration:(5/139)---------- │ │ │ │ │ Boot Layer │ │ │ │ │ add modules: java.base │ │ │ │ │ add exports: java.base/java.net ALL-UNNAMED │ │ │ │ │ add opens: java.base/java.net ALL-UNNAMED │ │ │ │ │ │ │ │ │ │ ----------System.out:(5/155)---------- │ │ │ │ ├── jtreg-test-output/jdk/JTwork/java/net/MulticastSocket/Test.jtr │ │ │ │ │ @@ -1,42 +1,42 @@ │ │ │ │ │ #Test Results (version 2) │ │ │ │ │ -#Thu Oct 08 18:22:40 UTC 2026 │ │ │ │ │ +#Thu Oct 15 15:31:34 UTC 2026 │ │ │ │ │ #-----testdescription----- │ │ │ │ │ $file=/build/reproducible-path/openjdk-21-21.0.13~8ea/test/jdk/java/net/MulticastSocket/Test.java │ │ │ │ │ $root=/build/reproducible-path/openjdk-21-21.0.13~8ea/test/jdk │ │ │ │ │ keywords=bug4488458 othervm │ │ │ │ │ library=/test/lib │ │ │ │ │ run=USER_SPECIFIED build jdk.test.lib.NetworkConfiguration jdk.test.lib.Platform\nUSER_SPECIFIED main Test\nUSER_SPECIFIED main/othervm -Djava.net.preferIPv4Stack\=true Test\n │ │ │ │ │ source=Test.java │ │ │ │ │ title=IPv4 and IPv6 multicasting broken on Linux │ │ │ │ │ │ │ │ │ │ #-----environment----- │ │ │ │ │ │ │ │ │ │ #-----testresult----- │ │ │ │ │ description=file\:/build/reproducible-path/openjdk-21-21.0.13~8ea/test/jdk/java/net/MulticastSocket/Test.java │ │ │ │ │ -elapsed=96 0\:00\:00.096 │ │ │ │ │ -end=Thu Oct 08 18\:22\:40 UTC 2026 │ │ │ │ │ +elapsed=105 0\:00\:00.105 │ │ │ │ │ +end=Thu Oct 15 15\:31\:34 UTC 2026 │ │ │ │ │ environment=regtest │ │ │ │ │ execStatus=Failed. Execution failed\: `main' threw exception\: java.lang.Exception\: Test failed - see log file for details │ │ │ │ │ harnessLoaderMode=Classpath Loader │ │ │ │ │ harnessVariety=Full Bundle │ │ │ │ │ hostname=sbuild │ │ │ │ │ -javatestOS=Linux 6.12.111+deb13-arm64 (aarch64) │ │ │ │ │ +javatestOS=Linux 6.12.111+deb13-cloud-arm64 (aarch64) │ │ │ │ │ javatestVersion=6.0-ea+b26-2026-03-18-${BUILT_FROM_COMMIT} │ │ │ │ │ jtregVersion=jtreg 8.3 src 1 │ │ │ │ │ script=com.sun.javatest.regtest.exec.RegressionScript │ │ │ │ │ sections=script_messages build build main │ │ │ │ │ -start=Thu Oct 08 18\:22\:40 UTC 2026 │ │ │ │ │ +start=Thu Oct 15 15\:31\:34 UTC 2026 │ │ │ │ │ test=java/net/MulticastSocket/Test.java │ │ │ │ │ testJDK=/build/reproducible-path/openjdk-21-21.0.13~8ea/build/bootcycle-build/images/jdk │ │ │ │ │ -testJDK_OS=[name\:Linux,arch\:aarch64,version\:6.12.111+deb13-arm64,family\:linux,simple_arch\:aarch64,simple_version\:6.12,processors\:8,maxMemory\:25155862528,maxSwap\:182536105984] │ │ │ │ │ +testJDK_OS=[name\:Linux,arch\:aarch64,version\:6.12.111+deb13-cloud-arm64,family\:linux,simple_arch\:aarch64,simple_version\:6.12,processors\:12,maxMemory\:33596653568,maxSwap\:137438949376] │ │ │ │ │ testJDK_os.arch=aarch64 │ │ │ │ │ testJDK_os.name=Linux │ │ │ │ │ -testJDK_os.version=6.12.111+deb13-arm64 │ │ │ │ │ -totalTime=97 │ │ │ │ │ +testJDK_os.version=6.12.111+deb13-cloud-arm64 │ │ │ │ │ +totalTime=108 │ │ │ │ │ user.name=sbuild │ │ │ │ │ work=/tmp/jdk/JTwork/java/net/MulticastSocket │ │ │ │ │ │ │ │ │ │ #section:script_messages │ │ │ │ │ ----------messages:(7/468)---------- │ │ │ │ │ JDK under test: /build/reproducible-path/openjdk-21-21.0.13~8ea/build/bootcycle-build/images/jdk │ │ │ │ │ openjdk version "21.0.13-ea" 2026-10-20 │ │ │ │ │ @@ -46,38 +46,38 @@ │ │ │ │ │ source directory: /build/reproducible-path/openjdk-21-21.0.13~8ea/test/lib │ │ │ │ │ class directory: /tmp/jdk/JTwork/classes/java/net/MulticastSocket/Test.d/test/lib │ │ │ │ │ │ │ │ │ │ #section:build │ │ │ │ │ ----------messages:(5/284)---------- │ │ │ │ │ command: build jdk.test.lib.NetworkConfiguration jdk.test.lib.Platform │ │ │ │ │ reason: User specified action: run build jdk.test.lib.NetworkConfiguration jdk.test.lib.Platform │ │ │ │ │ -started: Thu Oct 08 18:22:40.644 UTC 2026 │ │ │ │ │ -finished: Thu Oct 08 18:22:40.645 UTC 2026 │ │ │ │ │ +started: Thu Oct 15 15:31:34.133 UTC 2026 │ │ │ │ │ +finished: Thu Oct 15 15:31:34.134 UTC 2026 │ │ │ │ │ elapsed time (seconds): 0.001 │ │ │ │ │ result: Passed. All files up to date │ │ │ │ │ │ │ │ │ │ #section:build │ │ │ │ │ ----------messages:(5/172)---------- │ │ │ │ │ command: build Test │ │ │ │ │ reason: Named class compiled on demand │ │ │ │ │ -started: Thu Oct 08 18:22:40.645 UTC 2026 │ │ │ │ │ -finished: Thu Oct 08 18:22:40.645 UTC 2026 │ │ │ │ │ +started: Thu Oct 15 15:31:34.134 UTC 2026 │ │ │ │ │ +finished: Thu Oct 15 15:31:34.134 UTC 2026 │ │ │ │ │ elapsed time (seconds): 0.0 │ │ │ │ │ result: Passed. All files up to date │ │ │ │ │ │ │ │ │ │ #section:main │ │ │ │ │ ----------messages:(8/226)---------- │ │ │ │ │ command: main Test │ │ │ │ │ reason: User specified action: run main Test │ │ │ │ │ -started: Thu Oct 08 18:22:40.646 UTC 2026 │ │ │ │ │ +started: Thu Oct 15 15:31:34.135 UTC 2026 │ │ │ │ │ Mode: agentvm │ │ │ │ │ Agent id: 1 │ │ │ │ │ -Process id: 3139455 │ │ │ │ │ -finished: Thu Oct 08 18:22:40.735 UTC 2026 │ │ │ │ │ -elapsed time (seconds): 0.089 │ │ │ │ │ +Process id: 2807240 │ │ │ │ │ +finished: Thu Oct 15 15:31:34.234 UTC 2026 │ │ │ │ │ +elapsed time (seconds): 0.099 │ │ │ │ │ ----------configuration:(17/814)---------- │ │ │ │ │ Boot Layer │ │ │ │ │ class path: /usr/share/jtreg/lib/javatest.jar │ │ │ │ │ /usr/share/jtreg/lib/jtreg.jar │ │ │ │ │ /usr/share/jtreg/lib/junit-platform-console-standalone.jar │ │ │ │ │ /usr/share/jtreg/lib/testng.jar │ │ │ │ │ /usr/share/jtreg/lib/guice.jar │ │ │ │ ├── jtreg-test-output/jdk/JTwork/java/net/SocketOption/OptionsTest.jtr │ │ │ │ │ @@ -1,74 +1,74 @@ │ │ │ │ │ #Test Results (version 2) │ │ │ │ │ -#Thu Oct 08 18:22:41 UTC 2026 │ │ │ │ │ +#Thu Oct 15 15:31:34 UTC 2026 │ │ │ │ │ #-----testdescription----- │ │ │ │ │ $file=/build/reproducible-path/openjdk-21-21.0.13~8ea/test/jdk/java/net/SocketOption/OptionsTest.java │ │ │ │ │ $root=/build/reproducible-path/openjdk-21-21.0.13~8ea/test/jdk │ │ │ │ │ keywords=bug8036979 bug8072384 bug8044773 bug8225214 bug8233296 bug8234083 othervm │ │ │ │ │ library=/test/lib │ │ │ │ │ requires=\!vm.graal.enabled │ │ │ │ │ run=USER_SPECIFIED main/othervm -Xcheck\:jni OptionsTest\nUSER_SPECIFIED main/othervm -Xcheck\:jni -Djava.net.preferIPv4Stack\=true OptionsTest\nUSER_SPECIFIED main/othervm --limit-modules\=java.base OptionsTest\nUSER_SPECIFIED main/othervm/policy\=options.policy OptionsTest\n │ │ │ │ │ source=OptionsTest.java │ │ │ │ │ title=\ │ │ │ │ │ │ │ │ │ │ #-----environment----- │ │ │ │ │ │ │ │ │ │ #-----testresult----- │ │ │ │ │ description=file\:/build/reproducible-path/openjdk-21-21.0.13~8ea/test/jdk/java/net/SocketOption/OptionsTest.java │ │ │ │ │ -elapsed=257 0\:00\:00.257 │ │ │ │ │ -end=Thu Oct 08 18\:22\:40 UTC 2026 │ │ │ │ │ +elapsed=292 0\:00\:00.292 │ │ │ │ │ +end=Thu Oct 15 15\:31\:34 UTC 2026 │ │ │ │ │ environment=regtest │ │ │ │ │ execStatus=Failed. Execution failed\: `main' threw exception\: java.lang.IllegalArgumentException\: Invalid value 'null' │ │ │ │ │ harnessLoaderMode=Classpath Loader │ │ │ │ │ harnessVariety=Full Bundle │ │ │ │ │ hostname=sbuild │ │ │ │ │ -javatestOS=Linux 6.12.111+deb13-arm64 (aarch64) │ │ │ │ │ +javatestOS=Linux 6.12.111+deb13-cloud-arm64 (aarch64) │ │ │ │ │ javatestVersion=6.0-ea+b26-2026-03-18-${BUILT_FROM_COMMIT} │ │ │ │ │ jtregVersion=jtreg 8.3 src 1 │ │ │ │ │ script=com.sun.javatest.regtest.exec.RegressionScript │ │ │ │ │ sections=script_messages build main │ │ │ │ │ -start=Thu Oct 08 18\:22\:40 UTC 2026 │ │ │ │ │ +start=Thu Oct 15 15\:31\:34 UTC 2026 │ │ │ │ │ test=java/net/SocketOption/OptionsTest.java │ │ │ │ │ testJDK=/build/reproducible-path/openjdk-21-21.0.13~8ea/build/bootcycle-build/images/jdk │ │ │ │ │ -testJDK_OS=[name\:Linux,arch\:aarch64,version\:6.12.111+deb13-arm64,family\:linux,simple_arch\:aarch64,simple_version\:6.12,processors\:8,maxMemory\:25155862528,maxSwap\:182536105984] │ │ │ │ │ +testJDK_OS=[name\:Linux,arch\:aarch64,version\:6.12.111+deb13-cloud-arm64,family\:linux,simple_arch\:aarch64,simple_version\:6.12,processors\:12,maxMemory\:33596653568,maxSwap\:137438949376] │ │ │ │ │ testJDK_os.arch=aarch64 │ │ │ │ │ testJDK_os.name=Linux │ │ │ │ │ -testJDK_os.version=6.12.111+deb13-arm64 │ │ │ │ │ -totalTime=258 │ │ │ │ │ +testJDK_os.version=6.12.111+deb13-cloud-arm64 │ │ │ │ │ +totalTime=294 │ │ │ │ │ user.name=sbuild │ │ │ │ │ work=/tmp/jdk/JTwork/java/net/SocketOption │ │ │ │ │ │ │ │ │ │ #section:script_messages │ │ │ │ │ ----------messages:(7/472)---------- │ │ │ │ │ JDK under test: /build/reproducible-path/openjdk-21-21.0.13~8ea/build/bootcycle-build/images/jdk │ │ │ │ │ openjdk version "21.0.13-ea" 2026-10-20 │ │ │ │ │ OpenJDK Runtime Environment (build 21.0.13-ea+8-1-Debian) │ │ │ │ │ OpenJDK 64-Bit Server VM (build 21.0.13-ea+8-1-Debian, mixed mode, sharing) │ │ │ │ │ Library /test/lib; kind: packages │ │ │ │ │ source directory: /build/reproducible-path/openjdk-21-21.0.13~8ea/test/lib │ │ │ │ │ class directory: /tmp/jdk/JTwork/classes/java/net/SocketOption/OptionsTest.d/test/lib │ │ │ │ │ │ │ │ │ │ #section:build │ │ │ │ │ -----------messages:(5/179)---------- │ │ │ │ │ +----------messages:(5/181)---------- │ │ │ │ │ command: build OptionsTest │ │ │ │ │ reason: Named class compiled on demand │ │ │ │ │ -started: Thu Oct 08 18:22:40.746 UTC 2026 │ │ │ │ │ -finished: Thu Oct 08 18:22:40.746 UTC 2026 │ │ │ │ │ -elapsed time (seconds): 0.0 │ │ │ │ │ +started: Thu Oct 15 15:31:34.245 UTC 2026 │ │ │ │ │ +finished: Thu Oct 15 15:31:34.246 UTC 2026 │ │ │ │ │ +elapsed time (seconds): 0.001 │ │ │ │ │ result: Passed. All files up to date │ │ │ │ │ │ │ │ │ │ #section:main │ │ │ │ │ ----------messages:(7/281)---------- │ │ │ │ │ command: main -Xcheck:jni OptionsTest │ │ │ │ │ reason: User specified action: run main/othervm -Xcheck:jni OptionsTest │ │ │ │ │ -started: Thu Oct 08 18:22:40.746 UTC 2026 │ │ │ │ │ +started: Thu Oct 15 15:31:34.246 UTC 2026 │ │ │ │ │ Mode: othervm [/othervm specified] │ │ │ │ │ -Process id: 3139528 │ │ │ │ │ -finished: Thu Oct 08 18:22:40.998 UTC 2026 │ │ │ │ │ -elapsed time (seconds): 0.252 │ │ │ │ │ +Process id: 2807313 │ │ │ │ │ +finished: Thu Oct 15 15:31:34.533 UTC 2026 │ │ │ │ │ +elapsed time (seconds): 0.287 │ │ │ │ │ ----------configuration:(0/0)---------- │ │ │ │ │ ----------System.out:(7/201)---------- │ │ │ │ │ Testing SO_LINGER with:-1 │ │ │ │ │ Testing SO_LINGER with:-2 │ │ │ │ │ Testing SO_LINGER with:-100 │ │ │ │ │ Testing SO_LINGER with:-65534 │ │ │ │ │ Testing SO_LINGER with:-65535 │ │ │ │ ├── jtreg-test-output/jdk/JTwork/java/net/SocketPermission/SocketPermissionTest.jtr │ │ │ │ │ @@ -1,42 +1,42 @@ │ │ │ │ │ #Test Results (version 2) │ │ │ │ │ -#Thu Oct 08 18:22:42 UTC 2026 │ │ │ │ │ +#Thu Oct 15 15:31:35 UTC 2026 │ │ │ │ │ #-----testdescription----- │ │ │ │ │ $file=/build/reproducible-path/openjdk-21-21.0.13~8ea/test/jdk/java/net/SocketPermission/SocketPermissionTest.java │ │ │ │ │ $root=/build/reproducible-path/openjdk-21-21.0.13~8ea/test/jdk │ │ │ │ │ keywords=bug8047031 intermittent othervm testng │ │ │ │ │ library=/test/lib │ │ │ │ │ run=USER_SPECIFIED build jdk.test.lib.NetworkConfiguration jdk.test.lib.Platform\nUSER_SPECIFIED testng/othervm -Djava.security.manager\=allow SocketPermissionTest\n │ │ │ │ │ source=SocketPermissionTest.java │ │ │ │ │ title=SocketPermission tests for legacy socket types. │ │ │ │ │ │ │ │ │ │ #-----environment----- │ │ │ │ │ │ │ │ │ │ #-----testresult----- │ │ │ │ │ description=file\:/build/reproducible-path/openjdk-21-21.0.13~8ea/test/jdk/java/net/SocketPermission/SocketPermissionTest.java │ │ │ │ │ -elapsed=657 0\:00\:00.657 │ │ │ │ │ -end=Thu Oct 08 18\:22\:42 UTC 2026 │ │ │ │ │ +elapsed=696 0\:00\:00.696 │ │ │ │ │ +end=Thu Oct 15 15\:31\:35 UTC 2026 │ │ │ │ │ environment=regtest │ │ │ │ │ execStatus=Failed. Execution failed\: `main' threw exception\: java.lang.Exception\: config failures\: 0, test failures\: 2 │ │ │ │ │ harnessLoaderMode=Classpath Loader │ │ │ │ │ harnessVariety=Full Bundle │ │ │ │ │ hostname=sbuild │ │ │ │ │ -javatestOS=Linux 6.12.111+deb13-arm64 (aarch64) │ │ │ │ │ +javatestOS=Linux 6.12.111+deb13-cloud-arm64 (aarch64) │ │ │ │ │ javatestVersion=6.0-ea+b26-2026-03-18-${BUILT_FROM_COMMIT} │ │ │ │ │ jtregVersion=jtreg 8.3 src 1 │ │ │ │ │ script=com.sun.javatest.regtest.exec.RegressionScript │ │ │ │ │ sections=script_messages build build testng │ │ │ │ │ -start=Thu Oct 08 18\:22\:41 UTC 2026 │ │ │ │ │ +start=Thu Oct 15 15\:31\:34 UTC 2026 │ │ │ │ │ test=java/net/SocketPermission/SocketPermissionTest.java │ │ │ │ │ testJDK=/build/reproducible-path/openjdk-21-21.0.13~8ea/build/bootcycle-build/images/jdk │ │ │ │ │ -testJDK_OS=[name\:Linux,arch\:aarch64,version\:6.12.111+deb13-arm64,family\:linux,simple_arch\:aarch64,simple_version\:6.12,processors\:8,maxMemory\:25155862528,maxSwap\:182536105984] │ │ │ │ │ +testJDK_OS=[name\:Linux,arch\:aarch64,version\:6.12.111+deb13-cloud-arm64,family\:linux,simple_arch\:aarch64,simple_version\:6.12,processors\:12,maxMemory\:33596653568,maxSwap\:137438949376] │ │ │ │ │ testJDK_os.arch=aarch64 │ │ │ │ │ testJDK_os.name=Linux │ │ │ │ │ -testJDK_os.version=6.12.111+deb13-arm64 │ │ │ │ │ -totalTime=659 │ │ │ │ │ +testJDK_os.version=6.12.111+deb13-cloud-arm64 │ │ │ │ │ +totalTime=697 │ │ │ │ │ user.name=sbuild │ │ │ │ │ work=/tmp/jdk/JTwork/java/net/SocketPermission │ │ │ │ │ │ │ │ │ │ #section:script_messages │ │ │ │ │ ----------messages:(7/485)---------- │ │ │ │ │ JDK under test: /build/reproducible-path/openjdk-21-21.0.13~8ea/build/bootcycle-build/images/jdk │ │ │ │ │ openjdk version "21.0.13-ea" 2026-10-20 │ │ │ │ │ @@ -46,47 +46,47 @@ │ │ │ │ │ source directory: /build/reproducible-path/openjdk-21-21.0.13~8ea/test/lib │ │ │ │ │ class directory: /tmp/jdk/JTwork/classes/java/net/SocketPermission/SocketPermissionTest.d/test/lib │ │ │ │ │ │ │ │ │ │ #section:build │ │ │ │ │ ----------messages:(5/284)---------- │ │ │ │ │ command: build jdk.test.lib.NetworkConfiguration jdk.test.lib.Platform │ │ │ │ │ reason: User specified action: run build jdk.test.lib.NetworkConfiguration jdk.test.lib.Platform │ │ │ │ │ -started: Thu Oct 08 18:22:41.490 UTC 2026 │ │ │ │ │ -finished: Thu Oct 08 18:22:41.491 UTC 2026 │ │ │ │ │ +started: Thu Oct 15 15:31:34.771 UTC 2026 │ │ │ │ │ +finished: Thu Oct 15 15:31:34.772 UTC 2026 │ │ │ │ │ elapsed time (seconds): 0.001 │ │ │ │ │ result: Passed. All files up to date │ │ │ │ │ │ │ │ │ │ #section:build │ │ │ │ │ -----------messages:(5/188)---------- │ │ │ │ │ +----------messages:(5/190)---------- │ │ │ │ │ command: build SocketPermissionTest │ │ │ │ │ reason: Named class compiled on demand │ │ │ │ │ -started: Thu Oct 08 18:22:41.492 UTC 2026 │ │ │ │ │ -finished: Thu Oct 08 18:22:41.492 UTC 2026 │ │ │ │ │ -elapsed time (seconds): 0.0 │ │ │ │ │ +started: Thu Oct 15 15:31:34.772 UTC 2026 │ │ │ │ │ +finished: Thu Oct 15 15:31:34.773 UTC 2026 │ │ │ │ │ +elapsed time (seconds): 0.001 │ │ │ │ │ result: Passed. All files up to date │ │ │ │ │ │ │ │ │ │ #section:testng │ │ │ │ │ ----------messages:(7/339)---------- │ │ │ │ │ command: testng -Djava.security.manager=allow SocketPermissionTest │ │ │ │ │ reason: User specified action: run testng/othervm -Djava.security.manager=allow SocketPermissionTest │ │ │ │ │ -started: Thu Oct 08 18:22:41.492 UTC 2026 │ │ │ │ │ +started: Thu Oct 15 15:31:34.773 UTC 2026 │ │ │ │ │ Mode: othervm [/othervm specified] │ │ │ │ │ -Process id: 3139549 │ │ │ │ │ -finished: Thu Oct 08 18:22:42.140 UTC 2026 │ │ │ │ │ -elapsed time (seconds): 0.648 │ │ │ │ │ +Process id: 2807334 │ │ │ │ │ +finished: Thu Oct 15 15:31:35.459 UTC 2026 │ │ │ │ │ +elapsed time (seconds): 0.686 │ │ │ │ │ ----------configuration:(0/0)---------- │ │ │ │ │ ----------System.out:(97/6918)---------- │ │ │ │ │ -[18:22:41.986] config SocketPermissionTest.setupSecurityManager(): success [0ms] │ │ │ │ │ -[18:22:42.018] test SocketPermissionTest.acceptServerSocketTest(): success [25ms] │ │ │ │ │ -[18:22:42.019] config SocketPermissionTest.setupSecurityManager(): success [0ms] │ │ │ │ │ -[18:22:42.034] test SocketPermissionTest.connectDatagramSocketTest(): success [14ms] │ │ │ │ │ -[18:22:42.035] config SocketPermissionTest.setupSecurityManager(): success [0ms] │ │ │ │ │ -[18:22:42.037] test SocketPermissionTest.connectSocketTest(): success [1ms] │ │ │ │ │ -[18:22:42.038] config SocketPermissionTest.setupSecurityManager(): success [0ms] │ │ │ │ │ -[18:22:42.047] test SocketPermissionTest.joinGroupMulticastTest(): failure [10ms] │ │ │ │ │ +[15:31:35.291] config SocketPermissionTest.setupSecurityManager(): success [0ms] │ │ │ │ │ +[15:31:35.323] test SocketPermissionTest.acceptServerSocketTest(): success [26ms] │ │ │ │ │ +[15:31:35.325] config SocketPermissionTest.setupSecurityManager(): success [0ms] │ │ │ │ │ +[15:31:35.339] test SocketPermissionTest.connectDatagramSocketTest(): success [14ms] │ │ │ │ │ +[15:31:35.340] config SocketPermissionTest.setupSecurityManager(): success [0ms] │ │ │ │ │ +[15:31:35.343] test SocketPermissionTest.connectSocketTest(): success [2ms] │ │ │ │ │ +[15:31:35.344] config SocketPermissionTest.setupSecurityManager(): success [0ms] │ │ │ │ │ +[15:31:35.353] test SocketPermissionTest.joinGroupMulticastTest(): failure [10ms] │ │ │ │ │ java.util.NoSuchElementException: No value present │ │ │ │ │ at java.base/java.util.Optional.get(Optional.java:143) │ │ │ │ │ at SocketPermissionTest.joinGroupMulticastTest(SocketPermissionTest.java:227) │ │ │ │ │ at java.base/jdk.internal.reflect.DirectMethodHandleAccessor.invoke(DirectMethodHandleAccessor.java:103) │ │ │ │ │ at java.base/java.lang.reflect.Method.invoke(Method.java:580) │ │ │ │ │ at org.testng.internal.invokers.MethodInvocationHelper.invokeMethod(MethodInvocationHelper.java:136) │ │ │ │ │ at org.testng.internal.invokers.TestInvoker.invokeMethod(TestInvoker.java:658) │ │ │ │ │ @@ -111,22 +111,22 @@ │ │ │ │ │ at org.testng.TestNG.run(TestNG.java:1060) │ │ │ │ │ at com.sun.javatest.regtest.agent.TestNGRunner.main(TestNGRunner.java:109) │ │ │ │ │ at com.sun.javatest.regtest.agent.TestNGRunner.main(TestNGRunner.java:65) │ │ │ │ │ at java.base/jdk.internal.reflect.DirectMethodHandleAccessor.invoke(DirectMethodHandleAccessor.java:103) │ │ │ │ │ at java.base/java.lang.reflect.Method.invoke(Method.java:580) │ │ │ │ │ at com.sun.javatest.regtest.agent.MainWrapper$MainTask.run(MainWrapper.java:143) │ │ │ │ │ at java.base/java.lang.Thread.run(Thread.java:1583) │ │ │ │ │ -[18:22:42.050] config SocketPermissionTest.setupSecurityManager(): success [0ms] │ │ │ │ │ -[18:22:42.052] test SocketPermissionTest.listenDatagramSocketTest(): success [1ms] │ │ │ │ │ -[18:22:42.052] config SocketPermissionTest.setupSecurityManager(): success [0ms] │ │ │ │ │ -[18:22:42.054] test SocketPermissionTest.listenMulticastSocketTest(): success [1ms] │ │ │ │ │ -[18:22:42.055] config SocketPermissionTest.setupSecurityManager(): success [0ms] │ │ │ │ │ -[18:22:42.057] test SocketPermissionTest.listenServerSocketTest(): success [1ms] │ │ │ │ │ -[18:22:42.058] config SocketPermissionTest.setupSecurityManager(): success [0ms] │ │ │ │ │ -[18:22:42.059] test SocketPermissionTest.sendDatagramPacketTest(): failure [1ms] │ │ │ │ │ +[15:31:35.356] config SocketPermissionTest.setupSecurityManager(): success [0ms] │ │ │ │ │ +[15:31:35.358] test SocketPermissionTest.listenDatagramSocketTest(): success [2ms] │ │ │ │ │ +[15:31:35.359] config SocketPermissionTest.setupSecurityManager(): success [0ms] │ │ │ │ │ +[15:31:35.361] test SocketPermissionTest.listenMulticastSocketTest(): success [1ms] │ │ │ │ │ +[15:31:35.362] config SocketPermissionTest.setupSecurityManager(): success [0ms] │ │ │ │ │ +[15:31:35.364] test SocketPermissionTest.listenServerSocketTest(): success [1ms] │ │ │ │ │ +[15:31:35.365] config SocketPermissionTest.setupSecurityManager(): success [0ms] │ │ │ │ │ +[15:31:35.367] test SocketPermissionTest.sendDatagramPacketTest(): failure [2ms] │ │ │ │ │ java.security.PrivilegedActionException: java.net.SocketException: Network is unreachable │ │ │ │ │ at java.base/java.security.AccessController.doPrivileged(AccessController.java:718) │ │ │ │ │ at SocketPermissionTest.sendDatagramPacketTest(SocketPermissionTest.java:195) │ │ │ │ │ at java.base/jdk.internal.reflect.DirectMethodHandleAccessor.invoke(DirectMethodHandleAccessor.java:103) │ │ │ │ │ at java.base/java.lang.reflect.Method.invoke(Method.java:580) │ │ │ │ │ at org.testng.internal.invokers.MethodInvocationHelper.invokeMethod(MethodInvocationHelper.java:136) │ │ │ │ │ at org.testng.internal.invokers.TestInvoker.invokeMethod(TestInvoker.java:658) │ │ │ │ ├── jtreg-test-output/jdk/JTwork/sun/security/krb5/auto/Addresses.jtr │ │ │ │ │ @@ -1,68 +1,68 @@ │ │ │ │ │ #Test Results (version 2) │ │ │ │ │ -#Thu Oct 08 18:22:44 UTC 2026 │ │ │ │ │ +#Thu Oct 15 15:31:38 UTC 2026 │ │ │ │ │ #-----testdescription----- │ │ │ │ │ $file=/build/reproducible-path/openjdk-21-21.0.13~8ea/test/jdk/sun/security/krb5/auto/Addresses.java │ │ │ │ │ $root=/build/reproducible-path/openjdk-21-21.0.13~8ea/test/jdk │ │ │ │ │ keywords=bug8031111 bug8194486 othervm │ │ │ │ │ library=/test/lib │ │ │ │ │ modules=java.base/jdk.internal.misc java.base/sun.security.util java.security.jgss/sun.security.jgss java.security.jgss/sun.security.jgss.krb5 java.security.jgss/sun.security.krb5\:+open java.security.jgss/sun.security.krb5.internal\:+open java.security.jgss/sun.security.krb5.internal.ccache java.security.jgss/sun.security.krb5.internal.rcache java.security.jgss/sun.security.krb5.internal.crypto java.security.jgss/sun.security.krb5.internal.ktab jdk.security.auth jdk.security.jgss │ │ │ │ │ run=USER_SPECIFIED compile -XDignore.symbol.file Addresses.java\nUSER_SPECIFIED main jdk.test.lib.FileInstaller TestHosts TestHosts\nUSER_SPECIFIED main/othervm -Djdk.net.hosts.file\=TestHosts Addresses\n │ │ │ │ │ source=Addresses.java │ │ │ │ │ title=fix krb5 caddr │ │ │ │ │ │ │ │ │ │ #-----environment----- │ │ │ │ │ │ │ │ │ │ #-----testresult----- │ │ │ │ │ description=file\:/build/reproducible-path/openjdk-21-21.0.13~8ea/test/jdk/sun/security/krb5/auto/Addresses.java │ │ │ │ │ -elapsed=2628 0\:00\:02.628 │ │ │ │ │ -end=Thu Oct 08 18\:22\:44 UTC 2026 │ │ │ │ │ +elapsed=2746 0\:00\:02.746 │ │ │ │ │ +end=Thu Oct 15 15\:31\:38 UTC 2026 │ │ │ │ │ environment=regtest │ │ │ │ │ execStatus=Failed. Execution failed\: `main' threw exception\: java.lang.Exception │ │ │ │ │ harnessLoaderMode=Classpath Loader │ │ │ │ │ harnessVariety=Full Bundle │ │ │ │ │ hostname=sbuild │ │ │ │ │ -javatestOS=Linux 6.12.111+deb13-arm64 (aarch64) │ │ │ │ │ +javatestOS=Linux 6.12.111+deb13-cloud-arm64 (aarch64) │ │ │ │ │ javatestVersion=6.0-ea+b26-2026-03-18-${BUILT_FROM_COMMIT} │ │ │ │ │ jtregVersion=jtreg 8.3 src 1 │ │ │ │ │ modules=java.base/jdk.internal.misc java.base/sun.security.util java.security.jgss/sun.security.jgss java.security.jgss/sun.security.jgss.krb5 java.security.jgss/sun.security.krb5\:+open java.security.jgss/sun.security.krb5.internal\:+open java.security.jgss/sun.security.krb5.internal.ccache java.security.jgss/sun.security.krb5.internal.rcache java.security.jgss/sun.security.krb5.internal.crypto java.security.jgss/sun.security.krb5.internal.ktab jdk.security.auth jdk.security.jgss │ │ │ │ │ script=com.sun.javatest.regtest.exec.RegressionScript │ │ │ │ │ sections=script_messages compile build main build main │ │ │ │ │ -start=Thu Oct 08 18\:22\:42 UTC 2026 │ │ │ │ │ +start=Thu Oct 15 15\:31\:35 UTC 2026 │ │ │ │ │ test=sun/security/krb5/auto/Addresses.java │ │ │ │ │ testJDK=/build/reproducible-path/openjdk-21-21.0.13~8ea/build/bootcycle-build/images/jdk │ │ │ │ │ -testJDK_OS=[name\:Linux,arch\:aarch64,version\:6.12.111+deb13-arm64,family\:linux,simple_arch\:aarch64,simple_version\:6.12,processors\:8,maxMemory\:25155862528,maxSwap\:182536105984] │ │ │ │ │ +testJDK_OS=[name\:Linux,arch\:aarch64,version\:6.12.111+deb13-cloud-arm64,family\:linux,simple_arch\:aarch64,simple_version\:6.12,processors\:12,maxMemory\:33596653568,maxSwap\:137438949376] │ │ │ │ │ testJDK_os.arch=aarch64 │ │ │ │ │ testJDK_os.name=Linux │ │ │ │ │ -testJDK_os.version=6.12.111+deb13-arm64 │ │ │ │ │ -totalTime=2631 │ │ │ │ │ +testJDK_os.version=6.12.111+deb13-cloud-arm64 │ │ │ │ │ +totalTime=2748 │ │ │ │ │ user.name=sbuild │ │ │ │ │ work=/tmp/jdk/JTwork/sun/security/krb5/auto │ │ │ │ │ │ │ │ │ │ #section:script_messages │ │ │ │ │ ----------messages:(7/471)---------- │ │ │ │ │ JDK under test: /build/reproducible-path/openjdk-21-21.0.13~8ea/build/bootcycle-build/images/jdk │ │ │ │ │ openjdk version "21.0.13-ea" 2026-10-20 │ │ │ │ │ OpenJDK Runtime Environment (build 21.0.13-ea+8-1-Debian) │ │ │ │ │ OpenJDK 64-Bit Server VM (build 21.0.13-ea+8-1-Debian, mixed mode, sharing) │ │ │ │ │ Library /test/lib; kind: packages │ │ │ │ │ source directory: /build/reproducible-path/openjdk-21-21.0.13~8ea/test/lib │ │ │ │ │ class directory: /tmp/jdk/JTwork/classes/sun/security/krb5/auto/Addresses.d/test/lib │ │ │ │ │ │ │ │ │ │ #section:compile │ │ │ │ │ -----------messages:(9/1177)---------- │ │ │ │ │ +----------messages:(9/1176)---------- │ │ │ │ │ command: compile -XDignore.symbol.file /build/reproducible-path/openjdk-21-21.0.13~8ea/test/jdk/sun/security/krb5/auto/Addresses.java │ │ │ │ │ reason: User specified action: run compile -XDignore.symbol.file Addresses.java │ │ │ │ │ -started: Thu Oct 08 18:22:42.150 UTC 2026 │ │ │ │ │ +started: Thu Oct 15 15:31:35.469 UTC 2026 │ │ │ │ │ Additional options from @modules: --add-modules java.base,java.security.jgss,jdk.security.auth,jdk.security.jgss --add-exports java.base/jdk.internal.misc=ALL-UNNAMED --add-exports java.base/sun.security.util=ALL-UNNAMED --add-exports java.security.jgss/sun.security.jgss=ALL-UNNAMED --add-exports java.security.jgss/sun.security.jgss.krb5=ALL-UNNAMED --add-exports java.security.jgss/sun.security.krb5=ALL-UNNAMED --add-exports java.security.jgss/sun.security.krb5.internal=ALL-UNNAMED --add-exports java.security.jgss/sun.security.krb5.internal.ccache=ALL-UNNAMED --add-exports java.security.jgss/sun.security.krb5.internal.rcache=ALL-UNNAMED --add-exports java.security.jgss/sun.security.krb5.internal.crypto=ALL-UNNAMED --add-exports java.security.jgss/sun.security.krb5.internal.ktab=ALL-UNNAMED │ │ │ │ │ Mode: agentvm │ │ │ │ │ Agent id: 2 │ │ │ │ │ -Process id: 3139579 │ │ │ │ │ -finished: Thu Oct 08 18:22:43.062 UTC 2026 │ │ │ │ │ -elapsed time (seconds): 0.912 │ │ │ │ │ +Process id: 2807364 │ │ │ │ │ +finished: Thu Oct 15 15:31:36.459 UTC 2026 │ │ │ │ │ +elapsed time (seconds): 0.99 │ │ │ │ │ ----------configuration:(23/1529)---------- │ │ │ │ │ Boot Layer (javac runtime environment) │ │ │ │ │ class path: /usr/share/jtreg/lib/javatest.jar │ │ │ │ │ /usr/share/jtreg/lib/jtreg.jar │ │ │ │ │ patch: java.base /tmp/jdk/JTwork/patches/java.base │ │ │ │ │ │ │ │ │ │ javac compilation environment │ │ │ │ │ @@ -132,34 +132,34 @@ │ │ │ │ │ -classpath /build/reproducible-path/openjdk-21-21.0.13~8ea/test/jdk/sun/security/krb5/auto:/tmp/jdk/JTwork/classes/sun/security/krb5/auto/Addresses.d:/tmp/jdk/JTwork/classes/sun/security/krb5/auto/Addresses.d/test/lib \\ │ │ │ │ │ -XDignore.symbol.file /build/reproducible-path/openjdk-21-21.0.13~8ea/test/jdk/sun/security/krb5/auto/Addresses.java │ │ │ │ │ ----------stdout:(0/0)---------- │ │ │ │ │ ----------stderr:(0/0)---------- │ │ │ │ │ result: Passed. Compilation successful │ │ │ │ │ │ │ │ │ │ #section:build │ │ │ │ │ -----------messages:(5/194)---------- │ │ │ │ │ +----------messages:(5/196)---------- │ │ │ │ │ command: build jdk.test.lib.FileInstaller │ │ │ │ │ reason: Named class compiled on demand │ │ │ │ │ -started: Thu Oct 08 18:22:43.063 UTC 2026 │ │ │ │ │ -finished: Thu Oct 08 18:22:43.063 UTC 2026 │ │ │ │ │ -elapsed time (seconds): 0.0 │ │ │ │ │ +started: Thu Oct 15 15:31:36.459 UTC 2026 │ │ │ │ │ +finished: Thu Oct 15 15:31:36.460 UTC 2026 │ │ │ │ │ +elapsed time (seconds): 0.001 │ │ │ │ │ result: Passed. All files up to date │ │ │ │ │ │ │ │ │ │ #section:main │ │ │ │ │ ----------messages:(10/925)---------- │ │ │ │ │ command: main jdk.test.lib.FileInstaller TestHosts TestHosts │ │ │ │ │ reason: User specified action: run main jdk.test.lib.FileInstaller TestHosts TestHosts │ │ │ │ │ -started: Thu Oct 08 18:22:43.064 UTC 2026 │ │ │ │ │ +started: Thu Oct 15 15:31:36.460 UTC 2026 │ │ │ │ │ Mode: agentvm │ │ │ │ │ Agent id: 1 │ │ │ │ │ -Process id: 3139455 │ │ │ │ │ +Process id: 2807240 │ │ │ │ │ Additional exports to unnamed modules from @modules: java.base/jdk.internal.misc java.base/sun.security.util java.security.jgss/sun.security.jgss java.security.jgss/sun.security.jgss.krb5 java.security.jgss/sun.security.krb5 java.security.jgss/sun.security.krb5.internal java.security.jgss/sun.security.krb5.internal.ccache java.security.jgss/sun.security.krb5.internal.rcache java.security.jgss/sun.security.krb5.internal.crypto java.security.jgss/sun.security.krb5.internal.ktab │ │ │ │ │ Additional opens to unnamed modules from @modules: java.security.jgss/sun.security.krb5 java.security.jgss/sun.security.krb5.internal │ │ │ │ │ -finished: Thu Oct 08 18:22:43.139 UTC 2026 │ │ │ │ │ -elapsed time (seconds): 0.075 │ │ │ │ │ +finished: Thu Oct 15 15:31:36.538 UTC 2026 │ │ │ │ │ +elapsed time (seconds): 0.078 │ │ │ │ │ ----------configuration:(29/1786)---------- │ │ │ │ │ Boot Layer │ │ │ │ │ class path: /usr/share/jtreg/lib/javatest.jar │ │ │ │ │ /usr/share/jtreg/lib/jtreg.jar │ │ │ │ │ /usr/share/jtreg/lib/junit-platform-console-standalone.jar │ │ │ │ │ /usr/share/jtreg/lib/testng.jar │ │ │ │ │ /usr/share/jtreg/lib/guice.jar │ │ │ │ │ @@ -224,32 +224,32 @@ │ │ │ │ │ ----------System.err:(3/35)---------- │ │ │ │ │ │ │ │ │ │ JavaTest Message: Test complete. │ │ │ │ │ │ │ │ │ │ result: Passed. Execution successful │ │ │ │ │ │ │ │ │ │ #section:build │ │ │ │ │ -----------messages:(5/177)---------- │ │ │ │ │ +----------messages:(5/179)---------- │ │ │ │ │ command: build Addresses │ │ │ │ │ reason: Named class compiled on demand │ │ │ │ │ -started: Thu Oct 08 18:22:43.139 UTC 2026 │ │ │ │ │ -finished: Thu Oct 08 18:22:43.139 UTC 2026 │ │ │ │ │ -elapsed time (seconds): 0.0 │ │ │ │ │ +started: Thu Oct 15 15:31:36.538 UTC 2026 │ │ │ │ │ +finished: Thu Oct 15 15:31:36.539 UTC 2026 │ │ │ │ │ +elapsed time (seconds): 0.001 │ │ │ │ │ result: Passed. All files up to date │ │ │ │ │ │ │ │ │ │ #section:main │ │ │ │ │ ----------messages:(8/1247)---------- │ │ │ │ │ command: main -Djdk.net.hosts.file=TestHosts Addresses │ │ │ │ │ reason: User specified action: run main/othervm -Djdk.net.hosts.file=TestHosts Addresses │ │ │ │ │ -started: Thu Oct 08 18:22:43.140 UTC 2026 │ │ │ │ │ +started: Thu Oct 15 15:31:36.539 UTC 2026 │ │ │ │ │ Mode: othervm [/othervm specified] │ │ │ │ │ Additional options from @modules: --add-modules java.base,java.security.jgss,jdk.security.auth,jdk.security.jgss --add-exports java.base/jdk.internal.misc=ALL-UNNAMED --add-exports java.base/sun.security.util=ALL-UNNAMED --add-exports java.security.jgss/sun.security.jgss=ALL-UNNAMED --add-exports java.security.jgss/sun.security.jgss.krb5=ALL-UNNAMED --add-exports java.security.jgss/sun.security.krb5=ALL-UNNAMED --add-opens java.security.jgss/sun.security.krb5=ALL-UNNAMED --add-exports java.security.jgss/sun.security.krb5.internal=ALL-UNNAMED --add-opens java.security.jgss/sun.security.krb5.internal=ALL-UNNAMED --add-exports java.security.jgss/sun.security.krb5.internal.ccache=ALL-UNNAMED --add-exports java.security.jgss/sun.security.krb5.internal.rcache=ALL-UNNAMED --add-exports java.security.jgss/sun.security.krb5.internal.crypto=ALL-UNNAMED --add-exports java.security.jgss/sun.security.krb5.internal.ktab=ALL-UNNAMED │ │ │ │ │ -Process id: 3139611 │ │ │ │ │ -finished: Thu Oct 08 18:22:44.775 UTC 2026 │ │ │ │ │ -elapsed time (seconds): 1.635 │ │ │ │ │ +Process id: 2807398 │ │ │ │ │ +finished: Thu Oct 15 15:31:38.211 UTC 2026 │ │ │ │ │ +elapsed time (seconds): 1.672 │ │ │ │ │ ----------configuration:(15/1053)---------- │ │ │ │ │ Boot Layer │ │ │ │ │ add modules: java.base java.security.jgss jdk.security.auth jdk.security.jgss │ │ │ │ │ add exports: java.base/jdk.internal.misc ALL-UNNAMED │ │ │ │ │ java.base/sun.security.util ALL-UNNAMED │ │ │ │ │ java.security.jgss/sun.security.jgss ALL-UNNAMED │ │ │ │ │ java.security.jgss/sun.security.jgss.krb5 ALL-UNNAMED │ │ │ │ │ @@ -258,28 +258,28 @@ │ │ │ │ │ java.security.jgss/sun.security.krb5.internal.ccache ALL-UNNAMED │ │ │ │ │ java.security.jgss/sun.security.krb5.internal.crypto ALL-UNNAMED │ │ │ │ │ java.security.jgss/sun.security.krb5.internal.ktab ALL-UNNAMED │ │ │ │ │ java.security.jgss/sun.security.krb5.internal.rcache ALL-UNNAMED │ │ │ │ │ add opens: java.security.jgss/sun.security.krb5 ALL-UNNAMED │ │ │ │ │ java.security.jgss/sun.security.krb5.internal ALL-UNNAMED │ │ │ │ │ │ │ │ │ │ -----------System.out:(24/852)---------- │ │ │ │ │ -Start KDC on 16333 │ │ │ │ │ +----------System.out:(24/849)---------- │ │ │ │ │ +Start KDC on 8481 │ │ │ │ │ ----------------------------------------------- │ │ │ │ │ >>>>> UDP packet received │ │ │ │ │ -RABBIT.HOLE:16333> dummy@RABBIT.HOLE sends AS-REQ for krbtgt/RABBIT.HOLE@RABBIT.HOLE, KDCOptions: │ │ │ │ │ +RABBIT.HOLE:8481> dummy@RABBIT.HOLE sends AS-REQ for krbtgt/RABBIT.HOLE@RABBIT.HOLE, KDCOptions: │ │ │ │ │ KrbException: Additional pre-authentication required (25) │ │ │ │ │ at KDC.processAsReq(KDC.java:1335) │ │ │ │ │ at KDC.processMessage(KDC.java:809) │ │ │ │ │ at KDC$1.run(KDC.java:1565) │ │ │ │ │ Error 25 Additional pre-authentication required │ │ │ │ │ >>>>> UDP request honored │ │ │ │ │ ----------------------------------------------- │ │ │ │ │ >>>>> UDP packet received │ │ │ │ │ -RABBIT.HOLE:16333> dummy@RABBIT.HOLE sends AS-REQ for krbtgt/RABBIT.HOLE@RABBIT.HOLE, KDCOptions: │ │ │ │ │ +RABBIT.HOLE:8481> dummy@RABBIT.HOLE sends AS-REQ for krbtgt/RABBIT.HOLE@RABBIT.HOLE, KDCOptions: │ │ │ │ │ Return dummy@RABBIT.HOLE ticket for krbtgt/RABBIT.HOLE@RABBIT.HOLE, flags INITIAL;PRE-AUTHENT │ │ │ │ │ >>>>> UDP request honored │ │ │ │ │ /10.0.0.10 │ │ │ │ │ extra1 found │ │ │ │ │ /10.0.0.11 │ │ │ │ │ extra2 found │ │ │ │ │ /10.0.0.12 │ │ ├── ./usr/share/doc/openjdk-21-jre-headless/test-arm64/jtreg_output-hotspot.log.gz │ │ │ ├── jtreg_output-hotspot.log │ │ │ │ @@ -3146,31 +3146,31 @@ │ │ │ │ Results written to /tmp/hotspot/JTwork │ │ │ │ [debian/tests/jtreg-autopkgtest.sh] nothing to cleanup │ │ │ │ grep: debian/tests/hotspot-archs: No such file or directory │ │ │ │ Unable to compare jtreg results: no build jtreport found for hotspot/arm64. │ │ │ │ Reason: '/usr/share/doc/openjdk-21-jre-headless//test-arm64/jtreport-hotspot.tar.gz' does not exist. │ │ │ │ Command exited with non-zero status 77 │ │ │ │ Command being timed: "debian/tests/hotspot" │ │ │ │ - User time (seconds): 13570.55 │ │ │ │ - System time (seconds): 1992.95 │ │ │ │ - Percent of CPU this job got: 142% │ │ │ │ - Elapsed (wall clock) time (h:mm:ss or m:ss): 3:02:04 │ │ │ │ + User time (seconds): 15210.50 │ │ │ │ + System time (seconds): 2129.49 │ │ │ │ + Percent of CPU this job got: 147% │ │ │ │ + Elapsed (wall clock) time (h:mm:ss or m:ss): 3:15:45 │ │ │ │ Average shared text size (kbytes): 0 │ │ │ │ Average unshared data size (kbytes): 0 │ │ │ │ Average stack size (kbytes): 0 │ │ │ │ Average total size (kbytes): 0 │ │ │ │ - Maximum resident set size (kbytes): 6240464 │ │ │ │ + Maximum resident set size (kbytes): 7548412 │ │ │ │ Average resident set size (kbytes): 0 │ │ │ │ - Major (requiring I/O) page faults: 4531 │ │ │ │ - Minor (reclaiming a frame) page faults: 101727856 │ │ │ │ - Voluntary context switches: 60856633 │ │ │ │ - Involuntary context switches: 4892580 │ │ │ │ + Major (requiring I/O) page faults: 747 │ │ │ │ + Minor (reclaiming a frame) page faults: 127425930 │ │ │ │ + Voluntary context switches: 53685224 │ │ │ │ + Involuntary context switches: 269055 │ │ │ │ Swaps: 0 │ │ │ │ - File system inputs: 1407072 │ │ │ │ - File system outputs: 0 │ │ │ │ + File system inputs: 1128928 │ │ │ │ + File system outputs: 26918832 │ │ │ │ Socket messages sent: 0 │ │ │ │ Socket messages received: 0 │ │ │ │ Signals delivered: 0 │ │ │ │ Page size (bytes): 4096 │ │ │ │ Exit status: 77 │ │ │ │ ===== END check-hotspot ===== │ │ │ │ ===== START check-langtools ===== │ │ │ │ @@ -7628,31 +7628,31 @@ │ │ │ │ Results written to /tmp/langtools/JTwork │ │ │ │ [debian/tests/jtreg-autopkgtest.sh] nothing to cleanup │ │ │ │ grep: debian/tests/hotspot-archs: No such file or directory │ │ │ │ Unable to compare jtreg results: no build jtreport found for hotspot/arm64. │ │ │ │ Reason: '/usr/share/doc/openjdk-21-jre-headless//test-arm64/jtreport-hotspot.tar.gz' does not exist. │ │ │ │ Command exited with non-zero status 77 │ │ │ │ Command being timed: "debian/tests/langtools" │ │ │ │ - User time (seconds): 3889.03 │ │ │ │ - System time (seconds): 343.69 │ │ │ │ - Percent of CPU this job got: 153% │ │ │ │ - Elapsed (wall clock) time (h:mm:ss or m:ss): 45:54.13 │ │ │ │ + User time (seconds): 3831.68 │ │ │ │ + System time (seconds): 404.83 │ │ │ │ + Percent of CPU this job got: 126% │ │ │ │ + Elapsed (wall clock) time (h:mm:ss or m:ss): 55:58.40 │ │ │ │ Average shared text size (kbytes): 0 │ │ │ │ Average unshared data size (kbytes): 0 │ │ │ │ Average stack size (kbytes): 0 │ │ │ │ Average total size (kbytes): 0 │ │ │ │ - Maximum resident set size (kbytes): 5531752 │ │ │ │ + Maximum resident set size (kbytes): 7666416 │ │ │ │ Average resident set size (kbytes): 0 │ │ │ │ - Major (requiring I/O) page faults: 129 │ │ │ │ - Minor (reclaiming a frame) page faults: 11395771 │ │ │ │ - Voluntary context switches: 3804860 │ │ │ │ - Involuntary context switches: 44781 │ │ │ │ + Major (requiring I/O) page faults: 2350 │ │ │ │ + Minor (reclaiming a frame) page faults: 21156896 │ │ │ │ + Voluntary context switches: 4237377 │ │ │ │ + Involuntary context switches: 1373357 │ │ │ │ Swaps: 0 │ │ │ │ - File system inputs: 152688 │ │ │ │ - File system outputs: 0 │ │ │ │ + File system inputs: 1196072 │ │ │ │ + File system outputs: 3212224 │ │ │ │ Socket messages sent: 0 │ │ │ │ Socket messages received: 0 │ │ │ │ Signals delivered: 0 │ │ │ │ Page size (bytes): 4096 │ │ │ │ Exit status: 77 │ │ │ │ ===== END check-langtools ===== │ │ │ │ ===== START check-jaxp ===== │ │ │ │ @@ -8178,60 +8178,60 @@ │ │ │ │ Results written to /tmp/jaxp/JTwork │ │ │ │ [debian/tests/jtreg-autopkgtest.sh] nothing to cleanup │ │ │ │ grep: debian/tests/hotspot-archs: No such file or directory │ │ │ │ Unable to compare jtreg results: no build jtreport found for hotspot/arm64. │ │ │ │ Reason: '/usr/share/doc/openjdk-21-jre-headless//test-arm64/jtreport-hotspot.tar.gz' does not exist. │ │ │ │ Command exited with non-zero status 77 │ │ │ │ Command being timed: "debian/tests/jaxp" │ │ │ │ - User time (seconds): 3106.67 │ │ │ │ - System time (seconds): 199.87 │ │ │ │ - Percent of CPU this job got: 279% │ │ │ │ - Elapsed (wall clock) time (h:mm:ss or m:ss): 19:44.83 │ │ │ │ + User time (seconds): 2670.88 │ │ │ │ + System time (seconds): 364.26 │ │ │ │ + Percent of CPU this job got: 134% │ │ │ │ + Elapsed (wall clock) time (h:mm:ss or m:ss): 37:39.62 │ │ │ │ Average shared text size (kbytes): 0 │ │ │ │ Average unshared data size (kbytes): 0 │ │ │ │ Average stack size (kbytes): 0 │ │ │ │ Average total size (kbytes): 0 │ │ │ │ - Maximum resident set size (kbytes): 434288 │ │ │ │ + Maximum resident set size (kbytes): 475172 │ │ │ │ Average resident set size (kbytes): 0 │ │ │ │ - Major (requiring I/O) page faults: 73 │ │ │ │ - Minor (reclaiming a frame) page faults: 11661038 │ │ │ │ - Voluntary context switches: 3059197 │ │ │ │ - Involuntary context switches: 20305 │ │ │ │ + Major (requiring I/O) page faults: 11456 │ │ │ │ + Minor (reclaiming a frame) page faults: 23112499 │ │ │ │ + Voluntary context switches: 3686592 │ │ │ │ + Involuntary context switches: 1887155 │ │ │ │ Swaps: 0 │ │ │ │ - File system inputs: 170864 │ │ │ │ - File system outputs: 0 │ │ │ │ + File system inputs: 2783568 │ │ │ │ + File system outputs: 2910496 │ │ │ │ Socket messages sent: 0 │ │ │ │ Socket messages received: 0 │ │ │ │ Signals delivered: 0 │ │ │ │ Page size (bytes): 4096 │ │ │ │ Exit status: 77 │ │ │ │ ===== END check-jaxp ===== │ │ │ │ ===== START check-jdk ===== │ │ │ │ mkdir -p jtreg-test-output/jdk │ │ │ │ BOOTJDK_HOME=/usr/lib/jvm/java-21-openjdk-arm64 JTREG_OPTIONS= VMNAME=hotspot JDK_TO_TEST=build/bootcycle-build/images/jdk \ │ │ │ │ AUTOPKGTEST_TMP=/tmp/ AUTOPKGTEST_ARTIFACTS=jtreg-test-output/ \ │ │ │ │ /usr/bin/time -v debian/tests/jdk | tee jtreg-test-output/check-jdk.log │ │ │ │ │ │ │ │ -(xfwm4:2654040): atspi-WARNING **: 14:09:21.513: AT-SPI: Error retrieving accessibility bus address: org.freedesktop.DBus.Error.ServiceUnknown: The name org.a11y.Bus was not provided by any .service files │ │ │ │ -dbus-daemon[2654029]: [session uid=999 pid=2654029 pidfd=5] Activating service name='org.xfce.Xfconf' requested by ':1.1' (uid=999 pid=2654040 comm="xfwm4") │ │ │ │ -dbus-daemon[2654029]: [session uid=999 pid=2654029 pidfd=5] Successfully activated service 'org.xfce.Xfconf' │ │ │ │ +(xfwm4:2314807): atspi-WARNING **: 10:39:29.988: AT-SPI: Error retrieving accessibility bus address: org.freedesktop.DBus.Error.ServiceUnknown: The name org.a11y.Bus was not provided by any .service files │ │ │ │ +dbus-daemon[2314796]: [session uid=999 pid=2314796 pidfd=5] Activating service name='org.xfce.Xfconf' requested by ':1.1' (uid=999 pid=2314807 comm="xfwm4") │ │ │ │ +dbus-daemon[2314796]: [session uid=999 pid=2314796 pidfd=5] Successfully activated service 'org.xfce.Xfconf' │ │ │ │ WARNING: Glycin running without sandbox. Bubblewrap (bwrap) doesn't work in the environment. │ │ │ │ dpkg: error: --compare-versions takes three arguments: │ │ │ │ │ │ │ │ Type dpkg --help for help about installing and deinstalling packages [*]; │ │ │ │ Use 'apt' or 'aptitude' for user-friendly package management; │ │ │ │ Type dpkg -Dhelp for a list of dpkg debug flag values; │ │ │ │ Type dpkg --force-help for a list of forcing options; │ │ │ │ Type dpkg-deb --help for help about manipulating *.deb files; │ │ │ │ │ │ │ │ Options marked [*] produce a lot of output - pipe it through 'less' or 'more' ! │ │ │ │ │ │ │ │ -(xfwm4:2654040): xfwm4-WARNING **: 14:09:24.331: Another compositing manager is running on screen 0 │ │ │ │ +(xfwm4:2314807): xfwm4-WARNING **: 10:39:32.824: Another compositing manager is running on screen 0 │ │ │ │ │ │ │ │ -(xfwm4:2654040): xfwm4-WARNING **: 14:09:24.337: Failed to connect to session manager: Failed to connect to the session manager: SESSION_MANAGER environment variable not defined │ │ │ │ +(xfwm4:2314807): xfwm4-WARNING **: 10:39:32.829: Failed to connect to session manager: Failed to connect to the session manager: SESSION_MANAGER environment variable not defined │ │ │ │ Directory "/tmp/jdk/JTwork" not found: creating │ │ │ │ Directory "jtreg-test-output/jdk/0/JTreport" not found: creating │ │ │ │ Passed: com/sun/jdi/AcceptTimeout.java │ │ │ │ Passed: com/sun/jdi/AccessSpecifierTest.java │ │ │ │ Passed: com/sun/jdi/AfterThreadDeathTest.java │ │ │ │ Passed: com/sun/jdi/ArrayRangeTest.java │ │ │ │ Passed: com/sun/jdi/ConstantPoolInfo.java │ │ │ │ @@ -14775,31 +14775,31 @@ │ │ │ │ Framework-based tests: 8 = 8 TestNG + 0 JUnit │ │ │ │ Report written to /build/reproducible-path/openjdk-21-21.0.13~8ea/jtreg-test-output/jdk/2/JTreport/html/report.html │ │ │ │ Results written to /tmp/jdk/JTwork │ │ │ │ Error: Some tests failed or other problems occurred. │ │ │ │ [debian/tests/jtreg-autopkgtest.sh] nothing to cleanup │ │ │ │ Command exited with non-zero status 2 │ │ │ │ Command being timed: "debian/tests/jdk" │ │ │ │ - User time (seconds): 21663.97 │ │ │ │ - System time (seconds): 1872.36 │ │ │ │ - Percent of CPU this job got: 154% │ │ │ │ - Elapsed (wall clock) time (h:mm:ss or m:ss): 4:13:51 │ │ │ │ + User time (seconds): 22278.49 │ │ │ │ + System time (seconds): 2217.85 │ │ │ │ + Percent of CPU this job got: 139% │ │ │ │ + Elapsed (wall clock) time (h:mm:ss or m:ss): 4:52:34 │ │ │ │ Average shared text size (kbytes): 0 │ │ │ │ Average unshared data size (kbytes): 0 │ │ │ │ Average stack size (kbytes): 0 │ │ │ │ Average total size (kbytes): 0 │ │ │ │ - Maximum resident set size (kbytes): 16519992 │ │ │ │ + Maximum resident set size (kbytes): 16335396 │ │ │ │ Average resident set size (kbytes): 0 │ │ │ │ - Major (requiring I/O) page faults: 1501 │ │ │ │ - Minor (reclaiming a frame) page faults: 73428952 │ │ │ │ - Voluntary context switches: 41670894 │ │ │ │ - Involuntary context switches: 2167910 │ │ │ │ + Major (requiring I/O) page faults: 5144 │ │ │ │ + Minor (reclaiming a frame) page faults: 113300908 │ │ │ │ + Voluntary context switches: 45163162 │ │ │ │ + Involuntary context switches: 8775593 │ │ │ │ Swaps: 0 │ │ │ │ - File system inputs: 2730904 │ │ │ │ - File system outputs: 0 │ │ │ │ + File system inputs: 8896032 │ │ │ │ + File system outputs: 87023832 │ │ │ │ Socket messages sent: 0 │ │ │ │ Socket messages received: 0 │ │ │ │ Signals delivered: 0 │ │ │ │ Page size (bytes): 4096 │ │ │ │ Exit status: 2 │ │ │ │ Killed │ │ │ │ ===== END check-jdk ===== │ │ │ │ @@ -14858,29 +14858,29 @@ │ │ │ │ FAILED: java/net/SocketPermission/SocketPermissionTest.java │ │ │ │ FAILED: sun/security/krb5/auto/Addresses.java │ │ │ │ Test results: failed: 9; excluded: 38; did not match keywords: 37; did not match prior status: 6,604 │ │ │ │ Framework-based tests: 8 = 8 TestNG + 0 JUnit │ │ │ │ [debian/tests/jtreg-autopkgtest.sh] nothing to cleanup │ │ │ │ make[2]: Leaving directory '/build/reproducible-path/openjdk-21-21.0.13~8ea' │ │ │ │ Command being timed: "/usr/bin/make -f debian/rules -k jtregcheck TEST_SUITES=hotspot langtools jaxp jdk JTREG_OPTIONS=" │ │ │ │ - User time (seconds): 42231.43 │ │ │ │ - System time (seconds): 4409.91 │ │ │ │ - Percent of CPU this job got: 154% │ │ │ │ - Elapsed (wall clock) time (h:mm:ss or m:ss): 8:21:36 │ │ │ │ + User time (seconds): 43992.77 │ │ │ │ + System time (seconds): 5117.69 │ │ │ │ + Percent of CPU this job got: 140% │ │ │ │ + Elapsed (wall clock) time (h:mm:ss or m:ss): 9:41:59 │ │ │ │ Average shared text size (kbytes): 0 │ │ │ │ Average unshared data size (kbytes): 0 │ │ │ │ Average stack size (kbytes): 0 │ │ │ │ Average total size (kbytes): 0 │ │ │ │ - Maximum resident set size (kbytes): 16519992 │ │ │ │ + Maximum resident set size (kbytes): 16335396 │ │ │ │ Average resident set size (kbytes): 0 │ │ │ │ - Major (requiring I/O) page faults: 6237 │ │ │ │ - Minor (reclaiming a frame) page faults: 198233992 │ │ │ │ - Voluntary context switches: 109406532 │ │ │ │ - Involuntary context switches: 7125625 │ │ │ │ + Major (requiring I/O) page faults: 20060 │ │ │ │ + Minor (reclaiming a frame) page faults: 285015388 │ │ │ │ + Voluntary context switches: 106787933 │ │ │ │ + Involuntary context switches: 12306674 │ │ │ │ Swaps: 0 │ │ │ │ - File system inputs: 4461576 │ │ │ │ - File system outputs: 0 │ │ │ │ + File system inputs: 14013832 │ │ │ │ + File system outputs: 120089744 │ │ │ │ Socket messages sent: 0 │ │ │ │ Socket messages received: 0 │ │ │ │ Signals delivered: 0 │ │ │ │ Page size (bytes): 4096 │ │ │ │ Exit status: 0 │ │ ├── ./usr/share/doc/openjdk-21-jre-headless/test-arm64/jtreport-hotspot.tar.gz │ │ │ ├── jtreport-hotspot.tar │ │ │ │ ├── file list │ │ │ │ │ @@ -1,230 +1,230 @@ │ │ │ │ │ -lrwxrwxrwx 0 sbuild (999) sbuild (999) 0 2026-10-08 18:23:12.000000 jtreg-test-output/jdk/JTreport -> 2/JTreport │ │ │ │ │ -drwxr-xr-x 0 sbuild (999) sbuild (999) 0 2026-10-08 18:22:48.000000 jtreg-test-output/jdk/2/JTreport/ │ │ │ │ │ --rw-r--r-- 0 sbuild (999) sbuild (999) 712 2026-10-08 18:22:48.000000 jtreg-test-output/jdk/2/JTreport/index.html │ │ │ │ │ --rw-r--r-- 0 sbuild (999) sbuild (999) 0 2026-10-08 18:22:48.000000 jtreg-test-output/jdk/2/JTreport/reportdir.dat │ │ │ │ │ -drwxr-xr-x 0 sbuild (999) sbuild (999) 0 2026-10-08 18:22:48.000000 jtreg-test-output/jdk/2/JTreport/html/ │ │ │ │ │ --rw-r--r-- 0 sbuild (999) sbuild (999) 762638 2026-10-08 18:22:48.000000 jtreg-test-output/jdk/2/JTreport/html/notRun_gr.html │ │ │ │ │ --rw-r--r-- 0 sbuild (999) sbuild (999) 762365 2026-10-08 18:22:48.000000 jtreg-test-output/jdk/2/JTreport/html/notRun.html │ │ │ │ │ --rw-r--r-- 0 sbuild (999) sbuild (999) 520 2026-10-08 18:22:48.000000 jtreg-test-output/jdk/2/JTreport/html/error_gr.html │ │ │ │ │ --rw-r--r-- 0 sbuild (999) sbuild (999) 472 2026-10-08 18:22:48.000000 jtreg-test-output/jdk/2/JTreport/html/error.html │ │ │ │ │ --rw-r--r-- 0 sbuild (999) sbuild (999) 2749 2026-10-08 18:22:48.000000 jtreg-test-output/jdk/2/JTreport/html/failed_gr.html │ │ │ │ │ --rw-r--r-- 0 sbuild (999) sbuild (999) 2019 2026-10-08 18:22:48.000000 jtreg-test-output/jdk/2/JTreport/html/failed.html │ │ │ │ │ --rw-r--r-- 0 sbuild (999) sbuild (999) 1251696 2026-10-08 18:22:48.000000 jtreg-test-output/jdk/2/JTreport/html/passed_gr.html │ │ │ │ │ --rw-r--r-- 0 sbuild (999) sbuild (999) 1250212 2026-10-08 18:22:48.000000 jtreg-test-output/jdk/2/JTreport/html/passed.html │ │ │ │ │ --rw-r--r-- 0 sbuild (999) sbuild (999) 83173 2026-10-08 18:22:48.000000 jtreg-test-output/jdk/2/JTreport/html/excluded.html │ │ │ │ │ --rw-r--r-- 0 sbuild (999) sbuild (999) 4235 2026-10-08 18:22:48.000000 jtreg-test-output/jdk/2/JTreport/html/env.html │ │ │ │ │ --rw-r--r-- 0 sbuild (999) sbuild (999) 24358 2026-10-08 18:22:48.000000 jtreg-test-output/jdk/2/JTreport/html/config.html │ │ │ │ │ --rw-r--r-- 0 sbuild (999) sbuild (999) 307 2026-10-08 18:22:48.000000 jtreg-test-output/jdk/2/JTreport/html/report.css │ │ │ │ │ --rw-r--r-- 0 sbuild (999) sbuild (999) 1101684 2026-10-08 18:22:48.000000 jtreg-test-output/jdk/2/JTreport/html/index.html │ │ │ │ │ --rw-r--r-- 0 sbuild (999) sbuild (999) 1101684 2026-10-08 18:22:48.000000 jtreg-test-output/jdk/2/JTreport/html/report.html │ │ │ │ │ -drwxr-xr-x 0 sbuild (999) sbuild (999) 0 2026-10-08 18:22:48.000000 jtreg-test-output/jdk/2/JTreport/text/ │ │ │ │ │ --rw-r--r-- 0 sbuild (999) sbuild (999) 132 2026-10-08 18:22:48.000000 jtreg-test-output/jdk/2/JTreport/text/testng.txt │ │ │ │ │ --rw-r--r-- 0 sbuild (999) sbuild (999) 1023408 2026-10-08 18:22:48.000000 jtreg-test-output/jdk/2/JTreport/text/notRun.txt │ │ │ │ │ --rw-r--r-- 0 sbuild (999) sbuild (999) 101 2026-10-08 18:22:48.000000 jtreg-test-output/jdk/2/JTreport/text/stats.txt │ │ │ │ │ --rw-r--r-- 0 sbuild (999) sbuild (999) 116 2026-10-08 18:22:48.000000 jtreg-test-output/jdk/2/JTreport/text/timeStats.txt │ │ │ │ │ --rw-r--r-- 0 sbuild (999) sbuild (999) 21 2026-10-08 18:22:48.000000 jtreg-test-output/jdk/2/JTreport/text/tc_newfailures.txt │ │ │ │ │ --rw-r--r-- 0 sbuild (999) sbuild (999) 21 2026-10-08 18:22:48.000000 jtreg-test-output/jdk/2/JTreport/text/tc_fail2notrun.txt │ │ │ │ │ --rw-r--r-- 0 sbuild (999) sbuild (999) 20 2026-10-08 18:22:48.000000 jtreg-test-output/jdk/2/JTreport/text/tc_fail2error.txt │ │ │ │ │ --rw-r--r-- 0 sbuild (999) sbuild (999) 19 2026-10-08 18:22:48.000000 jtreg-test-output/jdk/2/JTreport/text/tc_fail2pass.txt │ │ │ │ │ --rw-r--r-- 0 sbuild (999) sbuild (999) 22 2026-10-08 18:22:48.000000 jtreg-test-output/jdk/2/JTreport/text/tc_fail2missing.txt │ │ │ │ │ --rw-r--r-- 0 sbuild (999) sbuild (999) 19 2026-10-08 18:22:48.000000 jtreg-test-output/jdk/2/JTreport/text/other_errors.txt │ │ │ │ │ --rw-r--r-- 0 sbuild (999) sbuild (999) 416 2026-10-08 18:22:48.000000 jtreg-test-output/jdk/2/JTreport/text/newfailures.txt │ │ │ │ │ --rw-r--r-- 0 sbuild (999) sbuild (999) 16 2026-10-08 18:22:48.000000 jtreg-test-output/jdk/2/JTreport/text/fail2fail.txt │ │ │ │ │ --rw-r--r-- 0 sbuild (999) sbuild (999) 18 2026-10-08 18:22:48.000000 jtreg-test-output/jdk/2/JTreport/text/fail2notrun.txt │ │ │ │ │ --rw-r--r-- 0 sbuild (999) sbuild (999) 17 2026-10-08 18:22:48.000000 jtreg-test-output/jdk/2/JTreport/text/faiL2error.txt │ │ │ │ │ --rw-r--r-- 0 sbuild (999) sbuild (999) 16 2026-10-08 18:22:48.000000 jtreg-test-output/jdk/2/JTreport/text/fail2pass.txt │ │ │ │ │ --rw-r--r-- 0 sbuild (999) sbuild (999) 19 2026-10-08 18:22:48.000000 jtreg-test-output/jdk/2/JTreport/text/fail2missing.txt │ │ │ │ │ --rw-r--r-- 0 sbuild (999) sbuild (999) 890297 2026-10-08 18:22:48.000000 jtreg-test-output/jdk/2/JTreport/text/summary.txt │ │ │ │ │ --rw-r--r-- 0 sbuild (999) sbuild (999) 550 2026-10-08 18:22:35.000000 jtreg-test-output/jdk/2/JTreport/text/cmdArgs.txt │ │ │ │ │ -drwxr-xr-x 0 sbuild (999) sbuild (999) 0 2026-10-08 18:22:11.000000 jtreg-test-output/jdk/1/JTreport/ │ │ │ │ │ --rw-r--r-- 0 sbuild (999) sbuild (999) 712 2026-10-08 18:22:11.000000 jtreg-test-output/jdk/1/JTreport/index.html │ │ │ │ │ --rw-r--r-- 0 sbuild (999) sbuild (999) 0 2026-10-08 18:22:11.000000 jtreg-test-output/jdk/1/JTreport/reportdir.dat │ │ │ │ │ -drwxr-xr-x 0 sbuild (999) sbuild (999) 0 2026-10-08 18:22:11.000000 jtreg-test-output/jdk/1/JTreport/html/ │ │ │ │ │ --rw-r--r-- 0 sbuild (999) sbuild (999) 762638 2026-10-08 18:22:11.000000 jtreg-test-output/jdk/1/JTreport/html/notRun_gr.html │ │ │ │ │ --rw-r--r-- 0 sbuild (999) sbuild (999) 762365 2026-10-08 18:22:11.000000 jtreg-test-output/jdk/1/JTreport/html/notRun.html │ │ │ │ │ --rw-r--r-- 0 sbuild (999) sbuild (999) 520 2026-10-08 18:22:11.000000 jtreg-test-output/jdk/1/JTreport/html/error_gr.html │ │ │ │ │ --rw-r--r-- 0 sbuild (999) sbuild (999) 472 2026-10-08 18:22:11.000000 jtreg-test-output/jdk/1/JTreport/html/error.html │ │ │ │ │ --rw-r--r-- 0 sbuild (999) sbuild (999) 2749 2026-10-08 18:22:11.000000 jtreg-test-output/jdk/1/JTreport/html/failed_gr.html │ │ │ │ │ --rw-r--r-- 0 sbuild (999) sbuild (999) 2019 2026-10-08 18:22:11.000000 jtreg-test-output/jdk/1/JTreport/html/failed.html │ │ │ │ │ --rw-r--r-- 0 sbuild (999) sbuild (999) 1251696 2026-10-08 18:22:11.000000 jtreg-test-output/jdk/1/JTreport/html/passed_gr.html │ │ │ │ │ --rw-r--r-- 0 sbuild (999) sbuild (999) 1250212 2026-10-08 18:22:11.000000 jtreg-test-output/jdk/1/JTreport/html/passed.html │ │ │ │ │ --rw-r--r-- 0 sbuild (999) sbuild (999) 83173 2026-10-08 18:22:11.000000 jtreg-test-output/jdk/1/JTreport/html/excluded.html │ │ │ │ │ --rw-r--r-- 0 sbuild (999) sbuild (999) 4235 2026-10-08 18:22:11.000000 jtreg-test-output/jdk/1/JTreport/html/env.html │ │ │ │ │ --rw-r--r-- 0 sbuild (999) sbuild (999) 24358 2026-10-08 18:22:11.000000 jtreg-test-output/jdk/1/JTreport/html/config.html │ │ │ │ │ --rw-r--r-- 0 sbuild (999) sbuild (999) 307 2026-10-08 18:22:10.000000 jtreg-test-output/jdk/1/JTreport/html/report.css │ │ │ │ │ --rw-r--r-- 0 sbuild (999) sbuild (999) 1101684 2026-10-08 18:22:11.000000 jtreg-test-output/jdk/1/JTreport/html/index.html │ │ │ │ │ --rw-r--r-- 0 sbuild (999) sbuild (999) 1101684 2026-10-08 18:22:11.000000 jtreg-test-output/jdk/1/JTreport/html/report.html │ │ │ │ │ -drwxr-xr-x 0 sbuild (999) sbuild (999) 0 2026-10-08 18:22:11.000000 jtreg-test-output/jdk/1/JTreport/text/ │ │ │ │ │ --rw-r--r-- 0 sbuild (999) sbuild (999) 132 2026-10-08 18:22:11.000000 jtreg-test-output/jdk/1/JTreport/text/testng.txt │ │ │ │ │ --rw-r--r-- 0 sbuild (999) sbuild (999) 1023408 2026-10-08 18:22:11.000000 jtreg-test-output/jdk/1/JTreport/text/notRun.txt │ │ │ │ │ --rw-r--r-- 0 sbuild (999) sbuild (999) 101 2026-10-08 18:22:11.000000 jtreg-test-output/jdk/1/JTreport/text/stats.txt │ │ │ │ │ --rw-r--r-- 0 sbuild (999) sbuild (999) 116 2026-10-08 18:22:11.000000 jtreg-test-output/jdk/1/JTreport/text/timeStats.txt │ │ │ │ │ --rw-r--r-- 0 sbuild (999) sbuild (999) 21 2026-10-08 18:22:11.000000 jtreg-test-output/jdk/1/JTreport/text/tc_newfailures.txt │ │ │ │ │ --rw-r--r-- 0 sbuild (999) sbuild (999) 21 2026-10-08 18:22:11.000000 jtreg-test-output/jdk/1/JTreport/text/tc_fail2notrun.txt │ │ │ │ │ --rw-r--r-- 0 sbuild (999) sbuild (999) 20 2026-10-08 18:22:11.000000 jtreg-test-output/jdk/1/JTreport/text/tc_fail2error.txt │ │ │ │ │ --rw-r--r-- 0 sbuild (999) sbuild (999) 19 2026-10-08 18:22:11.000000 jtreg-test-output/jdk/1/JTreport/text/tc_fail2pass.txt │ │ │ │ │ --rw-r--r-- 0 sbuild (999) sbuild (999) 22 2026-10-08 18:22:11.000000 jtreg-test-output/jdk/1/JTreport/text/tc_fail2missing.txt │ │ │ │ │ --rw-r--r-- 0 sbuild (999) sbuild (999) 19 2026-10-08 18:22:11.000000 jtreg-test-output/jdk/1/JTreport/text/other_errors.txt │ │ │ │ │ --rw-r--r-- 0 sbuild (999) sbuild (999) 416 2026-10-08 18:22:11.000000 jtreg-test-output/jdk/1/JTreport/text/newfailures.txt │ │ │ │ │ --rw-r--r-- 0 sbuild (999) sbuild (999) 16 2026-10-08 18:22:11.000000 jtreg-test-output/jdk/1/JTreport/text/fail2fail.txt │ │ │ │ │ --rw-r--r-- 0 sbuild (999) sbuild (999) 18 2026-10-08 18:22:11.000000 jtreg-test-output/jdk/1/JTreport/text/fail2notrun.txt │ │ │ │ │ --rw-r--r-- 0 sbuild (999) sbuild (999) 17 2026-10-08 18:22:11.000000 jtreg-test-output/jdk/1/JTreport/text/faiL2error.txt │ │ │ │ │ --rw-r--r-- 0 sbuild (999) sbuild (999) 16 2026-10-08 18:22:11.000000 jtreg-test-output/jdk/1/JTreport/text/fail2pass.txt │ │ │ │ │ --rw-r--r-- 0 sbuild (999) sbuild (999) 19 2026-10-08 18:22:11.000000 jtreg-test-output/jdk/1/JTreport/text/fail2missing.txt │ │ │ │ │ --rw-r--r-- 0 sbuild (999) sbuild (999) 890297 2026-10-08 18:22:11.000000 jtreg-test-output/jdk/1/JTreport/text/summary.txt │ │ │ │ │ --rw-r--r-- 0 sbuild (999) sbuild (999) 550 2026-10-08 18:21:58.000000 jtreg-test-output/jdk/1/JTreport/text/cmdArgs.txt │ │ │ │ │ -drwxr-xr-x 0 sbuild (999) sbuild (999) 0 2026-10-08 18:21:32.000000 jtreg-test-output/jdk/0/JTreport/ │ │ │ │ │ --rw-r--r-- 0 sbuild (999) sbuild (999) 712 2026-10-08 18:21:32.000000 jtreg-test-output/jdk/0/JTreport/index.html │ │ │ │ │ --rw-r--r-- 0 sbuild (999) sbuild (999) 0 2026-10-08 18:21:32.000000 jtreg-test-output/jdk/0/JTreport/reportdir.dat │ │ │ │ │ -drwxr-xr-x 0 sbuild (999) sbuild (999) 0 2026-10-08 18:21:31.000000 jtreg-test-output/jdk/0/JTreport/html/ │ │ │ │ │ --rw-r--r-- 0 sbuild (999) sbuild (999) 20683 2026-10-08 18:21:31.000000 jtreg-test-output/jdk/0/JTreport/html/notRun_gr.html │ │ │ │ │ --rw-r--r-- 0 sbuild (999) sbuild (999) 20338 2026-10-08 18:21:31.000000 jtreg-test-output/jdk/0/JTreport/html/notRun.html │ │ │ │ │ --rw-r--r-- 0 sbuild (999) sbuild (999) 520 2026-10-08 18:21:31.000000 jtreg-test-output/jdk/0/JTreport/html/error_gr.html │ │ │ │ │ --rw-r--r-- 0 sbuild (999) sbuild (999) 472 2026-10-08 18:21:31.000000 jtreg-test-output/jdk/0/JTreport/html/error.html │ │ │ │ │ --rw-r--r-- 0 sbuild (999) sbuild (999) 2749 2026-10-08 18:21:31.000000 jtreg-test-output/jdk/0/JTreport/html/failed_gr.html │ │ │ │ │ --rw-r--r-- 0 sbuild (999) sbuild (999) 2019 2026-10-08 18:21:31.000000 jtreg-test-output/jdk/0/JTreport/html/failed.html │ │ │ │ │ --rw-r--r-- 0 sbuild (999) sbuild (999) 1251696 2026-10-08 18:21:31.000000 jtreg-test-output/jdk/0/JTreport/html/passed_gr.html │ │ │ │ │ --rw-r--r-- 0 sbuild (999) sbuild (999) 1250212 2026-10-08 18:21:31.000000 jtreg-test-output/jdk/0/JTreport/html/passed.html │ │ │ │ │ --rw-r--r-- 0 sbuild (999) sbuild (999) 83173 2026-10-08 18:21:31.000000 jtreg-test-output/jdk/0/JTreport/html/excluded.html │ │ │ │ │ --rw-r--r-- 0 sbuild (999) sbuild (999) 4216 2026-10-08 18:21:31.000000 jtreg-test-output/jdk/0/JTreport/html/env.html │ │ │ │ │ --rw-r--r-- 0 sbuild (999) sbuild (999) 23926 2026-10-08 18:21:31.000000 jtreg-test-output/jdk/0/JTreport/html/config.html │ │ │ │ │ --rw-r--r-- 0 sbuild (999) sbuild (999) 307 2026-10-08 18:21:31.000000 jtreg-test-output/jdk/0/JTreport/html/report.css │ │ │ │ │ --rw-r--r-- 0 sbuild (999) sbuild (999) 1124337 2026-10-08 18:21:31.000000 jtreg-test-output/jdk/0/JTreport/html/index.html │ │ │ │ │ --rw-r--r-- 0 sbuild (999) sbuild (999) 1124337 2026-10-08 18:21:31.000000 jtreg-test-output/jdk/0/JTreport/html/report.html │ │ │ │ │ -drwxr-xr-x 0 sbuild (999) sbuild (999) 0 2026-10-08 18:21:32.000000 jtreg-test-output/jdk/0/JTreport/text/ │ │ │ │ │ --rw-r--r-- 0 sbuild (999) sbuild (999) 85819 2026-10-08 18:21:32.000000 jtreg-test-output/jdk/0/JTreport/text/junit.txt │ │ │ │ │ --rw-r--r-- 0 sbuild (999) sbuild (999) 132051 2026-10-08 18:21:32.000000 jtreg-test-output/jdk/0/JTreport/text/testng.txt │ │ │ │ │ --rw-r--r-- 0 sbuild (999) sbuild (999) 26283 2026-10-08 18:21:32.000000 jtreg-test-output/jdk/0/JTreport/text/notRun.txt │ │ │ │ │ --rw-r--r-- 0 sbuild (999) sbuild (999) 172 2026-10-08 18:21:32.000000 jtreg-test-output/jdk/0/JTreport/text/stats.txt │ │ │ │ │ --rw-r--r-- 0 sbuild (999) sbuild (999) 959 2026-10-08 18:21:32.000000 jtreg-test-output/jdk/0/JTreport/text/timeStats.txt │ │ │ │ │ --rw-r--r-- 0 sbuild (999) sbuild (999) 21 2026-10-08 18:21:32.000000 jtreg-test-output/jdk/0/JTreport/text/tc_newfailures.txt │ │ │ │ │ --rw-r--r-- 0 sbuild (999) sbuild (999) 21 2026-10-08 18:21:32.000000 jtreg-test-output/jdk/0/JTreport/text/tc_fail2notrun.txt │ │ │ │ │ --rw-r--r-- 0 sbuild (999) sbuild (999) 20 2026-10-08 18:21:32.000000 jtreg-test-output/jdk/0/JTreport/text/tc_fail2error.txt │ │ │ │ │ --rw-r--r-- 0 sbuild (999) sbuild (999) 19 2026-10-08 18:21:32.000000 jtreg-test-output/jdk/0/JTreport/text/tc_fail2pass.txt │ │ │ │ │ --rw-r--r-- 0 sbuild (999) sbuild (999) 22 2026-10-08 18:21:32.000000 jtreg-test-output/jdk/0/JTreport/text/tc_fail2missing.txt │ │ │ │ │ --rw-r--r-- 0 sbuild (999) sbuild (999) 19 2026-10-08 18:21:32.000000 jtreg-test-output/jdk/0/JTreport/text/other_errors.txt │ │ │ │ │ --rw-r--r-- 0 sbuild (999) sbuild (999) 416 2026-10-08 18:21:32.000000 jtreg-test-output/jdk/0/JTreport/text/newfailures.txt │ │ │ │ │ --rw-r--r-- 0 sbuild (999) sbuild (999) 16 2026-10-08 18:21:32.000000 jtreg-test-output/jdk/0/JTreport/text/fail2fail.txt │ │ │ │ │ --rw-r--r-- 0 sbuild (999) sbuild (999) 18 2026-10-08 18:21:32.000000 jtreg-test-output/jdk/0/JTreport/text/fail2notrun.txt │ │ │ │ │ --rw-r--r-- 0 sbuild (999) sbuild (999) 17 2026-10-08 18:21:32.000000 jtreg-test-output/jdk/0/JTreport/text/faiL2error.txt │ │ │ │ │ --rw-r--r-- 0 sbuild (999) sbuild (999) 16 2026-10-08 18:21:32.000000 jtreg-test-output/jdk/0/JTreport/text/fail2pass.txt │ │ │ │ │ --rw-r--r-- 0 sbuild (999) sbuild (999) 19 2026-10-08 18:21:32.000000 jtreg-test-output/jdk/0/JTreport/text/fail2missing.txt │ │ │ │ │ --rw-r--r-- 0 sbuild (999) sbuild (999) 890297 2026-10-08 18:21:32.000000 jtreg-test-output/jdk/0/JTreport/text/summary.txt │ │ │ │ │ --rw-r--r-- 0 sbuild (999) sbuild (999) 531 2026-10-08 14:09:24.000000 jtreg-test-output/jdk/0/JTreport/text/cmdArgs.txt │ │ │ │ │ -lrwxrwxrwx 0 sbuild (999) sbuild (999) 0 2026-10-08 14:09:20.000000 jtreg-test-output/jaxp/JTreport -> 0/JTreport │ │ │ │ │ -drwxr-xr-x 0 sbuild (999) sbuild (999) 0 2026-10-08 14:09:19.000000 jtreg-test-output/jaxp/0/JTreport/ │ │ │ │ │ --rw-r--r-- 0 sbuild (999) sbuild (999) 714 2026-10-08 14:09:19.000000 jtreg-test-output/jaxp/0/JTreport/index.html │ │ │ │ │ --rw-r--r-- 0 sbuild (999) sbuild (999) 0 2026-10-08 14:09:19.000000 jtreg-test-output/jaxp/0/JTreport/reportdir.dat │ │ │ │ │ -drwxr-xr-x 0 sbuild (999) sbuild (999) 0 2026-10-08 14:09:19.000000 jtreg-test-output/jaxp/0/JTreport/html/ │ │ │ │ │ --rw-r--r-- 0 sbuild (999) sbuild (999) 694 2026-10-08 14:09:19.000000 jtreg-test-output/jaxp/0/JTreport/html/notRun_gr.html │ │ │ │ │ --rw-r--r-- 0 sbuild (999) sbuild (999) 572 2026-10-08 14:09:19.000000 jtreg-test-output/jaxp/0/JTreport/html/notRun.html │ │ │ │ │ --rw-r--r-- 0 sbuild (999) sbuild (999) 520 2026-10-08 14:09:19.000000 jtreg-test-output/jaxp/0/JTreport/html/error_gr.html │ │ │ │ │ --rw-r--r-- 0 sbuild (999) sbuild (999) 472 2026-10-08 14:09:19.000000 jtreg-test-output/jaxp/0/JTreport/html/error.html │ │ │ │ │ --rw-r--r-- 0 sbuild (999) sbuild (999) 512 2026-10-08 14:09:19.000000 jtreg-test-output/jaxp/0/JTreport/html/failed_gr.html │ │ │ │ │ --rw-r--r-- 0 sbuild (999) sbuild (999) 464 2026-10-08 14:09:19.000000 jtreg-test-output/jaxp/0/JTreport/html/failed.html │ │ │ │ │ --rw-r--r-- 0 sbuild (999) sbuild (999) 110061 2026-10-08 14:09:19.000000 jtreg-test-output/jaxp/0/JTreport/html/passed_gr.html │ │ │ │ │ --rw-r--r-- 0 sbuild (999) sbuild (999) 109972 2026-10-08 14:09:19.000000 jtreg-test-output/jaxp/0/JTreport/html/passed.html │ │ │ │ │ --rw-r--r-- 0 sbuild (999) sbuild (999) 3641 2026-10-08 14:09:19.000000 jtreg-test-output/jaxp/0/JTreport/html/excluded.html │ │ │ │ │ --rw-r--r-- 0 sbuild (999) sbuild (999) 4124 2026-10-08 14:09:19.000000 jtreg-test-output/jaxp/0/JTreport/html/env.html │ │ │ │ │ --rw-r--r-- 0 sbuild (999) sbuild (999) 4425 2026-10-08 14:09:19.000000 jtreg-test-output/jaxp/0/JTreport/html/config.html │ │ │ │ │ --rw-r--r-- 0 sbuild (999) sbuild (999) 307 2026-10-08 14:09:18.000000 jtreg-test-output/jaxp/0/JTreport/html/report.css │ │ │ │ │ --rw-r--r-- 0 sbuild (999) sbuild (999) 58501 2026-10-08 14:09:19.000000 jtreg-test-output/jaxp/0/JTreport/html/index.html │ │ │ │ │ --rw-r--r-- 0 sbuild (999) sbuild (999) 58501 2026-10-08 14:09:19.000000 jtreg-test-output/jaxp/0/JTreport/html/report.html │ │ │ │ │ -drwxr-xr-x 0 sbuild (999) sbuild (999) 0 2026-10-08 14:09:19.000000 jtreg-test-output/jaxp/0/JTreport/text/ │ │ │ │ │ --rw-r--r-- 0 sbuild (999) sbuild (999) 200 2026-10-08 14:09:19.000000 jtreg-test-output/jaxp/0/JTreport/text/junit.txt │ │ │ │ │ --rw-r--r-- 0 sbuild (999) sbuild (999) 69461 2026-10-08 14:09:19.000000 jtreg-test-output/jaxp/0/JTreport/text/testng.txt │ │ │ │ │ --rw-r--r-- 0 sbuild (999) sbuild (999) 116 2026-10-08 14:09:19.000000 jtreg-test-output/jaxp/0/JTreport/text/notRun.txt │ │ │ │ │ --rw-r--r-- 0 sbuild (999) sbuild (999) 65 2026-10-08 14:09:19.000000 jtreg-test-output/jaxp/0/JTreport/text/stats.txt │ │ │ │ │ --rw-r--r-- 0 sbuild (999) sbuild (999) 154 2026-10-08 14:09:19.000000 jtreg-test-output/jaxp/0/JTreport/text/timeStats.txt │ │ │ │ │ --rw-r--r-- 0 sbuild (999) sbuild (999) 21 2026-10-08 14:09:19.000000 jtreg-test-output/jaxp/0/JTreport/text/tc_newfailures.txt │ │ │ │ │ --rw-r--r-- 0 sbuild (999) sbuild (999) 21 2026-10-08 14:09:19.000000 jtreg-test-output/jaxp/0/JTreport/text/tc_fail2notrun.txt │ │ │ │ │ --rw-r--r-- 0 sbuild (999) sbuild (999) 20 2026-10-08 14:09:19.000000 jtreg-test-output/jaxp/0/JTreport/text/tc_fail2error.txt │ │ │ │ │ --rw-r--r-- 0 sbuild (999) sbuild (999) 19 2026-10-08 14:09:19.000000 jtreg-test-output/jaxp/0/JTreport/text/tc_fail2pass.txt │ │ │ │ │ --rw-r--r-- 0 sbuild (999) sbuild (999) 22 2026-10-08 14:09:19.000000 jtreg-test-output/jaxp/0/JTreport/text/tc_fail2missing.txt │ │ │ │ │ --rw-r--r-- 0 sbuild (999) sbuild (999) 19 2026-10-08 14:09:19.000000 jtreg-test-output/jaxp/0/JTreport/text/other_errors.txt │ │ │ │ │ --rw-r--r-- 0 sbuild (999) sbuild (999) 18 2026-10-08 14:09:19.000000 jtreg-test-output/jaxp/0/JTreport/text/newfailures.txt │ │ │ │ │ --rw-r--r-- 0 sbuild (999) sbuild (999) 16 2026-10-08 14:09:19.000000 jtreg-test-output/jaxp/0/JTreport/text/fail2fail.txt │ │ │ │ │ --rw-r--r-- 0 sbuild (999) sbuild (999) 18 2026-10-08 14:09:19.000000 jtreg-test-output/jaxp/0/JTreport/text/fail2notrun.txt │ │ │ │ │ --rw-r--r-- 0 sbuild (999) sbuild (999) 17 2026-10-08 14:09:19.000000 jtreg-test-output/jaxp/0/JTreport/text/faiL2error.txt │ │ │ │ │ --rw-r--r-- 0 sbuild (999) sbuild (999) 16 2026-10-08 14:09:19.000000 jtreg-test-output/jaxp/0/JTreport/text/fail2pass.txt │ │ │ │ │ --rw-r--r-- 0 sbuild (999) sbuild (999) 19 2026-10-08 14:09:19.000000 jtreg-test-output/jaxp/0/JTreport/text/fail2missing.txt │ │ │ │ │ --rw-r--r-- 0 sbuild (999) sbuild (999) 59118 2026-10-08 14:09:19.000000 jtreg-test-output/jaxp/0/JTreport/text/summary.txt │ │ │ │ │ --rw-r--r-- 0 sbuild (999) sbuild (999) 439 2026-10-08 13:49:36.000000 jtreg-test-output/jaxp/0/JTreport/text/cmdArgs.txt │ │ │ │ │ -lrwxrwxrwx 0 sbuild (999) sbuild (999) 0 2026-10-08 13:49:36.000000 jtreg-test-output/langtools/JTreport -> 0/JTreport │ │ │ │ │ -drwxr-xr-x 0 sbuild (999) sbuild (999) 0 2026-10-08 13:49:20.000000 jtreg-test-output/langtools/0/JTreport/ │ │ │ │ │ --rw-r--r-- 0 sbuild (999) sbuild (999) 724 2026-10-08 13:49:20.000000 jtreg-test-output/langtools/0/JTreport/index.html │ │ │ │ │ --rw-r--r-- 0 sbuild (999) sbuild (999) 0 2026-10-08 13:49:20.000000 jtreg-test-output/langtools/0/JTreport/reportdir.dat │ │ │ │ │ -drwxr-xr-x 0 sbuild (999) sbuild (999) 0 2026-10-08 13:49:20.000000 jtreg-test-output/langtools/0/JTreport/html/ │ │ │ │ │ --rw-r--r-- 0 sbuild (999) sbuild (999) 2462 2026-10-08 13:49:20.000000 jtreg-test-output/langtools/0/JTreport/html/notRun_gr.html │ │ │ │ │ --rw-r--r-- 0 sbuild (999) sbuild (999) 2173 2026-10-08 13:49:20.000000 jtreg-test-output/langtools/0/JTreport/html/notRun.html │ │ │ │ │ --rw-r--r-- 0 sbuild (999) sbuild (999) 520 2026-10-08 13:49:20.000000 jtreg-test-output/langtools/0/JTreport/html/error_gr.html │ │ │ │ │ --rw-r--r-- 0 sbuild (999) sbuild (999) 472 2026-10-08 13:49:20.000000 jtreg-test-output/langtools/0/JTreport/html/error.html │ │ │ │ │ --rw-r--r-- 0 sbuild (999) sbuild (999) 512 2026-10-08 13:49:20.000000 jtreg-test-output/langtools/0/JTreport/html/failed_gr.html │ │ │ │ │ --rw-r--r-- 0 sbuild (999) sbuild (999) 464 2026-10-08 13:49:20.000000 jtreg-test-output/langtools/0/JTreport/html/failed.html │ │ │ │ │ --rw-r--r-- 0 sbuild (999) sbuild (999) 885491 2026-10-08 13:49:20.000000 jtreg-test-output/langtools/0/JTreport/html/passed_gr.html │ │ │ │ │ --rw-r--r-- 0 sbuild (999) sbuild (999) 885166 2026-10-08 13:49:20.000000 jtreg-test-output/langtools/0/JTreport/html/passed.html │ │ │ │ │ --rw-r--r-- 0 sbuild (999) sbuild (999) 6194 2026-10-08 13:49:20.000000 jtreg-test-output/langtools/0/JTreport/html/excluded.html │ │ │ │ │ --rw-r--r-- 0 sbuild (999) sbuild (999) 4139 2026-10-08 13:49:20.000000 jtreg-test-output/langtools/0/JTreport/html/env.html │ │ │ │ │ --rw-r--r-- 0 sbuild (999) sbuild (999) 10727 2026-10-08 13:49:20.000000 jtreg-test-output/langtools/0/JTreport/html/config.html │ │ │ │ │ --rw-r--r-- 0 sbuild (999) sbuild (999) 307 2026-10-08 13:49:19.000000 jtreg-test-output/langtools/0/JTreport/html/report.css │ │ │ │ │ --rw-r--r-- 0 sbuild (999) sbuild (999) 541946 2026-10-08 13:49:20.000000 jtreg-test-output/langtools/0/JTreport/html/index.html │ │ │ │ │ --rw-r--r-- 0 sbuild (999) sbuild (999) 541946 2026-10-08 13:49:20.000000 jtreg-test-output/langtools/0/JTreport/html/report.html │ │ │ │ │ -drwxr-xr-x 0 sbuild (999) sbuild (999) 0 2026-10-08 13:49:20.000000 jtreg-test-output/langtools/0/JTreport/text/ │ │ │ │ │ --rw-r--r-- 0 sbuild (999) sbuild (999) 18550 2026-10-08 13:49:20.000000 jtreg-test-output/langtools/0/JTreport/text/junit.txt │ │ │ │ │ --rw-r--r-- 0 sbuild (999) sbuild (999) 9538 2026-10-08 13:49:20.000000 jtreg-test-output/langtools/0/JTreport/text/testng.txt │ │ │ │ │ --rw-r--r-- 0 sbuild (999) sbuild (999) 1921 2026-10-08 13:49:20.000000 jtreg-test-output/langtools/0/JTreport/text/notRun.txt │ │ │ │ │ --rw-r--r-- 0 sbuild (999) sbuild (999) 120 2026-10-08 13:49:20.000000 jtreg-test-output/langtools/0/JTreport/text/stats.txt │ │ │ │ │ --rw-r--r-- 0 sbuild (999) sbuild (999) 454 2026-10-08 13:49:20.000000 jtreg-test-output/langtools/0/JTreport/text/timeStats.txt │ │ │ │ │ --rw-r--r-- 0 sbuild (999) sbuild (999) 21 2026-10-08 13:49:20.000000 jtreg-test-output/langtools/0/JTreport/text/tc_newfailures.txt │ │ │ │ │ --rw-r--r-- 0 sbuild (999) sbuild (999) 21 2026-10-08 13:49:20.000000 jtreg-test-output/langtools/0/JTreport/text/tc_fail2notrun.txt │ │ │ │ │ --rw-r--r-- 0 sbuild (999) sbuild (999) 20 2026-10-08 13:49:20.000000 jtreg-test-output/langtools/0/JTreport/text/tc_fail2error.txt │ │ │ │ │ --rw-r--r-- 0 sbuild (999) sbuild (999) 19 2026-10-08 13:49:20.000000 jtreg-test-output/langtools/0/JTreport/text/tc_fail2pass.txt │ │ │ │ │ --rw-r--r-- 0 sbuild (999) sbuild (999) 22 2026-10-08 13:49:20.000000 jtreg-test-output/langtools/0/JTreport/text/tc_fail2missing.txt │ │ │ │ │ --rw-r--r-- 0 sbuild (999) sbuild (999) 19 2026-10-08 13:49:20.000000 jtreg-test-output/langtools/0/JTreport/text/other_errors.txt │ │ │ │ │ --rw-r--r-- 0 sbuild (999) sbuild (999) 18 2026-10-08 13:49:20.000000 jtreg-test-output/langtools/0/JTreport/text/newfailures.txt │ │ │ │ │ --rw-r--r-- 0 sbuild (999) sbuild (999) 16 2026-10-08 13:49:20.000000 jtreg-test-output/langtools/0/JTreport/text/fail2fail.txt │ │ │ │ │ --rw-r--r-- 0 sbuild (999) sbuild (999) 18 2026-10-08 13:49:20.000000 jtreg-test-output/langtools/0/JTreport/text/fail2notrun.txt │ │ │ │ │ --rw-r--r-- 0 sbuild (999) sbuild (999) 17 2026-10-08 13:49:20.000000 jtreg-test-output/langtools/0/JTreport/text/faiL2error.txt │ │ │ │ │ --rw-r--r-- 0 sbuild (999) sbuild (999) 16 2026-10-08 13:49:20.000000 jtreg-test-output/langtools/0/JTreport/text/fail2pass.txt │ │ │ │ │ --rw-r--r-- 0 sbuild (999) sbuild (999) 19 2026-10-08 13:49:20.000000 jtreg-test-output/langtools/0/JTreport/text/fail2missing.txt │ │ │ │ │ --rw-r--r-- 0 sbuild (999) sbuild (999) 643622 2026-10-08 13:49:20.000000 jtreg-test-output/langtools/0/JTreport/text/summary.txt │ │ │ │ │ --rw-r--r-- 0 sbuild (999) sbuild (999) 454 2026-10-08 13:03:42.000000 jtreg-test-output/langtools/0/JTreport/text/cmdArgs.txt │ │ │ │ │ -lrwxrwxrwx 0 sbuild (999) sbuild (999) 0 2026-10-08 13:03:41.000000 jtreg-test-output/hotspot/JTreport -> 0/JTreport │ │ │ │ │ -drwxr-xr-x 0 sbuild (999) sbuild (999) 0 2026-10-08 13:03:30.000000 jtreg-test-output/hotspot/0/JTreport/ │ │ │ │ │ --rw-r--r-- 0 sbuild (999) sbuild (999) 726 2026-10-08 13:03:30.000000 jtreg-test-output/hotspot/0/JTreport/index.html │ │ │ │ │ --rw-r--r-- 0 sbuild (999) sbuild (999) 0 2026-10-08 13:03:30.000000 jtreg-test-output/hotspot/0/JTreport/reportdir.dat │ │ │ │ │ -drwxr-xr-x 0 sbuild (999) sbuild (999) 0 2026-10-08 13:03:29.000000 jtreg-test-output/hotspot/0/JTreport/html/ │ │ │ │ │ --rw-r--r-- 0 sbuild (999) sbuild (999) 38203 2026-10-08 13:03:29.000000 jtreg-test-output/hotspot/0/JTreport/html/notRun_gr.html │ │ │ │ │ --rw-r--r-- 0 sbuild (999) sbuild (999) 37914 2026-10-08 13:03:29.000000 jtreg-test-output/hotspot/0/JTreport/html/notRun.html │ │ │ │ │ --rw-r--r-- 0 sbuild (999) sbuild (999) 520 2026-10-08 13:03:29.000000 jtreg-test-output/hotspot/0/JTreport/html/error_gr.html │ │ │ │ │ --rw-r--r-- 0 sbuild (999) sbuild (999) 472 2026-10-08 13:03:29.000000 jtreg-test-output/hotspot/0/JTreport/html/error.html │ │ │ │ │ --rw-r--r-- 0 sbuild (999) sbuild (999) 512 2026-10-08 13:03:29.000000 jtreg-test-output/hotspot/0/JTreport/html/failed_gr.html │ │ │ │ │ --rw-r--r-- 0 sbuild (999) sbuild (999) 464 2026-10-08 13:03:29.000000 jtreg-test-output/hotspot/0/JTreport/html/failed.html │ │ │ │ │ --rw-r--r-- 0 sbuild (999) sbuild (999) 631071 2026-10-08 13:03:29.000000 jtreg-test-output/hotspot/0/JTreport/html/passed_gr.html │ │ │ │ │ --rw-r--r-- 0 sbuild (999) sbuild (999) 630642 2026-10-08 13:03:29.000000 jtreg-test-output/hotspot/0/JTreport/html/passed.html │ │ │ │ │ --rw-r--r-- 0 sbuild (999) sbuild (999) 18323 2026-10-08 13:03:29.000000 jtreg-test-output/hotspot/0/JTreport/html/excluded.html │ │ │ │ │ --rw-r--r-- 0 sbuild (999) sbuild (999) 4238 2026-10-08 13:03:29.000000 jtreg-test-output/hotspot/0/JTreport/html/env.html │ │ │ │ │ --rw-r--r-- 0 sbuild (999) sbuild (999) 78259 2026-10-08 13:03:29.000000 jtreg-test-output/hotspot/0/JTreport/html/config.html │ │ │ │ │ --rw-r--r-- 0 sbuild (999) sbuild (999) 307 2026-10-08 13:03:29.000000 jtreg-test-output/hotspot/0/JTreport/html/report.css │ │ │ │ │ --rw-r--r-- 0 sbuild (999) sbuild (999) 529204 2026-10-08 13:03:29.000000 jtreg-test-output/hotspot/0/JTreport/html/index.html │ │ │ │ │ --rw-r--r-- 0 sbuild (999) sbuild (999) 529204 2026-10-08 13:03:29.000000 jtreg-test-output/hotspot/0/JTreport/html/report.html │ │ │ │ │ -drwxr-xr-x 0 sbuild (999) sbuild (999) 0 2026-10-08 13:03:30.000000 jtreg-test-output/hotspot/0/JTreport/text/ │ │ │ │ │ --rw-r--r-- 0 sbuild (999) sbuild (999) 9713 2026-10-08 13:03:30.000000 jtreg-test-output/hotspot/0/JTreport/text/junit.txt │ │ │ │ │ --rw-r--r-- 0 sbuild (999) sbuild (999) 9190 2026-10-08 13:03:30.000000 jtreg-test-output/hotspot/0/JTreport/text/testng.txt │ │ │ │ │ --rw-r--r-- 0 sbuild (999) sbuild (999) 50907 2026-10-08 13:03:30.000000 jtreg-test-output/hotspot/0/JTreport/text/notRun.txt │ │ │ │ │ --rw-r--r-- 0 sbuild (999) sbuild (999) 123 2026-10-08 13:03:30.000000 jtreg-test-output/hotspot/0/JTreport/text/stats.txt │ │ │ │ │ --rw-r--r-- 0 sbuild (999) sbuild (999) 815 2026-10-08 13:03:30.000000 jtreg-test-output/hotspot/0/JTreport/text/timeStats.txt │ │ │ │ │ --rw-r--r-- 0 sbuild (999) sbuild (999) 21 2026-10-08 13:03:30.000000 jtreg-test-output/hotspot/0/JTreport/text/tc_newfailures.txt │ │ │ │ │ --rw-r--r-- 0 sbuild (999) sbuild (999) 21 2026-10-08 13:03:30.000000 jtreg-test-output/hotspot/0/JTreport/text/tc_fail2notrun.txt │ │ │ │ │ --rw-r--r-- 0 sbuild (999) sbuild (999) 20 2026-10-08 13:03:30.000000 jtreg-test-output/hotspot/0/JTreport/text/tc_fail2error.txt │ │ │ │ │ --rw-r--r-- 0 sbuild (999) sbuild (999) 19 2026-10-08 13:03:30.000000 jtreg-test-output/hotspot/0/JTreport/text/tc_fail2pass.txt │ │ │ │ │ --rw-r--r-- 0 sbuild (999) sbuild (999) 22 2026-10-08 13:03:30.000000 jtreg-test-output/hotspot/0/JTreport/text/tc_fail2missing.txt │ │ │ │ │ --rw-r--r-- 0 sbuild (999) sbuild (999) 19 2026-10-08 13:03:30.000000 jtreg-test-output/hotspot/0/JTreport/text/other_errors.txt │ │ │ │ │ --rw-r--r-- 0 sbuild (999) sbuild (999) 18 2026-10-08 13:03:30.000000 jtreg-test-output/hotspot/0/JTreport/text/newfailures.txt │ │ │ │ │ --rw-r--r-- 0 sbuild (999) sbuild (999) 16 2026-10-08 13:03:30.000000 jtreg-test-output/hotspot/0/JTreport/text/fail2fail.txt │ │ │ │ │ --rw-r--r-- 0 sbuild (999) sbuild (999) 18 2026-10-08 13:03:30.000000 jtreg-test-output/hotspot/0/JTreport/text/fail2notrun.txt │ │ │ │ │ --rw-r--r-- 0 sbuild (999) sbuild (999) 17 2026-10-08 13:03:30.000000 jtreg-test-output/hotspot/0/JTreport/text/faiL2error.txt │ │ │ │ │ --rw-r--r-- 0 sbuild (999) sbuild (999) 16 2026-10-08 13:03:30.000000 jtreg-test-output/hotspot/0/JTreport/text/fail2pass.txt │ │ │ │ │ --rw-r--r-- 0 sbuild (999) sbuild (999) 19 2026-10-08 13:03:30.000000 jtreg-test-output/hotspot/0/JTreport/text/fail2missing.txt │ │ │ │ │ --rw-r--r-- 0 sbuild (999) sbuild (999) 475251 2026-10-08 13:03:30.000000 jtreg-test-output/hotspot/0/JTreport/text/summary.txt │ │ │ │ │ --rw-r--r-- 0 sbuild (999) sbuild (999) 553 2026-10-08 10:01:38.000000 jtreg-test-output/hotspot/0/JTreport/text/cmdArgs.txt │ │ │ │ │ +drwxr-xr-x 0 sbuild (999) sbuild (999) 0 2026-10-15 15:31:04.000000 jtreg-test-output/jdk/1/JTreport/ │ │ │ │ │ +-rw-r--r-- 0 sbuild (999) sbuild (999) 712 2026-10-15 15:31:04.000000 jtreg-test-output/jdk/1/JTreport/index.html │ │ │ │ │ +drwxr-xr-x 0 sbuild (999) sbuild (999) 0 2026-10-15 15:31:03.000000 jtreg-test-output/jdk/1/JTreport/html/ │ │ │ │ │ +-rw-r--r-- 0 sbuild (999) sbuild (999) 762366 2026-10-15 15:31:03.000000 jtreg-test-output/jdk/1/JTreport/html/notRun.html │ │ │ │ │ +-rw-r--r-- 0 sbuild (999) sbuild (999) 1101685 2026-10-15 15:31:03.000000 jtreg-test-output/jdk/1/JTreport/html/report.html │ │ │ │ │ +-rw-r--r-- 0 sbuild (999) sbuild (999) 83174 2026-10-15 15:31:03.000000 jtreg-test-output/jdk/1/JTreport/html/excluded.html │ │ │ │ │ +-rw-r--r-- 0 sbuild (999) sbuild (999) 473 2026-10-15 15:31:03.000000 jtreg-test-output/jdk/1/JTreport/html/error.html │ │ │ │ │ +-rw-r--r-- 0 sbuild (999) sbuild (999) 521 2026-10-15 15:31:03.000000 jtreg-test-output/jdk/1/JTreport/html/error_gr.html │ │ │ │ │ +-rw-r--r-- 0 sbuild (999) sbuild (999) 1101685 2026-10-15 15:31:03.000000 jtreg-test-output/jdk/1/JTreport/html/index.html │ │ │ │ │ +-rw-r--r-- 0 sbuild (999) sbuild (999) 1251256 2026-10-15 15:31:03.000000 jtreg-test-output/jdk/1/JTreport/html/passed_gr.html │ │ │ │ │ +-rw-r--r-- 0 sbuild (999) sbuild (999) 2750 2026-10-15 15:31:03.000000 jtreg-test-output/jdk/1/JTreport/html/failed_gr.html │ │ │ │ │ +-rw-r--r-- 0 sbuild (999) sbuild (999) 2020 2026-10-15 15:31:03.000000 jtreg-test-output/jdk/1/JTreport/html/failed.html │ │ │ │ │ +-rw-r--r-- 0 sbuild (999) sbuild (999) 4242 2026-10-15 15:31:03.000000 jtreg-test-output/jdk/1/JTreport/html/env.html │ │ │ │ │ +-rw-r--r-- 0 sbuild (999) sbuild (999) 762639 2026-10-15 15:31:03.000000 jtreg-test-output/jdk/1/JTreport/html/notRun_gr.html │ │ │ │ │ +-rw-r--r-- 0 sbuild (999) sbuild (999) 307 2026-10-15 15:31:03.000000 jtreg-test-output/jdk/1/JTreport/html/report.css │ │ │ │ │ +-rw-r--r-- 0 sbuild (999) sbuild (999) 24358 2026-10-15 15:31:03.000000 jtreg-test-output/jdk/1/JTreport/html/config.html │ │ │ │ │ +-rw-r--r-- 0 sbuild (999) sbuild (999) 1250213 2026-10-15 15:31:03.000000 jtreg-test-output/jdk/1/JTreport/html/passed.html │ │ │ │ │ +drwxr-xr-x 0 sbuild (999) sbuild (999) 0 2026-10-15 15:31:04.000000 jtreg-test-output/jdk/1/JTreport/text/ │ │ │ │ │ +-rw-r--r-- 0 sbuild (999) sbuild (999) 889982 2026-10-15 15:31:04.000000 jtreg-test-output/jdk/1/JTreport/text/summary.txt │ │ │ │ │ +-rw-r--r-- 0 sbuild (999) sbuild (999) 20 2026-10-15 15:31:04.000000 jtreg-test-output/jdk/1/JTreport/text/tc_fail2error.txt │ │ │ │ │ +-rw-r--r-- 0 sbuild (999) sbuild (999) 19 2026-10-15 15:31:04.000000 jtreg-test-output/jdk/1/JTreport/text/tc_fail2pass.txt │ │ │ │ │ +-rw-r--r-- 0 sbuild (999) sbuild (999) 116 2026-10-15 15:31:04.000000 jtreg-test-output/jdk/1/JTreport/text/timeStats.txt │ │ │ │ │ +-rw-r--r-- 0 sbuild (999) sbuild (999) 21 2026-10-15 15:31:04.000000 jtreg-test-output/jdk/1/JTreport/text/tc_fail2notrun.txt │ │ │ │ │ +-rw-r--r-- 0 sbuild (999) sbuild (999) 19 2026-10-15 15:31:04.000000 jtreg-test-output/jdk/1/JTreport/text/fail2missing.txt │ │ │ │ │ +-rw-r--r-- 0 sbuild (999) sbuild (999) 16 2026-10-15 15:31:04.000000 jtreg-test-output/jdk/1/JTreport/text/fail2fail.txt │ │ │ │ │ +-rw-r--r-- 0 sbuild (999) sbuild (999) 22 2026-10-15 15:31:04.000000 jtreg-test-output/jdk/1/JTreport/text/tc_fail2missing.txt │ │ │ │ │ +-rw-r--r-- 0 sbuild (999) sbuild (999) 16 2026-10-15 15:31:04.000000 jtreg-test-output/jdk/1/JTreport/text/fail2pass.txt │ │ │ │ │ +-rw-r--r-- 0 sbuild (999) sbuild (999) 19 2026-10-15 15:31:04.000000 jtreg-test-output/jdk/1/JTreport/text/other_errors.txt │ │ │ │ │ +-rw-r--r-- 0 sbuild (999) sbuild (999) 17 2026-10-15 15:31:04.000000 jtreg-test-output/jdk/1/JTreport/text/faiL2error.txt │ │ │ │ │ +-rw-r--r-- 0 sbuild (999) sbuild (999) 21 2026-10-15 15:31:04.000000 jtreg-test-output/jdk/1/JTreport/text/tc_newfailures.txt │ │ │ │ │ +-rw-r--r-- 0 sbuild (999) sbuild (999) 101 2026-10-15 15:31:04.000000 jtreg-test-output/jdk/1/JTreport/text/stats.txt │ │ │ │ │ +-rw-r--r-- 0 sbuild (999) sbuild (999) 550 2026-10-15 15:30:47.000000 jtreg-test-output/jdk/1/JTreport/text/cmdArgs.txt │ │ │ │ │ +-rw-r--r-- 0 sbuild (999) sbuild (999) 416 2026-10-15 15:31:04.000000 jtreg-test-output/jdk/1/JTreport/text/newfailures.txt │ │ │ │ │ +-rw-r--r-- 0 sbuild (999) sbuild (999) 132 2026-10-15 15:31:04.000000 jtreg-test-output/jdk/1/JTreport/text/testng.txt │ │ │ │ │ +-rw-r--r-- 0 sbuild (999) sbuild (999) 1023408 2026-10-15 15:31:04.000000 jtreg-test-output/jdk/1/JTreport/text/notRun.txt │ │ │ │ │ +-rw-r--r-- 0 sbuild (999) sbuild (999) 18 2026-10-15 15:31:04.000000 jtreg-test-output/jdk/1/JTreport/text/fail2notrun.txt │ │ │ │ │ +-rw-r--r-- 0 sbuild (999) sbuild (999) 0 2026-10-15 15:31:04.000000 jtreg-test-output/jdk/1/JTreport/reportdir.dat │ │ │ │ │ +drwxr-xr-x 0 sbuild (999) sbuild (999) 0 2026-10-15 15:30:15.000000 jtreg-test-output/jdk/0/JTreport/ │ │ │ │ │ +-rw-r--r-- 0 sbuild (999) sbuild (999) 712 2026-10-15 15:30:15.000000 jtreg-test-output/jdk/0/JTreport/index.html │ │ │ │ │ +drwxr-xr-x 0 sbuild (999) sbuild (999) 0 2026-10-15 15:30:15.000000 jtreg-test-output/jdk/0/JTreport/html/ │ │ │ │ │ +-rw-r--r-- 0 sbuild (999) sbuild (999) 20339 2026-10-15 15:30:15.000000 jtreg-test-output/jdk/0/JTreport/html/notRun.html │ │ │ │ │ +-rw-r--r-- 0 sbuild (999) sbuild (999) 1124338 2026-10-15 15:30:14.000000 jtreg-test-output/jdk/0/JTreport/html/report.html │ │ │ │ │ +-rw-r--r-- 0 sbuild (999) sbuild (999) 83174 2026-10-15 15:30:14.000000 jtreg-test-output/jdk/0/JTreport/html/excluded.html │ │ │ │ │ +-rw-r--r-- 0 sbuild (999) sbuild (999) 473 2026-10-15 15:30:15.000000 jtreg-test-output/jdk/0/JTreport/html/error.html │ │ │ │ │ +-rw-r--r-- 0 sbuild (999) sbuild (999) 521 2026-10-15 15:30:15.000000 jtreg-test-output/jdk/0/JTreport/html/error_gr.html │ │ │ │ │ +-rw-r--r-- 0 sbuild (999) sbuild (999) 1124338 2026-10-15 15:30:14.000000 jtreg-test-output/jdk/0/JTreport/html/index.html │ │ │ │ │ +-rw-r--r-- 0 sbuild (999) sbuild (999) 1251256 2026-10-15 15:30:15.000000 jtreg-test-output/jdk/0/JTreport/html/passed_gr.html │ │ │ │ │ +-rw-r--r-- 0 sbuild (999) sbuild (999) 2750 2026-10-15 15:30:15.000000 jtreg-test-output/jdk/0/JTreport/html/failed_gr.html │ │ │ │ │ +-rw-r--r-- 0 sbuild (999) sbuild (999) 2020 2026-10-15 15:30:15.000000 jtreg-test-output/jdk/0/JTreport/html/failed.html │ │ │ │ │ +-rw-r--r-- 0 sbuild (999) sbuild (999) 4223 2026-10-15 15:30:14.000000 jtreg-test-output/jdk/0/JTreport/html/env.html │ │ │ │ │ +-rw-r--r-- 0 sbuild (999) sbuild (999) 20684 2026-10-15 15:30:15.000000 jtreg-test-output/jdk/0/JTreport/html/notRun_gr.html │ │ │ │ │ +-rw-r--r-- 0 sbuild (999) sbuild (999) 307 2026-10-15 15:30:14.000000 jtreg-test-output/jdk/0/JTreport/html/report.css │ │ │ │ │ +-rw-r--r-- 0 sbuild (999) sbuild (999) 23926 2026-10-15 15:30:14.000000 jtreg-test-output/jdk/0/JTreport/html/config.html │ │ │ │ │ +-rw-r--r-- 0 sbuild (999) sbuild (999) 1250213 2026-10-15 15:30:15.000000 jtreg-test-output/jdk/0/JTreport/html/passed.html │ │ │ │ │ +drwxr-xr-x 0 sbuild (999) sbuild (999) 0 2026-10-15 15:30:15.000000 jtreg-test-output/jdk/0/JTreport/text/ │ │ │ │ │ +-rw-r--r-- 0 sbuild (999) sbuild (999) 889982 2026-10-15 15:30:15.000000 jtreg-test-output/jdk/0/JTreport/text/summary.txt │ │ │ │ │ +-rw-r--r-- 0 sbuild (999) sbuild (999) 20 2026-10-15 15:30:15.000000 jtreg-test-output/jdk/0/JTreport/text/tc_fail2error.txt │ │ │ │ │ +-rw-r--r-- 0 sbuild (999) sbuild (999) 19 2026-10-15 15:30:15.000000 jtreg-test-output/jdk/0/JTreport/text/tc_fail2pass.txt │ │ │ │ │ +-rw-r--r-- 0 sbuild (999) sbuild (999) 995 2026-10-15 15:30:15.000000 jtreg-test-output/jdk/0/JTreport/text/timeStats.txt │ │ │ │ │ +-rw-r--r-- 0 sbuild (999) sbuild (999) 21 2026-10-15 15:30:15.000000 jtreg-test-output/jdk/0/JTreport/text/tc_fail2notrun.txt │ │ │ │ │ +-rw-r--r-- 0 sbuild (999) sbuild (999) 19 2026-10-15 15:30:15.000000 jtreg-test-output/jdk/0/JTreport/text/fail2missing.txt │ │ │ │ │ +-rw-r--r-- 0 sbuild (999) sbuild (999) 16 2026-10-15 15:30:15.000000 jtreg-test-output/jdk/0/JTreport/text/fail2fail.txt │ │ │ │ │ +-rw-r--r-- 0 sbuild (999) sbuild (999) 22 2026-10-15 15:30:15.000000 jtreg-test-output/jdk/0/JTreport/text/tc_fail2missing.txt │ │ │ │ │ +-rw-r--r-- 0 sbuild (999) sbuild (999) 16 2026-10-15 15:30:15.000000 jtreg-test-output/jdk/0/JTreport/text/fail2pass.txt │ │ │ │ │ +-rw-r--r-- 0 sbuild (999) sbuild (999) 19 2026-10-15 15:30:15.000000 jtreg-test-output/jdk/0/JTreport/text/other_errors.txt │ │ │ │ │ +-rw-r--r-- 0 sbuild (999) sbuild (999) 17 2026-10-15 15:30:15.000000 jtreg-test-output/jdk/0/JTreport/text/faiL2error.txt │ │ │ │ │ +-rw-r--r-- 0 sbuild (999) sbuild (999) 21 2026-10-15 15:30:15.000000 jtreg-test-output/jdk/0/JTreport/text/tc_newfailures.txt │ │ │ │ │ +-rw-r--r-- 0 sbuild (999) sbuild (999) 172 2026-10-15 15:30:15.000000 jtreg-test-output/jdk/0/JTreport/text/stats.txt │ │ │ │ │ +-rw-r--r-- 0 sbuild (999) sbuild (999) 531 2026-10-15 10:39:33.000000 jtreg-test-output/jdk/0/JTreport/text/cmdArgs.txt │ │ │ │ │ +-rw-r--r-- 0 sbuild (999) sbuild (999) 416 2026-10-15 15:30:15.000000 jtreg-test-output/jdk/0/JTreport/text/newfailures.txt │ │ │ │ │ +-rw-r--r-- 0 sbuild (999) sbuild (999) 132051 2026-10-15 15:30:15.000000 jtreg-test-output/jdk/0/JTreport/text/testng.txt │ │ │ │ │ +-rw-r--r-- 0 sbuild (999) sbuild (999) 26283 2026-10-15 15:30:15.000000 jtreg-test-output/jdk/0/JTreport/text/notRun.txt │ │ │ │ │ +-rw-r--r-- 0 sbuild (999) sbuild (999) 85819 2026-10-15 15:30:15.000000 jtreg-test-output/jdk/0/JTreport/text/junit.txt │ │ │ │ │ +-rw-r--r-- 0 sbuild (999) sbuild (999) 18 2026-10-15 15:30:15.000000 jtreg-test-output/jdk/0/JTreport/text/fail2notrun.txt │ │ │ │ │ +-rw-r--r-- 0 sbuild (999) sbuild (999) 0 2026-10-15 15:30:15.000000 jtreg-test-output/jdk/0/JTreport/reportdir.dat │ │ │ │ │ +drwxr-xr-x 0 sbuild (999) sbuild (999) 0 2026-10-15 15:31:42.000000 jtreg-test-output/jdk/2/JTreport/ │ │ │ │ │ +-rw-r--r-- 0 sbuild (999) sbuild (999) 712 2026-10-15 15:31:42.000000 jtreg-test-output/jdk/2/JTreport/index.html │ │ │ │ │ +drwxr-xr-x 0 sbuild (999) sbuild (999) 0 2026-10-15 15:31:42.000000 jtreg-test-output/jdk/2/JTreport/html/ │ │ │ │ │ +-rw-r--r-- 0 sbuild (999) sbuild (999) 762366 2026-10-15 15:31:42.000000 jtreg-test-output/jdk/2/JTreport/html/notRun.html │ │ │ │ │ +-rw-r--r-- 0 sbuild (999) sbuild (999) 1101685 2026-10-15 15:31:42.000000 jtreg-test-output/jdk/2/JTreport/html/report.html │ │ │ │ │ +-rw-r--r-- 0 sbuild (999) sbuild (999) 83174 2026-10-15 15:31:42.000000 jtreg-test-output/jdk/2/JTreport/html/excluded.html │ │ │ │ │ +-rw-r--r-- 0 sbuild (999) sbuild (999) 473 2026-10-15 15:31:42.000000 jtreg-test-output/jdk/2/JTreport/html/error.html │ │ │ │ │ +-rw-r--r-- 0 sbuild (999) sbuild (999) 521 2026-10-15 15:31:42.000000 jtreg-test-output/jdk/2/JTreport/html/error_gr.html │ │ │ │ │ +-rw-r--r-- 0 sbuild (999) sbuild (999) 1101685 2026-10-15 15:31:42.000000 jtreg-test-output/jdk/2/JTreport/html/index.html │ │ │ │ │ +-rw-r--r-- 0 sbuild (999) sbuild (999) 1251256 2026-10-15 15:31:42.000000 jtreg-test-output/jdk/2/JTreport/html/passed_gr.html │ │ │ │ │ +-rw-r--r-- 0 sbuild (999) sbuild (999) 2750 2026-10-15 15:31:42.000000 jtreg-test-output/jdk/2/JTreport/html/failed_gr.html │ │ │ │ │ +-rw-r--r-- 0 sbuild (999) sbuild (999) 2020 2026-10-15 15:31:42.000000 jtreg-test-output/jdk/2/JTreport/html/failed.html │ │ │ │ │ +-rw-r--r-- 0 sbuild (999) sbuild (999) 4242 2026-10-15 15:31:42.000000 jtreg-test-output/jdk/2/JTreport/html/env.html │ │ │ │ │ +-rw-r--r-- 0 sbuild (999) sbuild (999) 762639 2026-10-15 15:31:42.000000 jtreg-test-output/jdk/2/JTreport/html/notRun_gr.html │ │ │ │ │ +-rw-r--r-- 0 sbuild (999) sbuild (999) 307 2026-10-15 15:31:41.000000 jtreg-test-output/jdk/2/JTreport/html/report.css │ │ │ │ │ +-rw-r--r-- 0 sbuild (999) sbuild (999) 24358 2026-10-15 15:31:42.000000 jtreg-test-output/jdk/2/JTreport/html/config.html │ │ │ │ │ +-rw-r--r-- 0 sbuild (999) sbuild (999) 1250213 2026-10-15 15:31:42.000000 jtreg-test-output/jdk/2/JTreport/html/passed.html │ │ │ │ │ +drwxr-xr-x 0 sbuild (999) sbuild (999) 0 2026-10-15 15:31:42.000000 jtreg-test-output/jdk/2/JTreport/text/ │ │ │ │ │ +-rw-r--r-- 0 sbuild (999) sbuild (999) 889982 2026-10-15 15:31:42.000000 jtreg-test-output/jdk/2/JTreport/text/summary.txt │ │ │ │ │ +-rw-r--r-- 0 sbuild (999) sbuild (999) 20 2026-10-15 15:31:42.000000 jtreg-test-output/jdk/2/JTreport/text/tc_fail2error.txt │ │ │ │ │ +-rw-r--r-- 0 sbuild (999) sbuild (999) 19 2026-10-15 15:31:42.000000 jtreg-test-output/jdk/2/JTreport/text/tc_fail2pass.txt │ │ │ │ │ +-rw-r--r-- 0 sbuild (999) sbuild (999) 116 2026-10-15 15:31:42.000000 jtreg-test-output/jdk/2/JTreport/text/timeStats.txt │ │ │ │ │ +-rw-r--r-- 0 sbuild (999) sbuild (999) 21 2026-10-15 15:31:42.000000 jtreg-test-output/jdk/2/JTreport/text/tc_fail2notrun.txt │ │ │ │ │ +-rw-r--r-- 0 sbuild (999) sbuild (999) 19 2026-10-15 15:31:42.000000 jtreg-test-output/jdk/2/JTreport/text/fail2missing.txt │ │ │ │ │ +-rw-r--r-- 0 sbuild (999) sbuild (999) 16 2026-10-15 15:31:42.000000 jtreg-test-output/jdk/2/JTreport/text/fail2fail.txt │ │ │ │ │ +-rw-r--r-- 0 sbuild (999) sbuild (999) 22 2026-10-15 15:31:42.000000 jtreg-test-output/jdk/2/JTreport/text/tc_fail2missing.txt │ │ │ │ │ +-rw-r--r-- 0 sbuild (999) sbuild (999) 16 2026-10-15 15:31:42.000000 jtreg-test-output/jdk/2/JTreport/text/fail2pass.txt │ │ │ │ │ +-rw-r--r-- 0 sbuild (999) sbuild (999) 19 2026-10-15 15:31:42.000000 jtreg-test-output/jdk/2/JTreport/text/other_errors.txt │ │ │ │ │ +-rw-r--r-- 0 sbuild (999) sbuild (999) 17 2026-10-15 15:31:42.000000 jtreg-test-output/jdk/2/JTreport/text/faiL2error.txt │ │ │ │ │ +-rw-r--r-- 0 sbuild (999) sbuild (999) 21 2026-10-15 15:31:42.000000 jtreg-test-output/jdk/2/JTreport/text/tc_newfailures.txt │ │ │ │ │ +-rw-r--r-- 0 sbuild (999) sbuild (999) 101 2026-10-15 15:31:42.000000 jtreg-test-output/jdk/2/JTreport/text/stats.txt │ │ │ │ │ +-rw-r--r-- 0 sbuild (999) sbuild (999) 550 2026-10-15 15:31:28.000000 jtreg-test-output/jdk/2/JTreport/text/cmdArgs.txt │ │ │ │ │ +-rw-r--r-- 0 sbuild (999) sbuild (999) 416 2026-10-15 15:31:42.000000 jtreg-test-output/jdk/2/JTreport/text/newfailures.txt │ │ │ │ │ +-rw-r--r-- 0 sbuild (999) sbuild (999) 132 2026-10-15 15:31:42.000000 jtreg-test-output/jdk/2/JTreport/text/testng.txt │ │ │ │ │ +-rw-r--r-- 0 sbuild (999) sbuild (999) 1023408 2026-10-15 15:31:42.000000 jtreg-test-output/jdk/2/JTreport/text/notRun.txt │ │ │ │ │ +-rw-r--r-- 0 sbuild (999) sbuild (999) 18 2026-10-15 15:31:42.000000 jtreg-test-output/jdk/2/JTreport/text/fail2notrun.txt │ │ │ │ │ +-rw-r--r-- 0 sbuild (999) sbuild (999) 0 2026-10-15 15:31:42.000000 jtreg-test-output/jdk/2/JTreport/reportdir.dat │ │ │ │ │ +lrwxrwxrwx 0 sbuild (999) sbuild (999) 0 2026-10-15 15:32:03.000000 jtreg-test-output/jdk/JTreport -> 2/JTreport │ │ │ │ │ +drwxr-xr-x 0 sbuild (999) sbuild (999) 0 2026-10-15 10:01:18.000000 jtreg-test-output/langtools/0/JTreport/ │ │ │ │ │ +-rw-r--r-- 0 sbuild (999) sbuild (999) 724 2026-10-15 10:01:18.000000 jtreg-test-output/langtools/0/JTreport/index.html │ │ │ │ │ +drwxr-xr-x 0 sbuild (999) sbuild (999) 0 2026-10-15 10:01:18.000000 jtreg-test-output/langtools/0/JTreport/html/ │ │ │ │ │ +-rw-r--r-- 0 sbuild (999) sbuild (999) 2175 2026-10-15 10:01:18.000000 jtreg-test-output/langtools/0/JTreport/html/notRun.html │ │ │ │ │ +-rw-r--r-- 0 sbuild (999) sbuild (999) 541948 2026-10-15 10:01:17.000000 jtreg-test-output/langtools/0/JTreport/html/report.html │ │ │ │ │ +-rw-r--r-- 0 sbuild (999) sbuild (999) 6196 2026-10-15 10:01:17.000000 jtreg-test-output/langtools/0/JTreport/html/excluded.html │ │ │ │ │ +-rw-r--r-- 0 sbuild (999) sbuild (999) 474 2026-10-15 10:01:18.000000 jtreg-test-output/langtools/0/JTreport/html/error.html │ │ │ │ │ +-rw-r--r-- 0 sbuild (999) sbuild (999) 522 2026-10-15 10:01:18.000000 jtreg-test-output/langtools/0/JTreport/html/error_gr.html │ │ │ │ │ +-rw-r--r-- 0 sbuild (999) sbuild (999) 541948 2026-10-15 10:01:17.000000 jtreg-test-output/langtools/0/JTreport/html/index.html │ │ │ │ │ +-rw-r--r-- 0 sbuild (999) sbuild (999) 885493 2026-10-15 10:01:18.000000 jtreg-test-output/langtools/0/JTreport/html/passed_gr.html │ │ │ │ │ +-rw-r--r-- 0 sbuild (999) sbuild (999) 514 2026-10-15 10:01:18.000000 jtreg-test-output/langtools/0/JTreport/html/failed_gr.html │ │ │ │ │ +-rw-r--r-- 0 sbuild (999) sbuild (999) 466 2026-10-15 10:01:18.000000 jtreg-test-output/langtools/0/JTreport/html/failed.html │ │ │ │ │ +-rw-r--r-- 0 sbuild (999) sbuild (999) 4147 2026-10-15 10:01:17.000000 jtreg-test-output/langtools/0/JTreport/html/env.html │ │ │ │ │ +-rw-r--r-- 0 sbuild (999) sbuild (999) 2464 2026-10-15 10:01:18.000000 jtreg-test-output/langtools/0/JTreport/html/notRun_gr.html │ │ │ │ │ +-rw-r--r-- 0 sbuild (999) sbuild (999) 307 2026-10-15 10:01:17.000000 jtreg-test-output/langtools/0/JTreport/html/report.css │ │ │ │ │ +-rw-r--r-- 0 sbuild (999) sbuild (999) 10727 2026-10-15 10:01:17.000000 jtreg-test-output/langtools/0/JTreport/html/config.html │ │ │ │ │ +-rw-r--r-- 0 sbuild (999) sbuild (999) 885168 2026-10-15 10:01:18.000000 jtreg-test-output/langtools/0/JTreport/html/passed.html │ │ │ │ │ +drwxr-xr-x 0 sbuild (999) sbuild (999) 0 2026-10-15 10:01:18.000000 jtreg-test-output/langtools/0/JTreport/text/ │ │ │ │ │ +-rw-r--r-- 0 sbuild (999) sbuild (999) 643622 2026-10-15 10:01:18.000000 jtreg-test-output/langtools/0/JTreport/text/summary.txt │ │ │ │ │ +-rw-r--r-- 0 sbuild (999) sbuild (999) 20 2026-10-15 10:01:18.000000 jtreg-test-output/langtools/0/JTreport/text/tc_fail2error.txt │ │ │ │ │ +-rw-r--r-- 0 sbuild (999) sbuild (999) 19 2026-10-15 10:01:18.000000 jtreg-test-output/langtools/0/JTreport/text/tc_fail2pass.txt │ │ │ │ │ +-rw-r--r-- 0 sbuild (999) sbuild (999) 586 2026-10-15 10:01:18.000000 jtreg-test-output/langtools/0/JTreport/text/timeStats.txt │ │ │ │ │ +-rw-r--r-- 0 sbuild (999) sbuild (999) 21 2026-10-15 10:01:18.000000 jtreg-test-output/langtools/0/JTreport/text/tc_fail2notrun.txt │ │ │ │ │ +-rw-r--r-- 0 sbuild (999) sbuild (999) 19 2026-10-15 10:01:18.000000 jtreg-test-output/langtools/0/JTreport/text/fail2missing.txt │ │ │ │ │ +-rw-r--r-- 0 sbuild (999) sbuild (999) 16 2026-10-15 10:01:18.000000 jtreg-test-output/langtools/0/JTreport/text/fail2fail.txt │ │ │ │ │ +-rw-r--r-- 0 sbuild (999) sbuild (999) 22 2026-10-15 10:01:18.000000 jtreg-test-output/langtools/0/JTreport/text/tc_fail2missing.txt │ │ │ │ │ +-rw-r--r-- 0 sbuild (999) sbuild (999) 16 2026-10-15 10:01:18.000000 jtreg-test-output/langtools/0/JTreport/text/fail2pass.txt │ │ │ │ │ +-rw-r--r-- 0 sbuild (999) sbuild (999) 19 2026-10-15 10:01:18.000000 jtreg-test-output/langtools/0/JTreport/text/other_errors.txt │ │ │ │ │ +-rw-r--r-- 0 sbuild (999) sbuild (999) 17 2026-10-15 10:01:18.000000 jtreg-test-output/langtools/0/JTreport/text/faiL2error.txt │ │ │ │ │ +-rw-r--r-- 0 sbuild (999) sbuild (999) 21 2026-10-15 10:01:18.000000 jtreg-test-output/langtools/0/JTreport/text/tc_newfailures.txt │ │ │ │ │ +-rw-r--r-- 0 sbuild (999) sbuild (999) 120 2026-10-15 10:01:18.000000 jtreg-test-output/langtools/0/JTreport/text/stats.txt │ │ │ │ │ +-rw-r--r-- 0 sbuild (999) sbuild (999) 454 2026-10-15 09:05:52.000000 jtreg-test-output/langtools/0/JTreport/text/cmdArgs.txt │ │ │ │ │ +-rw-r--r-- 0 sbuild (999) sbuild (999) 18 2026-10-15 10:01:18.000000 jtreg-test-output/langtools/0/JTreport/text/newfailures.txt │ │ │ │ │ +-rw-r--r-- 0 sbuild (999) sbuild (999) 9538 2026-10-15 10:01:18.000000 jtreg-test-output/langtools/0/JTreport/text/testng.txt │ │ │ │ │ +-rw-r--r-- 0 sbuild (999) sbuild (999) 1921 2026-10-15 10:01:18.000000 jtreg-test-output/langtools/0/JTreport/text/notRun.txt │ │ │ │ │ +-rw-r--r-- 0 sbuild (999) sbuild (999) 18550 2026-10-15 10:01:18.000000 jtreg-test-output/langtools/0/JTreport/text/junit.txt │ │ │ │ │ +-rw-r--r-- 0 sbuild (999) sbuild (999) 18 2026-10-15 10:01:18.000000 jtreg-test-output/langtools/0/JTreport/text/fail2notrun.txt │ │ │ │ │ +-rw-r--r-- 0 sbuild (999) sbuild (999) 0 2026-10-15 10:01:18.000000 jtreg-test-output/langtools/0/JTreport/reportdir.dat │ │ │ │ │ +lrwxrwxrwx 0 sbuild (999) sbuild (999) 0 2026-10-15 10:01:49.000000 jtreg-test-output/langtools/JTreport -> 0/JTreport │ │ │ │ │ +drwxr-xr-x 0 sbuild (999) sbuild (999) 0 2026-10-15 10:39:26.000000 jtreg-test-output/jaxp/0/JTreport/ │ │ │ │ │ +-rw-r--r-- 0 sbuild (999) sbuild (999) 714 2026-10-15 10:39:26.000000 jtreg-test-output/jaxp/0/JTreport/index.html │ │ │ │ │ +drwxr-xr-x 0 sbuild (999) sbuild (999) 0 2026-10-15 10:39:25.000000 jtreg-test-output/jaxp/0/JTreport/html/ │ │ │ │ │ +-rw-r--r-- 0 sbuild (999) sbuild (999) 574 2026-10-15 10:39:25.000000 jtreg-test-output/jaxp/0/JTreport/html/notRun.html │ │ │ │ │ +-rw-r--r-- 0 sbuild (999) sbuild (999) 58503 2026-10-15 10:39:25.000000 jtreg-test-output/jaxp/0/JTreport/html/report.html │ │ │ │ │ +-rw-r--r-- 0 sbuild (999) sbuild (999) 3643 2026-10-15 10:39:25.000000 jtreg-test-output/jaxp/0/JTreport/html/excluded.html │ │ │ │ │ +-rw-r--r-- 0 sbuild (999) sbuild (999) 474 2026-10-15 10:39:25.000000 jtreg-test-output/jaxp/0/JTreport/html/error.html │ │ │ │ │ +-rw-r--r-- 0 sbuild (999) sbuild (999) 522 2026-10-15 10:39:25.000000 jtreg-test-output/jaxp/0/JTreport/html/error_gr.html │ │ │ │ │ +-rw-r--r-- 0 sbuild (999) sbuild (999) 58503 2026-10-15 10:39:25.000000 jtreg-test-output/jaxp/0/JTreport/html/index.html │ │ │ │ │ +-rw-r--r-- 0 sbuild (999) sbuild (999) 110063 2026-10-15 10:39:25.000000 jtreg-test-output/jaxp/0/JTreport/html/passed_gr.html │ │ │ │ │ +-rw-r--r-- 0 sbuild (999) sbuild (999) 514 2026-10-15 10:39:25.000000 jtreg-test-output/jaxp/0/JTreport/html/failed_gr.html │ │ │ │ │ +-rw-r--r-- 0 sbuild (999) sbuild (999) 466 2026-10-15 10:39:25.000000 jtreg-test-output/jaxp/0/JTreport/html/failed.html │ │ │ │ │ +-rw-r--r-- 0 sbuild (999) sbuild (999) 4132 2026-10-15 10:39:25.000000 jtreg-test-output/jaxp/0/JTreport/html/env.html │ │ │ │ │ +-rw-r--r-- 0 sbuild (999) sbuild (999) 696 2026-10-15 10:39:25.000000 jtreg-test-output/jaxp/0/JTreport/html/notRun_gr.html │ │ │ │ │ +-rw-r--r-- 0 sbuild (999) sbuild (999) 307 2026-10-15 10:39:25.000000 jtreg-test-output/jaxp/0/JTreport/html/report.css │ │ │ │ │ +-rw-r--r-- 0 sbuild (999) sbuild (999) 4425 2026-10-15 10:39:25.000000 jtreg-test-output/jaxp/0/JTreport/html/config.html │ │ │ │ │ +-rw-r--r-- 0 sbuild (999) sbuild (999) 109974 2026-10-15 10:39:25.000000 jtreg-test-output/jaxp/0/JTreport/html/passed.html │ │ │ │ │ +drwxr-xr-x 0 sbuild (999) sbuild (999) 0 2026-10-15 10:39:26.000000 jtreg-test-output/jaxp/0/JTreport/text/ │ │ │ │ │ +-rw-r--r-- 0 sbuild (999) sbuild (999) 59118 2026-10-15 10:39:26.000000 jtreg-test-output/jaxp/0/JTreport/text/summary.txt │ │ │ │ │ +-rw-r--r-- 0 sbuild (999) sbuild (999) 20 2026-10-15 10:39:26.000000 jtreg-test-output/jaxp/0/JTreport/text/tc_fail2error.txt │ │ │ │ │ +-rw-r--r-- 0 sbuild (999) sbuild (999) 19 2026-10-15 10:39:26.000000 jtreg-test-output/jaxp/0/JTreport/text/tc_fail2pass.txt │ │ │ │ │ +-rw-r--r-- 0 sbuild (999) sbuild (999) 238 2026-10-15 10:39:26.000000 jtreg-test-output/jaxp/0/JTreport/text/timeStats.txt │ │ │ │ │ +-rw-r--r-- 0 sbuild (999) sbuild (999) 21 2026-10-15 10:39:26.000000 jtreg-test-output/jaxp/0/JTreport/text/tc_fail2notrun.txt │ │ │ │ │ +-rw-r--r-- 0 sbuild (999) sbuild (999) 19 2026-10-15 10:39:26.000000 jtreg-test-output/jaxp/0/JTreport/text/fail2missing.txt │ │ │ │ │ +-rw-r--r-- 0 sbuild (999) sbuild (999) 16 2026-10-15 10:39:26.000000 jtreg-test-output/jaxp/0/JTreport/text/fail2fail.txt │ │ │ │ │ +-rw-r--r-- 0 sbuild (999) sbuild (999) 22 2026-10-15 10:39:26.000000 jtreg-test-output/jaxp/0/JTreport/text/tc_fail2missing.txt │ │ │ │ │ +-rw-r--r-- 0 sbuild (999) sbuild (999) 16 2026-10-15 10:39:26.000000 jtreg-test-output/jaxp/0/JTreport/text/fail2pass.txt │ │ │ │ │ +-rw-r--r-- 0 sbuild (999) sbuild (999) 19 2026-10-15 10:39:26.000000 jtreg-test-output/jaxp/0/JTreport/text/other_errors.txt │ │ │ │ │ +-rw-r--r-- 0 sbuild (999) sbuild (999) 17 2026-10-15 10:39:26.000000 jtreg-test-output/jaxp/0/JTreport/text/faiL2error.txt │ │ │ │ │ +-rw-r--r-- 0 sbuild (999) sbuild (999) 21 2026-10-15 10:39:26.000000 jtreg-test-output/jaxp/0/JTreport/text/tc_newfailures.txt │ │ │ │ │ +-rw-r--r-- 0 sbuild (999) sbuild (999) 65 2026-10-15 10:39:26.000000 jtreg-test-output/jaxp/0/JTreport/text/stats.txt │ │ │ │ │ +-rw-r--r-- 0 sbuild (999) sbuild (999) 439 2026-10-15 10:01:51.000000 jtreg-test-output/jaxp/0/JTreport/text/cmdArgs.txt │ │ │ │ │ +-rw-r--r-- 0 sbuild (999) sbuild (999) 18 2026-10-15 10:39:26.000000 jtreg-test-output/jaxp/0/JTreport/text/newfailures.txt │ │ │ │ │ +-rw-r--r-- 0 sbuild (999) sbuild (999) 69461 2026-10-15 10:39:26.000000 jtreg-test-output/jaxp/0/JTreport/text/testng.txt │ │ │ │ │ +-rw-r--r-- 0 sbuild (999) sbuild (999) 116 2026-10-15 10:39:26.000000 jtreg-test-output/jaxp/0/JTreport/text/notRun.txt │ │ │ │ │ +-rw-r--r-- 0 sbuild (999) sbuild (999) 200 2026-10-15 10:39:26.000000 jtreg-test-output/jaxp/0/JTreport/text/junit.txt │ │ │ │ │ +-rw-r--r-- 0 sbuild (999) sbuild (999) 18 2026-10-15 10:39:26.000000 jtreg-test-output/jaxp/0/JTreport/text/fail2notrun.txt │ │ │ │ │ +-rw-r--r-- 0 sbuild (999) sbuild (999) 0 2026-10-15 10:39:26.000000 jtreg-test-output/jaxp/0/JTreport/reportdir.dat │ │ │ │ │ +lrwxrwxrwx 0 sbuild (999) sbuild (999) 0 2026-10-15 10:39:29.000000 jtreg-test-output/jaxp/JTreport -> 0/JTreport │ │ │ │ │ +drwxr-xr-x 0 sbuild (999) sbuild (999) 0 2026-10-15 09:05:39.000000 jtreg-test-output/hotspot/0/JTreport/ │ │ │ │ │ +-rw-r--r-- 0 sbuild (999) sbuild (999) 726 2026-10-15 09:05:39.000000 jtreg-test-output/hotspot/0/JTreport/index.html │ │ │ │ │ +drwxr-xr-x 0 sbuild (999) sbuild (999) 0 2026-10-15 09:05:38.000000 jtreg-test-output/hotspot/0/JTreport/html/ │ │ │ │ │ +-rw-r--r-- 0 sbuild (999) sbuild (999) 37915 2026-10-15 09:05:38.000000 jtreg-test-output/hotspot/0/JTreport/html/notRun.html │ │ │ │ │ +-rw-r--r-- 0 sbuild (999) sbuild (999) 529205 2026-10-15 09:05:38.000000 jtreg-test-output/hotspot/0/JTreport/html/report.html │ │ │ │ │ +-rw-r--r-- 0 sbuild (999) sbuild (999) 18324 2026-10-15 09:05:38.000000 jtreg-test-output/hotspot/0/JTreport/html/excluded.html │ │ │ │ │ +-rw-r--r-- 0 sbuild (999) sbuild (999) 473 2026-10-15 09:05:38.000000 jtreg-test-output/hotspot/0/JTreport/html/error.html │ │ │ │ │ +-rw-r--r-- 0 sbuild (999) sbuild (999) 521 2026-10-15 09:05:38.000000 jtreg-test-output/hotspot/0/JTreport/html/error_gr.html │ │ │ │ │ +-rw-r--r-- 0 sbuild (999) sbuild (999) 529205 2026-10-15 09:05:38.000000 jtreg-test-output/hotspot/0/JTreport/html/index.html │ │ │ │ │ +-rw-r--r-- 0 sbuild (999) sbuild (999) 631072 2026-10-15 09:05:38.000000 jtreg-test-output/hotspot/0/JTreport/html/passed_gr.html │ │ │ │ │ +-rw-r--r-- 0 sbuild (999) sbuild (999) 513 2026-10-15 09:05:38.000000 jtreg-test-output/hotspot/0/JTreport/html/failed_gr.html │ │ │ │ │ +-rw-r--r-- 0 sbuild (999) sbuild (999) 465 2026-10-15 09:05:38.000000 jtreg-test-output/hotspot/0/JTreport/html/failed.html │ │ │ │ │ +-rw-r--r-- 0 sbuild (999) sbuild (999) 4245 2026-10-15 09:05:38.000000 jtreg-test-output/hotspot/0/JTreport/html/env.html │ │ │ │ │ +-rw-r--r-- 0 sbuild (999) sbuild (999) 38204 2026-10-15 09:05:38.000000 jtreg-test-output/hotspot/0/JTreport/html/notRun_gr.html │ │ │ │ │ +-rw-r--r-- 0 sbuild (999) sbuild (999) 307 2026-10-15 09:05:38.000000 jtreg-test-output/hotspot/0/JTreport/html/report.css │ │ │ │ │ +-rw-r--r-- 0 sbuild (999) sbuild (999) 78259 2026-10-15 09:05:38.000000 jtreg-test-output/hotspot/0/JTreport/html/config.html │ │ │ │ │ +-rw-r--r-- 0 sbuild (999) sbuild (999) 630643 2026-10-15 09:05:38.000000 jtreg-test-output/hotspot/0/JTreport/html/passed.html │ │ │ │ │ +drwxr-xr-x 0 sbuild (999) sbuild (999) 0 2026-10-15 09:05:39.000000 jtreg-test-output/hotspot/0/JTreport/text/ │ │ │ │ │ +-rw-r--r-- 0 sbuild (999) sbuild (999) 475251 2026-10-15 09:05:39.000000 jtreg-test-output/hotspot/0/JTreport/text/summary.txt │ │ │ │ │ +-rw-r--r-- 0 sbuild (999) sbuild (999) 20 2026-10-15 09:05:39.000000 jtreg-test-output/hotspot/0/JTreport/text/tc_fail2error.txt │ │ │ │ │ +-rw-r--r-- 0 sbuild (999) sbuild (999) 19 2026-10-15 09:05:39.000000 jtreg-test-output/hotspot/0/JTreport/text/tc_fail2pass.txt │ │ │ │ │ +-rw-r--r-- 0 sbuild (999) sbuild (999) 887 2026-10-15 09:05:39.000000 jtreg-test-output/hotspot/0/JTreport/text/timeStats.txt │ │ │ │ │ +-rw-r--r-- 0 sbuild (999) sbuild (999) 21 2026-10-15 09:05:39.000000 jtreg-test-output/hotspot/0/JTreport/text/tc_fail2notrun.txt │ │ │ │ │ +-rw-r--r-- 0 sbuild (999) sbuild (999) 19 2026-10-15 09:05:39.000000 jtreg-test-output/hotspot/0/JTreport/text/fail2missing.txt │ │ │ │ │ +-rw-r--r-- 0 sbuild (999) sbuild (999) 16 2026-10-15 09:05:39.000000 jtreg-test-output/hotspot/0/JTreport/text/fail2fail.txt │ │ │ │ │ +-rw-r--r-- 0 sbuild (999) sbuild (999) 22 2026-10-15 09:05:39.000000 jtreg-test-output/hotspot/0/JTreport/text/tc_fail2missing.txt │ │ │ │ │ +-rw-r--r-- 0 sbuild (999) sbuild (999) 16 2026-10-15 09:05:39.000000 jtreg-test-output/hotspot/0/JTreport/text/fail2pass.txt │ │ │ │ │ +-rw-r--r-- 0 sbuild (999) sbuild (999) 19 2026-10-15 09:05:39.000000 jtreg-test-output/hotspot/0/JTreport/text/other_errors.txt │ │ │ │ │ +-rw-r--r-- 0 sbuild (999) sbuild (999) 17 2026-10-15 09:05:39.000000 jtreg-test-output/hotspot/0/JTreport/text/faiL2error.txt │ │ │ │ │ +-rw-r--r-- 0 sbuild (999) sbuild (999) 21 2026-10-15 09:05:39.000000 jtreg-test-output/hotspot/0/JTreport/text/tc_newfailures.txt │ │ │ │ │ +-rw-r--r-- 0 sbuild (999) sbuild (999) 123 2026-10-15 09:05:39.000000 jtreg-test-output/hotspot/0/JTreport/text/stats.txt │ │ │ │ │ +-rw-r--r-- 0 sbuild (999) sbuild (999) 553 2026-10-15 05:50:06.000000 jtreg-test-output/hotspot/0/JTreport/text/cmdArgs.txt │ │ │ │ │ +-rw-r--r-- 0 sbuild (999) sbuild (999) 18 2026-10-15 09:05:39.000000 jtreg-test-output/hotspot/0/JTreport/text/newfailures.txt │ │ │ │ │ +-rw-r--r-- 0 sbuild (999) sbuild (999) 9190 2026-10-15 09:05:39.000000 jtreg-test-output/hotspot/0/JTreport/text/testng.txt │ │ │ │ │ +-rw-r--r-- 0 sbuild (999) sbuild (999) 50907 2026-10-15 09:05:39.000000 jtreg-test-output/hotspot/0/JTreport/text/notRun.txt │ │ │ │ │ +-rw-r--r-- 0 sbuild (999) sbuild (999) 9713 2026-10-15 09:05:39.000000 jtreg-test-output/hotspot/0/JTreport/text/junit.txt │ │ │ │ │ +-rw-r--r-- 0 sbuild (999) sbuild (999) 18 2026-10-15 09:05:39.000000 jtreg-test-output/hotspot/0/JTreport/text/fail2notrun.txt │ │ │ │ │ +-rw-r--r-- 0 sbuild (999) sbuild (999) 0 2026-10-15 09:05:39.000000 jtreg-test-output/hotspot/0/JTreport/reportdir.dat │ │ │ │ │ +lrwxrwxrwx 0 sbuild (999) sbuild (999) 0 2026-10-15 09:05:51.000000 jtreg-test-output/hotspot/JTreport -> 0/JTreport │ │ │ │ ├── jtreg-test-output/jdk/2/JTreport/index.html │ │ │ │ │ @@ -3,15 +3,15 @@ │ │ │ │ │ │ │ │ │ │ │ │ │ │ │ │ │ │ │ │ │ │ │ │ │ Report Index │ │ │ │ │ │ │ │ │ │

/build/reproducible-path/openjdk-21-21.0.13~8ea/test/jdk

│ │ │ │ │ -Date of report : 08 October 2026 18:22:48 │ │ │ │ │ +Date of report : 15 October 2026 15:31:42 │ │ │ │ │ │ │ │ │ │

│ │ │ │ │ HTML Report │ │ │ │ │
Standard JT Harness HTML report. Can show a summary of the results, configuration information, and environment values.

│ │ │ │ │

│ │ │ │ │ Plain Text Report │ │ │ │ │
Standard JT Harness text report showing only test names and their result status string. Suitable for parsing by external program.

│ │ │ │ │ ├── html2text {} │ │ │ │ │ │ @@ -1,8 +1,8 @@ │ │ │ │ │ │ ************ //bbuuiilldd//rreepprroodduucciibbllee--ppaatthh//ooppeennjjddkk--2211--2211..00..1133~~88eeaa//tteesstt//jjddkk ************ │ │ │ │ │ │ -Date of report : 08 October 2026 18:22:48 │ │ │ │ │ │ +Date of report : 15 October 2026 15:31:42 │ │ │ │ │ │ _H_T_M_L_ _R_e_p_o_r_t │ │ │ │ │ │ Standard JT Harness HTML report. Can show a summary of the results, │ │ │ │ │ │ configuration information, and environment values. │ │ │ │ │ │ _P_l_a_i_n_ _T_e_x_t_ _R_e_p_o_r_t │ │ │ │ │ │ Standard JT Harness text report showing only test names and their result status │ │ │ │ │ │ string. Suitable for parsing by external program. │ │ │ │ ├── jtreg-test-output/jdk/2/JTreport/html/notRun_gr.html │ │ │ │ │ @@ -47648,18 +47648,18 @@ │ │ │ │ │ 000ba1f0: 6f72 6b20 636f 7272 6563 746c 790a 0a3c ork correctly..< │ │ │ │ │ 000ba200: 6c69 3e73 756e 2f73 6563 7572 6974 792f li>sun/security/ │ │ │ │ │ 000ba210: 736d 6172 7463 6172 6469 6f2f 5465 7374 smartcardio/Test │ │ │ │ │ 000ba220: 5472 616e 736d 6974 2e6a 6176 613a 2074 Transmit.java: t │ │ │ │ │ 000ba230: 6573 7420 7472 616e 736d 6974 2829 2077 est transmit() w │ │ │ │ │ 000ba240: 6f72 6b73 0a3c 2f75 6c3e 0a3c 6872 3e0a orks..
. │ │ │ │ │ 000ba250: 3c73 6d61 6c6c 3e52 6570 6f72 7420 6765 Report ge │ │ │ │ │ -000ba260: 6e65 7261 7465 6420 6f6e 204f 6374 2038 nerated on Oct 8 │ │ │ │ │ -000ba270: 2c20 3230 3236 2036 3a32 323a 3438 e280 , 2026 6:22:48.. │ │ │ │ │ -000ba280: af50 4d0a 3c62 723e 5573 696e 6720 4a54 .PM.
Using JT │ │ │ │ │ -000ba290: 2048 6172 6e65 7373 2036 2e30 2062 3236 Harness 6.0 b26 │ │ │ │ │ -000ba2a0: 3b20 6275 696c 7420 6f6e 204d 6172 6368 ; built on March │ │ │ │ │ -000ba2b0: 2031 382c 2032 3032 362c 2031 323a 3030 18, 2026, 12:00 │ │ │ │ │ -000ba2c0: 3a30 30e2 80af 414d 2055 5443 2077 6974 :00...AM UTC wit │ │ │ │ │ -000ba2d0: 6820 6f70 656e 6a64 6b20 7665 7273 696f h openjdk versio │ │ │ │ │ -000ba2e0: 6e20 2232 352e 302e 332d 6561 2220 3230 n "25.0.3-ea" 20 │ │ │ │ │ -000ba2f0: 3236 2d30 342d 3231 3c2f 736d 616c 6c3e 26-04-21
│ │ │ │ │ -000ba300: 3c2f 626f 6479 3e3c 2f68 746d 6c3e │ │ │ │ │ +000ba260: 6e65 7261 7465 6420 6f6e 204f 6374 2031 nerated on Oct 1 │ │ │ │ │ +000ba270: 352c 2032 3032 3620 333a 3331 3a34 32e2 5, 2026 3:31:42. │ │ │ │ │ +000ba280: 80af 504d 0a3c 6272 3e55 7369 6e67 204a ..PM.
Using J │ │ │ │ │ +000ba290: 5420 4861 726e 6573 7320 362e 3020 6232 T Harness 6.0 b2 │ │ │ │ │ +000ba2a0: 363b 2062 7569 6c74 206f 6e20 4d61 7263 6; built on Marc │ │ │ │ │ +000ba2b0: 6820 3138 2c20 3230 3236 2c20 3132 3a30 h 18, 2026, 12:0 │ │ │ │ │ +000ba2c0: 303a 3030 e280 af41 4d20 5554 4320 7769 0:00...AM UTC wi │ │ │ │ │ +000ba2d0: 7468 206f 7065 6e6a 646b 2076 6572 7369 th openjdk versi │ │ │ │ │ +000ba2e0: 6f6e 2022 3235 2e30 2e33 2d65 6122 2032 on "25.0.3-ea" 2 │ │ │ │ │ +000ba2f0: 3032 362d 3034 2d32 313c 2f73 6d61 6c6c 026-04-21 │ │ │ │ │ ├── html2text {} │ │ │ │ │ │ @@ -13393,10 +13393,10 @@ │ │ │ │ │ │ ()/endExclusive() works │ │ │ │ │ │ * sun/security/smartcardio/TestMultiplePresent.java: test that │ │ │ │ │ │ CardTerminals.waitForCard() works │ │ │ │ │ │ * sun/security/smartcardio/TestPresent.java: test that the isCardPresent()/ │ │ │ │ │ │ waitForX() APIs work correctly │ │ │ │ │ │ * sun/security/smartcardio/TestTransmit.java: test transmit() works │ │ │ │ │ │ =============================================================================== │ │ │ │ │ │ -Report generated on Oct 8, 2026 6:22:48 PM │ │ │ │ │ │ +Report generated on Oct 15, 2026 3:31:42 PM │ │ │ │ │ │ Using JT Harness 6.0 b26; built on March 18, 2026, 12:00:00 AM UTC with openjdk │ │ │ │ │ │ version "25.0.3-ea" 2026-04-21 │ │ │ │ ├── jtreg-test-output/jdk/2/JTreport/html/notRun.html │ │ │ │ │ @@ -47631,18 +47631,18 @@ │ │ │ │ │ 000ba0e0: 722f 6d6f 6475 6c65 732f 7661 6c69 6461 r/modules/valida │ │ │ │ │ 000ba0f0: 7465 2f56 616c 6964 6174 654d 6f64 756c te/ValidateModul │ │ │ │ │ 000ba100: 6573 5465 7374 2e6a 6176 613a 2042 6173 esTest.java: Bas │ │ │ │ │ 000ba110: 6963 2074 6573 7420 666f 7220 6a61 7661 ic test for java │ │ │ │ │ 000ba120: 202d 2d76 616c 6964 6174 652d 6d6f 6475 --validate-modu │ │ │ │ │ 000ba130: 6c65 730a 3c62 720a 3e0a 3c68 723e 0a3c les..
.< │ │ │ │ │ 000ba140: 736d 616c 6c3e 5265 706f 7274 2067 656e small>Report gen │ │ │ │ │ -000ba150: 6572 6174 6564 206f 6e20 4f63 7420 382c erated on Oct 8, │ │ │ │ │ -000ba160: 2032 3032 3620 363a 3232 3a34 38e2 80af 2026 6:22:48... │ │ │ │ │ -000ba170: 504d 0a3c 6272 3e55 7369 6e67 204a 5420 PM.
Using JT │ │ │ │ │ -000ba180: 4861 726e 6573 7320 362e 3020 6232 363b Harness 6.0 b26; │ │ │ │ │ -000ba190: 2062 7569 6c74 206f 6e20 4d61 7263 6820 built on March │ │ │ │ │ -000ba1a0: 3138 2c20 3230 3236 2c20 3132 3a30 303a 18, 2026, 12:00: │ │ │ │ │ -000ba1b0: 3030 e280 af41 4d20 5554 4320 7769 7468 00...AM UTC with │ │ │ │ │ -000ba1c0: 206f 7065 6e6a 646b 2076 6572 7369 6f6e openjdk version │ │ │ │ │ -000ba1d0: 2022 3235 2e30 2e33 2d65 6122 2032 3032 "25.0.3-ea" 202 │ │ │ │ │ -000ba1e0: 362d 3034 2d32 313c 2f73 6d61 6c6c 3e3c 6-04-21< │ │ │ │ │ -000ba1f0: 2f62 6f64 793e 3c2f 6874 6d6c 3e /body> │ │ │ │ │ +000ba150: 6572 6174 6564 206f 6e20 4f63 7420 3135 erated on Oct 15 │ │ │ │ │ +000ba160: 2c20 3230 3236 2033 3a33 313a 3432 e280 , 2026 3:31:42.. │ │ │ │ │ +000ba170: af50 4d0a 3c62 723e 5573 696e 6720 4a54 .PM.
Using JT │ │ │ │ │ +000ba180: 2048 6172 6e65 7373 2036 2e30 2062 3236 Harness 6.0 b26 │ │ │ │ │ +000ba190: 3b20 6275 696c 7420 6f6e 204d 6172 6368 ; built on March │ │ │ │ │ +000ba1a0: 2031 382c 2032 3032 362c 2031 323a 3030 18, 2026, 12:00 │ │ │ │ │ +000ba1b0: 3a30 30e2 80af 414d 2055 5443 2077 6974 :00...AM UTC wit │ │ │ │ │ +000ba1c0: 6820 6f70 656e 6a64 6b20 7665 7273 696f h openjdk versio │ │ │ │ │ +000ba1d0: 6e20 2232 352e 302e 332d 6561 2220 3230 n "25.0.3-ea" 20 │ │ │ │ │ +000ba1e0: 3236 2d30 342d 3231 3c2f 736d 616c 6c3e 26-04-21 │ │ │ │ │ +000ba1f0: 3c2f 626f 6479 3e3c 2f68 746d 6c3e │ │ │ │ │ ├── html2text {} │ │ │ │ │ │ @@ -12773,10 +12773,10 @@ │ │ │ │ │ │ tools/launcher/modules/patch/systemmodules/PatchSystemModules.java: Patch │ │ │ │ │ │ java.base and user module with ModuleHashes attribute │ │ │ │ │ │ tools/launcher/modules/showmoduleresolution/ShowModuleResolutionTest.java: │ │ │ │ │ │ Basic test for java --show-module-resolution │ │ │ │ │ │ tools/launcher/modules/validate/ValidateModulesTest.java: Basic test for java - │ │ │ │ │ │ -validate-modules │ │ │ │ │ │ =============================================================================== │ │ │ │ │ │ -Report generated on Oct 8, 2026 6:22:48 PM │ │ │ │ │ │ +Report generated on Oct 15, 2026 3:31:42 PM │ │ │ │ │ │ Using JT Harness 6.0 b26; built on March 18, 2026, 12:00:00 AM UTC with openjdk │ │ │ │ │ │ version "25.0.3-ea" 2026-04-21 │ │ │ │ ├── jtreg-test-output/jdk/2/JTreport/html/error_gr.html │ │ │ │ │ @@ -6,9 +6,9 @@ │ │ │ │ │ │ │ │ │ │ JT Harness : Tests that had errors │ │ │ │ │ │ │ │ │ │ │ │ │ │ │ │ │ │ │ │

JT Harness : Tests that had errors

Tests are grouped by their final status message. │ │ │ │ │
│ │ │ │ │ -Report generated on Oct 8, 2026 6:22:48 PM │ │ │ │ │ +Report generated on Oct 15, 2026 3:31:42 PM │ │ │ │ │
Using JT Harness 6.0 b26; built on March 18, 2026, 12:00:00 AM UTC with openjdk version "25.0.3-ea" 2026-04-21
│ │ │ │ │ ├── html2text {} │ │ │ │ │ │ @@ -1,6 +1,6 @@ │ │ │ │ │ │ ************ JJTT HHaarrnneessss :: TTeessttss tthhaatt hhaadd eerrrroorrss ************ │ │ │ │ │ │ Tests are grouped by their final status message. │ │ │ │ │ │ =============================================================================== │ │ │ │ │ │ -Report generated on Oct 8, 2026 6:22:48 PM │ │ │ │ │ │ +Report generated on Oct 15, 2026 3:31:42 PM │ │ │ │ │ │ Using JT Harness 6.0 b26; built on March 18, 2026, 12:00:00 AM UTC with openjdk │ │ │ │ │ │ version "25.0.3-ea" 2026-04-21 │ │ │ │ ├── jtreg-test-output/jdk/2/JTreport/html/error.html │ │ │ │ │ @@ -6,9 +6,9 @@ │ │ │ │ │ │ │ │ │ │ JT Harness : Tests that had errors │ │ │ │ │ │ │ │ │ │ │ │ │ │ │ │ │ │ │ │

JT Harness : Tests that had errors

│ │ │ │ │
│ │ │ │ │ -Report generated on Oct 8, 2026 6:22:48 PM │ │ │ │ │ +Report generated on Oct 15, 2026 3:31:42 PM │ │ │ │ │
Using JT Harness 6.0 b26; built on March 18, 2026, 12:00:00 AM UTC with openjdk version "25.0.3-ea" 2026-04-21
│ │ │ │ │ ├── html2text {} │ │ │ │ │ │ @@ -1,5 +1,5 @@ │ │ │ │ │ │ ************ JJTT HHaarrnneessss :: TTeessttss tthhaatt hhaadd eerrrroorrss ************ │ │ │ │ │ │ =============================================================================== │ │ │ │ │ │ -Report generated on Oct 8, 2026 6:22:48 PM │ │ │ │ │ │ +Report generated on Oct 15, 2026 3:31:42 PM │ │ │ │ │ │ Using JT Harness 6.0 b26; built on March 18, 2026, 12:00:00 AM UTC with openjdk │ │ │ │ │ │ version "25.0.3-ea" 2026-04-21 │ │ │ │ ├── jtreg-test-output/jdk/2/JTreport/html/failed_gr.html │ │ │ │ │ @@ -56,9 +56,9 @@ │ │ │ │ │
  • │ │ │ │ │ java/net/MulticastSocket/SetLoopbackMode.java: Test MulticastSocket.setLoopbackMode │ │ │ │ │ │ │ │ │ │
  • │ │ │ │ │ java/net/MulticastSocket/SetLoopbackModeIPv4.java: Test MulticastSocket.setLoopbackMode with IPv4 addresses │ │ │ │ │ │ │ │ │ │
    │ │ │ │ │ -Report generated on Oct 8, 2026 6:22:48 PM │ │ │ │ │ +Report generated on Oct 15, 2026 3:31:42 PM │ │ │ │ │
    Using JT Harness 6.0 b26; built on March 18, 2026, 12:00:00 AM UTC with openjdk version "25.0.3-ea" 2026-04-21
    │ │ │ │ │ ├── html2text {} │ │ │ │ │ │ @@ -25,10 +25,10 @@ │ │ │ │ │ │ * _j_a_v_a_/_n_e_t_/_M_u_l_t_i_c_a_s_t_S_o_c_k_e_t_/_N_o_L_o_o_p_b_a_c_k_P_a_c_k_e_t_s_._j_a_v_a: Re-test IPv6 (and │ │ │ │ │ │ specifically MulticastSocket) with latest Linux & USAGI code │ │ │ │ │ │ * _j_a_v_a_/_n_e_t_/_M_u_l_t_i_c_a_s_t_S_o_c_k_e_t_/_S_e_t_L_o_o_p_b_a_c_k_M_o_d_e_._j_a_v_a: Test │ │ │ │ │ │ MulticastSocket.setLoopbackMode │ │ │ │ │ │ * _j_a_v_a_/_n_e_t_/_M_u_l_t_i_c_a_s_t_S_o_c_k_e_t_/_S_e_t_L_o_o_p_b_a_c_k_M_o_d_e_I_P_v_4_._j_a_v_a: Test │ │ │ │ │ │ MulticastSocket.setLoopbackMode with IPv4 addresses │ │ │ │ │ │ =============================================================================== │ │ │ │ │ │ -Report generated on Oct 8, 2026 6:22:48 PM │ │ │ │ │ │ +Report generated on Oct 15, 2026 3:31:42 PM │ │ │ │ │ │ Using JT Harness 6.0 b26; built on March 18, 2026, 12:00:00 AM UTC with openjdk │ │ │ │ │ │ version "25.0.3-ea" 2026-04-21 │ │ │ │ ├── jtreg-test-output/jdk/2/JTreport/html/failed.html │ │ │ │ │ @@ -33,9 +33,9 @@ │ │ │ │ │ java/net/SocketPermission/SocketPermissionTest.java: SocketPermission tests for legacy socket types. │ │ │ │ │
    │ │ │ │ │ sun/security/krb5/auto/Addresses.java: fix krb5 caddr │ │ │ │ │
    │ │ │ │ │
    │ │ │ │ │ -Report generated on Oct 8, 2026 6:22:48 PM │ │ │ │ │ +Report generated on Oct 15, 2026 3:31:42 PM │ │ │ │ │
    Using JT Harness 6.0 b26; built on March 18, 2026, 12:00:00 AM UTC with openjdk version "25.0.3-ea" 2026-04-21
    │ │ │ │ │ ├── html2text {} │ │ │ │ │ │ @@ -11,10 +11,10 @@ │ │ │ │ │ │ MulticastSocket.setLoopbackMode with IPv4 addresses │ │ │ │ │ │ _j_a_v_a_/_n_e_t_/_M_u_l_t_i_c_a_s_t_S_o_c_k_e_t_/_T_e_s_t_._j_a_v_a: IPv4 and IPv6 multicasting broken on Linux │ │ │ │ │ │ _j_a_v_a_/_n_e_t_/_S_o_c_k_e_t_O_p_t_i_o_n_/_O_p_t_i_o_n_s_T_e_s_t_._j_a_v_a: │ │ │ │ │ │ _j_a_v_a_/_n_e_t_/_S_o_c_k_e_t_P_e_r_m_i_s_s_i_o_n_/_S_o_c_k_e_t_P_e_r_m_i_s_s_i_o_n_T_e_s_t_._j_a_v_a: SocketPermission tests for │ │ │ │ │ │ legacy socket types. │ │ │ │ │ │ _s_u_n_/_s_e_c_u_r_i_t_y_/_k_r_b_5_/_a_u_t_o_/_A_d_d_r_e_s_s_e_s_._j_a_v_a: fix krb5 caddr │ │ │ │ │ │ =============================================================================== │ │ │ │ │ │ -Report generated on Oct 8, 2026 6:22:48 PM │ │ │ │ │ │ +Report generated on Oct 15, 2026 3:31:42 PM │ │ │ │ │ │ Using JT Harness 6.0 b26; built on March 18, 2026, 12:00:00 AM UTC with openjdk │ │ │ │ │ │ version "25.0.3-ea" 2026-04-21 │ │ │ │ ├── jtreg-test-output/jdk/2/JTreport/html/passed_gr.html │ │ │ │ │ @@ -241,77991 +241,77964 @@ │ │ │ │ │ 00000f00: 6c65 732e 6a74 7222 3e6a 646b 2f63 6c61 les.jtr">jdk/cla │ │ │ │ │ 00000f10: 7373 6669 6c65 2f65 7861 6d70 6c65 732f ssfile/examples/ │ │ │ │ │ 00000f20: 5472 616e 7366 6f72 6d45 7861 6d70 6c65 TransformExample │ │ │ │ │ 00000f30: 732e 6a61 7661 3c2f 613e 3a20 5465 7374 s.java: Test │ │ │ │ │ 00000f40: 696e 6720 436c 6173 7366 696c 6520 5472 ing Classfile Tr │ │ │ │ │ 00000f50: 616e 7366 6f72 6d45 7861 6d70 6c65 7320 ansformExamples │ │ │ │ │ 00000f60: 636f 6d70 696c 6174 696f 6e2e 0a3c 2f75 compilation....

    DEBUG: [ │ │ │ │ │ -00000f80: 466f 726b 4a6f 696e 506f 6f6c 2e63 6f6d ForkJoinPool.com │ │ │ │ │ -00000f90: 6d6f 6e50 6f6f 6c2d 776f 726b 6572 2d31 monPool-worker-1 │ │ │ │ │ -00000fa0: 5d20 5b33 7320 3936 386d 735d 2053 534c ] [3s 968ms] SSL │ │ │ │ │ -00000fb0: 2052 6561 6465 7228 536f 636b 6574 5475 Reader(SocketTu │ │ │ │ │ -00000fc0: 6265 2831 3229 2920 636f 6d70 6c65 7469 be(12)) completi │ │ │ │ │ -00000fd0: 6e67 3c2f 6834 3e0a 0a3c 756c 3e0a 3c6c ng

    .... │ │ │ │ │ -00001050: 3c68 343e 4445 4255 473a 205b 4874 7470

    DEBUG: [Http │ │ │ │ │ -00001060: 436c 6965 6e74 2d31 2d53 656c 6563 746f Client-1-Selecto │ │ │ │ │ -00001070: 724d 616e 6167 6572 5d20 5b38 3731 6d73 rManager] [871ms │ │ │ │ │ -00001080: 5d20 536f 636b 6574 5475 6265 2831 2920 ] SocketTube(1) │ │ │ │ │ -00001090: 6c65 6176 696e 6720 7265 6164 2829 206c leaving read() l │ │ │ │ │ -000010a0: 6f6f 7020 6166 7465 7220 6f6e 4e65 7874 oop after onNext │ │ │ │ │ -000010b0: 3a20 5265 6164 696e 673a 205b 6f70 733d : Reading: [ops= │ │ │ │ │ -000010c0: 312c 2064 656d 616e 643d 302c 2073 746f 1, demand=0, sto │ │ │ │ │ -000010d0: 7070 6564 3d66 616c 7365 5d2c 2057 7269 pped=false], Wri │ │ │ │ │ -000010e0: 7469 6e67 3a20 5b6f 7073 3d30 2c20 6465 ting: [ops=0, de │ │ │ │ │ -000010f0: 6d61 6e64 3d31 5d3c 2f68 343e 0a0a 3c75 mand=1]

    ...
  • ...

    Executio │ │ │ │ │ +00000f80: 6e20 6661 696c 6564 2061 7320 6578 7065 n failed as expe │ │ │ │ │ +00000f90: 6374 6564 3c2f 6834 3e0a 0a3c 756c 3e0a cted

    ..
    ..

    DEBUG: [H │ │ │ │ │ -000011d0: 7474 7043 6c69 656e 742d 3438 2d53 656c ttpClient-48-Sel │ │ │ │ │ -000011e0: 6563 746f 724d 616e 6167 6572 5d20 5b32 ectorManager] [2 │ │ │ │ │ -000011f0: 7320 3633 346d 735d 2053 6f63 6b65 7454 s 634ms] SocketT │ │ │ │ │ -00001200: 7562 6528 3438 2920 5265 6164 4576 656e ube(48) ReadEven │ │ │ │ │ -00001210: 7420 6162 6f72 743a 206a 6176 612e 6e69 t abort: java.ni │ │ │ │ │ -00001220: 6f2e 6368 616e 6e65 6c73 2e43 6c6f 7365 o.channels.Close │ │ │ │ │ -00001230: 6443 6861 6e6e 656c 4578 6365 7074 696f dChannelExceptio │ │ │ │ │ -00001240: 6e3c 2f68 343e 0a0a 3c75 6c3e 0a3c 6c69 n

    ..