--- /srv/rebuilderd/tmp/rebuilderdh3izgc/inputs/openjdk-21-jdk_21.0.13+9-1_arm64.deb +++ /srv/rebuilderd/tmp/rebuilderdh3izgc/out/openjdk-21-jdk_21.0.13+9-1_arm64.deb ├── file list │ @@ -1,3 +1,3 @@ │ -rw-r--r-- 0 0 0 4 2026-10-22 01:19:01.000000 debian-binary │ --rw-r--r-- 0 0 0 1840 2026-10-22 01:19:01.000000 control.tar.xz │ --rw-r--r-- 0 0 0 3589192 2026-10-22 01:19:01.000000 data.tar.xz │ +-rw-r--r-- 0 0 0 1836 2026-10-22 01:19:01.000000 control.tar.xz │ +-rw-r--r-- 0 0 0 3561892 2026-10-22 01:19:01.000000 data.tar.xz ├── control.tar.xz │ ├── control.tar │ │ ├── ./control │ │ │ @@ -1,13 +1,13 @@ │ │ │ Package: openjdk-21-jdk │ │ │ Source: openjdk-21 │ │ │ Version: 21.0.13+9-1 │ │ │ Architecture: arm64 │ │ │ Maintainer: OpenJDK Team │ │ │ -Installed-Size: 3778 │ │ │ +Installed-Size: 3791 │ │ │ Depends: openjdk-21-jre (= 21.0.13+9-1), openjdk-21-jdk-headless (= 21.0.13+9-1), libc6 (>= 2.34), zlib1g (>= 1:1.1.4) │ │ │ Recommends: libxt-dev │ │ │ Suggests: openjdk-21-demo, openjdk-21-source, visualvm │ │ │ Provides: java-compiler, java-sdk (= 21), java10-sdk, java11-sdk, java12-sdk, java13-sdk, java14-sdk, java15-sdk, java16-sdk, java17-sdk, java18-sdk, java19-sdk, java2-sdk, java20-sdk, java21-sdk, java5-sdk, java6-sdk, java7-sdk, java8-sdk, java9-sdk │ │ │ Section: java │ │ │ Priority: optional │ │ │ Multi-Arch: same │ │ ├── ./md5sums │ │ │ ├── ./md5sums │ │ │ │┄ Files differ ├── data.tar.xz │ ├── data.tar │ │ ├── file list │ │ │ @@ -17,13 +17,13 @@ │ │ │ drwxr-xr-x 0 root (0) root (0) 0 2026-10-22 01:19:01.000000 ./usr/share/doc/ │ │ │ drwxr-xr-x 0 root (0) root (0) 0 2026-10-22 01:19:01.000000 ./usr/share/doc/openjdk-21-jre-headless/ │ │ │ drwxr-xr-x 0 root (0) root (0) 0 2026-10-22 01:19:01.000000 ./usr/share/doc/openjdk-21-jre-headless/test-arm64/ │ │ │ -rw-r--r-- 0 root (0) root (0) 28695 2026-10-22 01:19:01.000000 ./usr/share/doc/openjdk-21-jre-headless/test-arm64/check-hotspot-hotspot.log.gz │ │ │ -rw-r--r-- 0 root (0) root (0) 3919 2026-10-22 01:19:01.000000 ./usr/share/doc/openjdk-21-jre-headless/test-arm64/check-jaxp-hotspot.log.gz │ │ │ -rw-r--r-- 0 root (0) root (0) 55751 2026-10-22 01:19:01.000000 ./usr/share/doc/openjdk-21-jre-headless/test-arm64/check-jdk-hotspot.log.gz │ │ │ -rw-r--r-- 0 root (0) root (0) 35242 2026-10-22 01:19:01.000000 ./usr/share/doc/openjdk-21-jre-headless/test-arm64/check-langtools-hotspot.log.gz │ │ │ --rw-r--r-- 0 root (0) root (0) 8548 2026-10-22 01:19:01.000000 ./usr/share/doc/openjdk-21-jre-headless/test-arm64/failed_tests-hotspot.tar.gz │ │ │ +-rw-r--r-- 0 root (0) root (0) 8573 2026-10-22 01:19:01.000000 ./usr/share/doc/openjdk-21-jre-headless/test-arm64/failed_tests-hotspot.tar.gz │ │ │ -rw-r--r-- 0 root (0) root (0) 3397 2026-10-22 01:19:01.000000 ./usr/share/doc/openjdk-21-jre-headless/test-arm64/jtreg-summary-hotspot.log │ │ │ --rw-r--r-- 0 root (0) root (0) 127870 2026-10-22 01:19:01.000000 ./usr/share/doc/openjdk-21-jre-headless/test-arm64/jtreg_output-hotspot.log.gz │ │ │ --rw-r--r-- 0 root (0) root (0) 3493287 2026-10-22 01:19:01.000000 ./usr/share/doc/openjdk-21-jre-headless/test-arm64/jtreport-hotspot.tar.gz │ │ │ +-rw-r--r-- 0 root (0) root (0) 127924 2026-10-22 01:19:01.000000 ./usr/share/doc/openjdk-21-jre-headless/test-arm64/jtreg_output-hotspot.log.gz │ │ │ +-rw-r--r-- 0 root (0) root (0) 3506543 2026-10-22 01:19:01.000000 ./usr/share/doc/openjdk-21-jre-headless/test-arm64/jtreport-hotspot.tar.gz │ │ │ lrwxrwxrwx 0 root (0) root (0) 0 2026-10-22 01:19:01.000000 ./usr/lib/jvm/openjdk-21/src.zip -> lib/src.zip │ │ │ lrwxrwxrwx 0 root (0) root (0) 0 2026-10-22 01:19:01.000000 ./usr/share/doc/openjdk-21-jdk -> openjdk-21-jre │ │ ├── ./usr/share/doc/openjdk-21-jre-headless/test-arm64/failed_tests-hotspot.tar.gz │ │ │ ├── failed_tests-hotspot.tar │ │ │ │ ├── file list │ │ │ │ │ @@ -1,9 +1,9 @@ │ │ │ │ │ --rw-r--r-- 0 sbuild (999) sbuild (999) 6775 2026-10-22 12:30:14.000000 jtreg-test-output/jdk/JTwork/java/net/MulticastSocket/B6427403.jtr │ │ │ │ │ --rw-r--r-- 0 sbuild (999) sbuild (999) 7796 2026-10-22 12:30:14.000000 jtreg-test-output/jdk/JTwork/java/net/MulticastSocket/NoLoopbackPackets.jtr │ │ │ │ │ --rw-r--r-- 0 sbuild (999) sbuild (999) 7800 2026-10-22 12:30:14.000000 jtreg-test-output/jdk/JTwork/java/net/MulticastSocket/Promiscuous.jtr │ │ │ │ │ --rw-r--r-- 0 sbuild (999) sbuild (999) 8419 2026-10-22 12:30:14.000000 jtreg-test-output/jdk/JTwork/java/net/MulticastSocket/SetLoopbackMode.jtr │ │ │ │ │ --rw-r--r-- 0 sbuild (999) sbuild (999) 8833 2026-10-22 12:30:14.000000 jtreg-test-output/jdk/JTwork/java/net/MulticastSocket/SetLoopbackModeIPv4.jtr │ │ │ │ │ --rw-r--r-- 0 sbuild (999) sbuild (999) 9692 2026-10-22 12:30:14.000000 jtreg-test-output/jdk/JTwork/java/net/MulticastSocket/Test.jtr │ │ │ │ │ --rw-r--r-- 0 sbuild (999) sbuild (999) 7441 2026-10-22 12:30:15.000000 jtreg-test-output/jdk/JTwork/java/net/SocketOption/OptionsTest.jtr │ │ │ │ │ --rw-r--r-- 0 sbuild (999) sbuild (999) 15124 2026-10-22 12:30:16.000000 jtreg-test-output/jdk/JTwork/java/net/SocketPermission/SocketPermissionTest.jtr │ │ │ │ │ --rw-r--r-- 0 sbuild (999) sbuild (999) 25681 2026-10-22 12:30:18.000000 jtreg-test-output/jdk/JTwork/sun/security/krb5/auto/Addresses.jtr │ │ │ │ │ +-rw-r--r-- 0 sbuild (999) sbuild (999) 6794 2026-10-23 05:52:02.000000 jtreg-test-output/jdk/JTwork/java/net/MulticastSocket/B6427403.jtr │ │ │ │ │ +-rw-r--r-- 0 sbuild (999) sbuild (999) 7815 2026-10-23 05:52:02.000000 jtreg-test-output/jdk/JTwork/java/net/MulticastSocket/NoLoopbackPackets.jtr │ │ │ │ │ +-rw-r--r-- 0 sbuild (999) sbuild (999) 7819 2026-10-23 05:52:02.000000 jtreg-test-output/jdk/JTwork/java/net/MulticastSocket/Promiscuous.jtr │ │ │ │ │ +-rw-r--r-- 0 sbuild (999) sbuild (999) 8435 2026-10-23 05:52:02.000000 jtreg-test-output/jdk/JTwork/java/net/MulticastSocket/SetLoopbackMode.jtr │ │ │ │ │ +-rw-r--r-- 0 sbuild (999) sbuild (999) 8853 2026-10-23 05:52:02.000000 jtreg-test-output/jdk/JTwork/java/net/MulticastSocket/SetLoopbackModeIPv4.jtr │ │ │ │ │ +-rw-r--r-- 0 sbuild (999) sbuild (999) 9707 2026-10-23 05:52:02.000000 jtreg-test-output/jdk/JTwork/java/net/MulticastSocket/Test.jtr │ │ │ │ │ +-rw-r--r-- 0 sbuild (999) sbuild (999) 7460 2026-10-23 05:52:03.000000 jtreg-test-output/jdk/JTwork/java/net/SocketOption/OptionsTest.jtr │ │ │ │ │ +-rw-r--r-- 0 sbuild (999) sbuild (999) 15142 2026-10-23 05:52:04.000000 jtreg-test-output/jdk/JTwork/java/net/SocketPermission/SocketPermissionTest.jtr │ │ │ │ │ +-rw-r--r-- 0 sbuild (999) sbuild (999) 25702 2026-10-23 05:52:07.000000 jtreg-test-output/jdk/JTwork/sun/security/krb5/auto/Addresses.jtr │ │ │ │ ├── jtreg-test-output/jdk/JTwork/java/net/MulticastSocket/B6427403.jtr │ │ │ │ │ @@ -1,70 +1,70 @@ │ │ │ │ │ #Test Results (version 2) │ │ │ │ │ -#Thu Oct 22 12:30:14 UTC 2026 │ │ │ │ │ +#Fri Oct 23 05:52:02 UTC 2026 │ │ │ │ │ #-----testdescription----- │ │ │ │ │ $file=/build/reproducible-path/openjdk-21-21.0.13+9/test/jdk/java/net/MulticastSocket/B6427403.java │ │ │ │ │ $root=/build/reproducible-path/openjdk-21-21.0.13+9/test/jdk │ │ │ │ │ keywords=bug6427403 │ │ │ │ │ run=USER_SPECIFIED main B6427403\n │ │ │ │ │ source=B6427403.java │ │ │ │ │ title=java.net.MulticastSocket.joinGroup() reports 'socket closed' │ │ │ │ │ │ │ │ │ │ #-----environment----- │ │ │ │ │ │ │ │ │ │ #-----testresult----- │ │ │ │ │ description=file\:/build/reproducible-path/openjdk-21-21.0.13+9/test/jdk/java/net/MulticastSocket/B6427403.java │ │ │ │ │ -elapsed=694 0\:00\:00.694 │ │ │ │ │ -end=Thu Oct 22 12\:30\:14 UTC 2026 │ │ │ │ │ +elapsed=761 0\:00\:00.761 │ │ │ │ │ +end=Fri Oct 23 05\:52\:02 UTC 2026 │ │ │ │ │ environment=regtest │ │ │ │ │ execStatus=Failed. Execution failed\: `main' threw exception\: java.net.SocketException\: No such device (setsockopt failed) │ │ │ │ │ harnessLoaderMode=Classpath Loader │ │ │ │ │ harnessVariety=Full Bundle │ │ │ │ │ hostname=sbuild │ │ │ │ │ -javatestOS=Linux 6.12.113+deb13-arm64 (aarch64) │ │ │ │ │ +javatestOS=Linux 6.12.113+deb13-cloud-arm64 (aarch64) │ │ │ │ │ javatestVersion=6.0-ea+b26-2026-03-18-${BUILT_FROM_COMMIT} │ │ │ │ │ jtregVersion=jtreg 8.3 src 1 │ │ │ │ │ script=com.sun.javatest.regtest.exec.RegressionScript │ │ │ │ │ sections=script_messages build main │ │ │ │ │ -start=Thu Oct 22 12\:30\:13 UTC 2026 │ │ │ │ │ +start=Fri Oct 23 05\:52\:01 UTC 2026 │ │ │ │ │ test=java/net/MulticastSocket/B6427403.java │ │ │ │ │ testJDK=/build/reproducible-path/openjdk-21-21.0.13+9/build/bootcycle-build/images/jdk │ │ │ │ │ -testJDK_OS=[name\:Linux,arch\:aarch64,version\:6.12.113+deb13-arm64,family\:linux,simple_arch\:aarch64,simple_version\:6.12,processors\:8,maxMemory\:25155866624,maxSwap\:182536105984] │ │ │ │ │ +testJDK_OS=[name\:Linux,arch\:aarch64,version\:6.12.113+deb13-cloud-arm64,family\:linux,simple_arch\:aarch64,simple_version\:6.12,processors\:12,maxMemory\:33596653568,maxSwap\:137438949376] │ │ │ │ │ testJDK_os.arch=aarch64 │ │ │ │ │ testJDK_os.name=Linux │ │ │ │ │ -testJDK_os.version=6.12.113+deb13-arm64 │ │ │ │ │ -totalTime=701 │ │ │ │ │ +testJDK_os.version=6.12.113+deb13-cloud-arm64 │ │ │ │ │ +totalTime=765 │ │ │ │ │ user.name=sbuild │ │ │ │ │ work=/tmp/jdk/JTwork/java/net/MulticastSocket │ │ │ │ │ │ │ │ │ │ #section:script_messages │ │ │ │ │ ----------messages:(4/260)---------- │ │ │ │ │ JDK under test: /build/reproducible-path/openjdk-21-21.0.13+9/build/bootcycle-build/images/jdk │ │ │ │ │ openjdk version "21.0.13" 2026-10-20 │ │ │ │ │ OpenJDK Runtime Environment (build 21.0.13+9-1-Debian) │ │ │ │ │ OpenJDK 64-Bit Server VM (build 21.0.13+9-1-Debian, mixed mode, sharing) │ │ │ │ │ │ │ │ │ │ #section:build │ │ │ │ │ ----------messages:(5/178)---------- │ │ │ │ │ command: build B6427403 │ │ │ │ │ reason: Named class compiled on demand │ │ │ │ │ -started: Thu Oct 22 12:30:13.478 UTC 2026 │ │ │ │ │ -finished: Thu Oct 22 12:30:13.509 UTC 2026 │ │ │ │ │ -elapsed time (seconds): 0.031 │ │ │ │ │ +started: Fri Oct 23 05:52:01.426 UTC 2026 │ │ │ │ │ +finished: Fri Oct 23 05:52:01.452 UTC 2026 │ │ │ │ │ +elapsed time (seconds): 0.026 │ │ │ │ │ result: Passed. All files up to date │ │ │ │ │ │ │ │ │ │ #section:main │ │ │ │ │ ----------messages:(8/234)---------- │ │ │ │ │ command: main B6427403 │ │ │ │ │ reason: User specified action: run main B6427403 │ │ │ │ │ -started: Thu Oct 22 12:30:13.513 UTC 2026 │ │ │ │ │ +started: Fri Oct 23 05:52:01.455 UTC 2026 │ │ │ │ │ Mode: agentvm │ │ │ │ │ Agent id: 1 │ │ │ │ │ -Process id: 3099630 │ │ │ │ │ -finished: Thu Oct 22 12:30:14.015 UTC 2026 │ │ │ │ │ -elapsed time (seconds): 0.502 │ │ │ │ │ +Process id: 2004357 │ │ │ │ │ +finished: Fri Oct 23 05:52:02.054 UTC 2026 │ │ │ │ │ +elapsed time (seconds): 0.599 │ │ │ │ │ ----------configuration:(15/666)---------- │ │ │ │ │ Boot Layer │ │ │ │ │ class path: /usr/share/jtreg/lib/javatest.jar │ │ │ │ │ /usr/share/jtreg/lib/jtreg.jar │ │ │ │ │ /usr/share/jtreg/lib/junit-platform-console-standalone.jar │ │ │ │ │ /usr/share/jtreg/lib/testng.jar │ │ │ │ │ /usr/share/jtreg/lib/guice.jar │ │ │ │ ├── jtreg-test-output/jdk/JTwork/java/net/MulticastSocket/NoLoopbackPackets.jtr │ │ │ │ │ @@ -1,43 +1,43 @@ │ │ │ │ │ #Test Results (version 2) │ │ │ │ │ -#Thu Oct 22 12:30:14 UTC 2026 │ │ │ │ │ +#Fri Oct 23 05:52:02 UTC 2026 │ │ │ │ │ #-----testdescription----- │ │ │ │ │ $file=/build/reproducible-path/openjdk-21-21.0.13+9/test/jdk/java/net/MulticastSocket/NoLoopbackPackets.java │ │ │ │ │ $root=/build/reproducible-path/openjdk-21-21.0.13+9/test/jdk │ │ │ │ │ keywords=bug4742177 │ │ │ │ │ library=/test/lib │ │ │ │ │ requires=os.family \!\= "windows" │ │ │ │ │ run=ASSUMED_ACTION main NoLoopbackPackets\n │ │ │ │ │ source=NoLoopbackPackets.java │ │ │ │ │ title=Re-test IPv6 (and specifically MulticastSocket) with latest Linux & USAGI code │ │ │ │ │ │ │ │ │ │ #-----environment----- │ │ │ │ │ │ │ │ │ │ #-----testresult----- │ │ │ │ │ description=file\:/build/reproducible-path/openjdk-21-21.0.13+9/test/jdk/java/net/MulticastSocket/NoLoopbackPackets.java │ │ │ │ │ -elapsed=106 0\:00\:00.106 │ │ │ │ │ -end=Thu Oct 22 12\:30\:14 UTC 2026 │ │ │ │ │ +elapsed=121 0\:00\:00.121 │ │ │ │ │ +end=Fri Oct 23 05\:52\:02 UTC 2026 │ │ │ │ │ environment=regtest │ │ │ │ │ execStatus=Failed. Execution failed\: `main' threw exception\: java.net.SocketException\: No such device (setsockopt failed) │ │ │ │ │ harnessLoaderMode=Classpath Loader │ │ │ │ │ harnessVariety=Full Bundle │ │ │ │ │ hostname=sbuild │ │ │ │ │ -javatestOS=Linux 6.12.113+deb13-arm64 (aarch64) │ │ │ │ │ +javatestOS=Linux 6.12.113+deb13-cloud-arm64 (aarch64) │ │ │ │ │ javatestVersion=6.0-ea+b26-2026-03-18-${BUILT_FROM_COMMIT} │ │ │ │ │ jtregVersion=jtreg 8.3 src 1 │ │ │ │ │ script=com.sun.javatest.regtest.exec.RegressionScript │ │ │ │ │ sections=script_messages build main │ │ │ │ │ -start=Thu Oct 22 12\:30\:14 UTC 2026 │ │ │ │ │ +start=Fri Oct 23 05\:52\:02 UTC 2026 │ │ │ │ │ test=java/net/MulticastSocket/NoLoopbackPackets.java │ │ │ │ │ testJDK=/build/reproducible-path/openjdk-21-21.0.13+9/build/bootcycle-build/images/jdk │ │ │ │ │ -testJDK_OS=[name\:Linux,arch\:aarch64,version\:6.12.113+deb13-arm64,family\:linux,simple_arch\:aarch64,simple_version\:6.12,processors\:8,maxMemory\:25155866624,maxSwap\:182536105984] │ │ │ │ │ +testJDK_OS=[name\:Linux,arch\:aarch64,version\:6.12.113+deb13-cloud-arm64,family\:linux,simple_arch\:aarch64,simple_version\:6.12,processors\:12,maxMemory\:33596653568,maxSwap\:137438949376] │ │ │ │ │ testJDK_os.arch=aarch64 │ │ │ │ │ testJDK_os.name=Linux │ │ │ │ │ -testJDK_os.version=6.12.113+deb13-arm64 │ │ │ │ │ -totalTime=108 │ │ │ │ │ +testJDK_os.version=6.12.113+deb13-cloud-arm64 │ │ │ │ │ +totalTime=124 │ │ │ │ │ user.name=sbuild │ │ │ │ │ work=/tmp/jdk/JTwork/java/net/MulticastSocket │ │ │ │ │ │ │ │ │ │ #section:script_messages │ │ │ │ │ ----------messages:(7/468)---------- │ │ │ │ │ JDK under test: /build/reproducible-path/openjdk-21-21.0.13+9/build/bootcycle-build/images/jdk │ │ │ │ │ openjdk version "21.0.13" 2026-10-20 │ │ │ │ │ @@ -47,29 +47,29 @@ │ │ │ │ │ source directory: /build/reproducible-path/openjdk-21-21.0.13+9/test/lib │ │ │ │ │ class directory: /tmp/jdk/JTwork/classes/java/net/MulticastSocket/NoLoopbackPackets.d/test/lib │ │ │ │ │ │ │ │ │ │ #section:build │ │ │ │ │ ----------messages:(5/187)---------- │ │ │ │ │ command: build NoLoopbackPackets │ │ │ │ │ reason: Named class compiled on demand │ │ │ │ │ -started: Thu Oct 22 12:30:14.035 UTC 2026 │ │ │ │ │ -finished: Thu Oct 22 12:30:14.036 UTC 2026 │ │ │ │ │ +started: Fri Oct 23 05:52:02.066 UTC 2026 │ │ │ │ │ +finished: Fri Oct 23 05:52:02.067 UTC 2026 │ │ │ │ │ elapsed time (seconds): 0.001 │ │ │ │ │ result: Passed. All files up to date │ │ │ │ │ │ │ │ │ │ #section:main │ │ │ │ │ ----------messages:(8/264)---------- │ │ │ │ │ command: main NoLoopbackPackets │ │ │ │ │ reason: Assumed action based on file name: run main NoLoopbackPackets │ │ │ │ │ -started: Thu Oct 22 12:30:14.037 UTC 2026 │ │ │ │ │ +started: Fri Oct 23 05:52:02.067 UTC 2026 │ │ │ │ │ Mode: agentvm │ │ │ │ │ Agent id: 1 │ │ │ │ │ -Process id: 3099630 │ │ │ │ │ -finished: Thu Oct 22 12:30:14.136 UTC 2026 │ │ │ │ │ -elapsed time (seconds): 0.099 │ │ │ │ │ +Process id: 2004357 │ │ │ │ │ +finished: Fri Oct 23 05:52:02.184 UTC 2026 │ │ │ │ │ +elapsed time (seconds): 0.117 │ │ │ │ │ ----------configuration:(17/836)---------- │ │ │ │ │ Boot Layer │ │ │ │ │ class path: /usr/share/jtreg/lib/javatest.jar │ │ │ │ │ /usr/share/jtreg/lib/jtreg.jar │ │ │ │ │ /usr/share/jtreg/lib/junit-platform-console-standalone.jar │ │ │ │ │ /usr/share/jtreg/lib/testng.jar │ │ │ │ │ /usr/share/jtreg/lib/guice.jar │ │ │ │ │ @@ -113,15 +113,15 @@ │ │ │ │ │ -Dtest.class.path=/tmp/jdk/JTwork/classes/java/net/MulticastSocket/NoLoopbackPackets.d:/tmp/jdk/JTwork/classes/java/net/MulticastSocket/NoLoopbackPackets.d/test/lib \\ │ │ │ │ │ -Dtest.class.path.prefix=/tmp/jdk/JTwork/classes/java/net/MulticastSocket/NoLoopbackPackets.d:/build/reproducible-path/openjdk-21-21.0.13+9/test/jdk/java/net/MulticastSocket:/tmp/jdk/JTwork/classes/java/net/MulticastSocket/NoLoopbackPackets.d/test/lib \\ │ │ │ │ │ -classpath /tmp/jdk/JTwork/classes/java/net/MulticastSocket/NoLoopbackPackets.d:/build/reproducible-path/openjdk-21-21.0.13+9/test/jdk/java/net/MulticastSocket:/tmp/jdk/JTwork/classes/java/net/MulticastSocket/NoLoopbackPackets.d/test/lib:/build/reproducible-path/openjdk-21-21.0.13+9/test/lib:/usr/share/jtreg/lib/javatest.jar:/usr/share/jtreg/lib/jtreg.jar \\ │ │ │ │ │ NoLoopbackPackets │ │ │ │ │ ----------stdout:(0/0)---------- │ │ │ │ │ ----------stderr:(0/0)---------- │ │ │ │ │ ----------System.out:(1/32)---------- │ │ │ │ │ -joining group: /224.1.1.1:50870 │ │ │ │ │ +joining group: /224.1.1.1:57500 │ │ │ │ │ ----------System.err:(17/1050)---------- │ │ │ │ │ java.net.SocketException: No such device (setsockopt failed) │ │ │ │ │ at java.base/sun.nio.ch.Net.joinOrDrop4(Native Method) │ │ │ │ │ at java.base/sun.nio.ch.Net.join4(Net.java:720) │ │ │ │ │ at java.base/sun.nio.ch.DatagramChannelImpl.innerJoin(DatagramChannelImpl.java:1676) │ │ │ │ │ at java.base/sun.nio.ch.DatagramChannelImpl.join(DatagramChannelImpl.java:1694) │ │ │ │ │ at java.base/sun.nio.ch.DatagramSocketAdaptor.joinGroup(DatagramSocketAdaptor.java:494) │ │ │ │ ├── jtreg-test-output/jdk/JTwork/java/net/MulticastSocket/Promiscuous.jtr │ │ │ │ │ @@ -1,42 +1,42 @@ │ │ │ │ │ #Test Results (version 2) │ │ │ │ │ -#Thu Oct 22 12:30:14 UTC 2026 │ │ │ │ │ +#Fri Oct 23 05:52:02 UTC 2026 │ │ │ │ │ #-----testdescription----- │ │ │ │ │ $file=/build/reproducible-path/openjdk-21-21.0.13+9/test/jdk/java/net/MulticastSocket/Promiscuous.java │ │ │ │ │ $root=/build/reproducible-path/openjdk-21-21.0.13+9/test/jdk │ │ │ │ │ keywords=bug8014499 bug8219804 othervm │ │ │ │ │ library=/test/lib │ │ │ │ │ run=USER_SPECIFIED main Promiscuous\nUSER_SPECIFIED main/othervm -Djava.net.preferIPv4Stack\=true Promiscuous\n │ │ │ │ │ source=Promiscuous.java │ │ │ │ │ title=Test for interference when two sockets are bound to the same port but joined to different multicast groups │ │ │ │ │ │ │ │ │ │ #-----environment----- │ │ │ │ │ │ │ │ │ │ #-----testresult----- │ │ │ │ │ description=file\:/build/reproducible-path/openjdk-21-21.0.13+9/test/jdk/java/net/MulticastSocket/Promiscuous.java │ │ │ │ │ -elapsed=94 0\:00\:00.094 │ │ │ │ │ -end=Thu Oct 22 12\:30\:14 UTC 2026 │ │ │ │ │ +elapsed=81 0\:00\:00.081 │ │ │ │ │ +end=Fri Oct 23 05\:52\:02 UTC 2026 │ │ │ │ │ environment=regtest │ │ │ │ │ execStatus=Failed. Execution failed\: `main' threw exception\: java.net.SocketException\: Network is unreachable │ │ │ │ │ harnessLoaderMode=Classpath Loader │ │ │ │ │ harnessVariety=Full Bundle │ │ │ │ │ hostname=sbuild │ │ │ │ │ -javatestOS=Linux 6.12.113+deb13-arm64 (aarch64) │ │ │ │ │ +javatestOS=Linux 6.12.113+deb13-cloud-arm64 (aarch64) │ │ │ │ │ javatestVersion=6.0-ea+b26-2026-03-18-${BUILT_FROM_COMMIT} │ │ │ │ │ jtregVersion=jtreg 8.3 src 1 │ │ │ │ │ script=com.sun.javatest.regtest.exec.RegressionScript │ │ │ │ │ sections=script_messages build main │ │ │ │ │ -start=Thu Oct 22 12\:30\:14 UTC 2026 │ │ │ │ │ +start=Fri Oct 23 05\:52\:02 UTC 2026 │ │ │ │ │ test=java/net/MulticastSocket/Promiscuous.java │ │ │ │ │ testJDK=/build/reproducible-path/openjdk-21-21.0.13+9/build/bootcycle-build/images/jdk │ │ │ │ │ -testJDK_OS=[name\:Linux,arch\:aarch64,version\:6.12.113+deb13-arm64,family\:linux,simple_arch\:aarch64,simple_version\:6.12,processors\:8,maxMemory\:25155866624,maxSwap\:182536105984] │ │ │ │ │ +testJDK_OS=[name\:Linux,arch\:aarch64,version\:6.12.113+deb13-cloud-arm64,family\:linux,simple_arch\:aarch64,simple_version\:6.12,processors\:12,maxMemory\:33596653568,maxSwap\:137438949376] │ │ │ │ │ testJDK_os.arch=aarch64 │ │ │ │ │ testJDK_os.name=Linux │ │ │ │ │ -testJDK_os.version=6.12.113+deb13-arm64 │ │ │ │ │ -totalTime=96 │ │ │ │ │ +testJDK_os.version=6.12.113+deb13-cloud-arm64 │ │ │ │ │ +totalTime=83 │ │ │ │ │ user.name=sbuild │ │ │ │ │ work=/tmp/jdk/JTwork/java/net/MulticastSocket │ │ │ │ │ │ │ │ │ │ #section:script_messages │ │ │ │ │ ----------messages:(7/462)---------- │ │ │ │ │ JDK under test: /build/reproducible-path/openjdk-21-21.0.13+9/build/bootcycle-build/images/jdk │ │ │ │ │ openjdk version "21.0.13" 2026-10-20 │ │ │ │ │ @@ -46,29 +46,29 @@ │ │ │ │ │ source directory: /build/reproducible-path/openjdk-21-21.0.13+9/test/lib │ │ │ │ │ class directory: /tmp/jdk/JTwork/classes/java/net/MulticastSocket/Promiscuous.d/test/lib │ │ │ │ │ │ │ │ │ │ #section:build │ │ │ │ │ ----------messages:(5/181)---------- │ │ │ │ │ command: build Promiscuous │ │ │ │ │ reason: Named class compiled on demand │ │ │ │ │ -started: Thu Oct 22 12:30:14.147 UTC 2026 │ │ │ │ │ -finished: Thu Oct 22 12:30:14.148 UTC 2026 │ │ │ │ │ +started: Fri Oct 23 05:52:02.196 UTC 2026 │ │ │ │ │ +finished: Fri Oct 23 05:52:02.197 UTC 2026 │ │ │ │ │ elapsed time (seconds): 0.001 │ │ │ │ │ result: Passed. All files up to date │ │ │ │ │ │ │ │ │ │ #section:main │ │ │ │ │ ----------messages:(8/240)---------- │ │ │ │ │ command: main Promiscuous │ │ │ │ │ reason: User specified action: run main Promiscuous │ │ │ │ │ -started: Thu Oct 22 12:30:14.148 UTC 2026 │ │ │ │ │ +started: Fri Oct 23 05:52:02.197 UTC 2026 │ │ │ │ │ Mode: agentvm │ │ │ │ │ Agent id: 1 │ │ │ │ │ -Process id: 3099630 │ │ │ │ │ -finished: Thu Oct 22 12:30:14.236 UTC 2026 │ │ │ │ │ -elapsed time (seconds): 0.088 │ │ │ │ │ +Process id: 2004357 │ │ │ │ │ +finished: Fri Oct 23 05:52:02.273 UTC 2026 │ │ │ │ │ +elapsed time (seconds): 0.076 │ │ │ │ │ ----------configuration:(17/824)---------- │ │ │ │ │ Boot Layer │ │ │ │ │ class path: /usr/share/jtreg/lib/javatest.jar │ │ │ │ │ /usr/share/jtreg/lib/jtreg.jar │ │ │ │ │ /usr/share/jtreg/lib/junit-platform-console-standalone.jar │ │ │ │ │ /usr/share/jtreg/lib/testng.jar │ │ │ │ │ /usr/share/jtreg/lib/guice.jar │ │ │ │ │ @@ -112,16 +112,16 @@ │ │ │ │ │ -Dtest.class.path=/tmp/jdk/JTwork/classes/java/net/MulticastSocket/Promiscuous.d:/tmp/jdk/JTwork/classes/java/net/MulticastSocket/Promiscuous.d/test/lib \\ │ │ │ │ │ -Dtest.class.path.prefix=/tmp/jdk/JTwork/classes/java/net/MulticastSocket/Promiscuous.d:/build/reproducible-path/openjdk-21-21.0.13+9/test/jdk/java/net/MulticastSocket:/tmp/jdk/JTwork/classes/java/net/MulticastSocket/Promiscuous.d/test/lib \\ │ │ │ │ │ -classpath /tmp/jdk/JTwork/classes/java/net/MulticastSocket/Promiscuous.d:/build/reproducible-path/openjdk-21-21.0.13+9/test/jdk/java/net/MulticastSocket:/tmp/jdk/JTwork/classes/java/net/MulticastSocket/Promiscuous.d/test/lib:/build/reproducible-path/openjdk-21-21.0.13+9/test/lib:/usr/share/jtreg/lib/javatest.jar:/usr/share/jtreg/lib/jtreg.jar \\ │ │ │ │ │ Promiscuous │ │ │ │ │ ----------stdout:(0/0)---------- │ │ │ │ │ ----------stderr:(0/0)---------- │ │ │ │ │ ----------System.out:(2/58)---------- │ │ │ │ │ -Using port: 50317 │ │ │ │ │ -Sending datagram to: /224.1.1.120/50317 │ │ │ │ │ +Using port: 56255 │ │ │ │ │ +Sending datagram to: /224.1.1.120/56255 │ │ │ │ │ ----------System.err:(18/1123)---------- │ │ │ │ │ java.net.SocketException: Network is unreachable │ │ │ │ │ at java.base/sun.nio.ch.DatagramChannelImpl.send0(Native Method) │ │ │ │ │ at java.base/sun.nio.ch.DatagramChannelImpl.sendFromNativeBuffer(DatagramChannelImpl.java:1005) │ │ │ │ │ at java.base/sun.nio.ch.DatagramChannelImpl.send(DatagramChannelImpl.java:966) │ │ │ │ │ at java.base/sun.nio.ch.DatagramChannelImpl.send(DatagramChannelImpl.java:889) │ │ │ │ │ at java.base/sun.nio.ch.DatagramChannelImpl.blockingSend(DatagramChannelImpl.java:952) │ │ │ │ ├── jtreg-test-output/jdk/JTwork/java/net/MulticastSocket/SetLoopbackMode.jtr │ │ │ │ │ @@ -1,44 +1,44 @@ │ │ │ │ │ #Test Results (version 2) │ │ │ │ │ -#Thu Oct 22 12:30:14 UTC 2026 │ │ │ │ │ +#Fri Oct 23 05:52:02 UTC 2026 │ │ │ │ │ #-----testdescription----- │ │ │ │ │ $file=/build/reproducible-path/openjdk-21-21.0.13+9/test/jdk/java/net/MulticastSocket/SetLoopbackMode.java │ │ │ │ │ $root=/build/reproducible-path/openjdk-21-21.0.13+9/test/jdk │ │ │ │ │ keywords=bug4686717 othervm │ │ │ │ │ library=/test/lib │ │ │ │ │ modules=java.base/java.net\:+open │ │ │ │ │ run=USER_SPECIFIED build jdk.test.lib.NetworkConfiguration jdk.test.lib.Platform\nUSER_SPECIFIED main/othervm SetLoopbackMode\n │ │ │ │ │ source=SetLoopbackMode.java │ │ │ │ │ title=Test MulticastSocket.setLoopbackMode │ │ │ │ │ │ │ │ │ │ #-----environment----- │ │ │ │ │ │ │ │ │ │ #-----testresult----- │ │ │ │ │ description=file\:/build/reproducible-path/openjdk-21-21.0.13+9/test/jdk/java/net/MulticastSocket/SetLoopbackMode.java │ │ │ │ │ -elapsed=246 0\:00\:00.246 │ │ │ │ │ -end=Thu Oct 22 12\:30\:14 UTC 2026 │ │ │ │ │ +elapsed=278 0\:00\:00.278 │ │ │ │ │ +end=Fri Oct 23 05\:52\:02 UTC 2026 │ │ │ │ │ environment=regtest │ │ │ │ │ execStatus=Failed. Execution failed\: `main' threw exception\: java.net.SocketException\: No such device (setsockopt failed) │ │ │ │ │ harnessLoaderMode=Classpath Loader │ │ │ │ │ harnessVariety=Full Bundle │ │ │ │ │ hostname=sbuild │ │ │ │ │ -javatestOS=Linux 6.12.113+deb13-arm64 (aarch64) │ │ │ │ │ +javatestOS=Linux 6.12.113+deb13-cloud-arm64 (aarch64) │ │ │ │ │ javatestVersion=6.0-ea+b26-2026-03-18-${BUILT_FROM_COMMIT} │ │ │ │ │ jtregVersion=jtreg 8.3 src 1 │ │ │ │ │ modules=java.base/java.net\:+open │ │ │ │ │ script=com.sun.javatest.regtest.exec.RegressionScript │ │ │ │ │ sections=script_messages build build main │ │ │ │ │ -start=Thu Oct 22 12\:30\:14 UTC 2026 │ │ │ │ │ +start=Fri Oct 23 05\:52\:02 UTC 2026 │ │ │ │ │ test=java/net/MulticastSocket/SetLoopbackMode.java │ │ │ │ │ testJDK=/build/reproducible-path/openjdk-21-21.0.13+9/build/bootcycle-build/images/jdk │ │ │ │ │ -testJDK_OS=[name\:Linux,arch\:aarch64,version\:6.12.113+deb13-arm64,family\:linux,simple_arch\:aarch64,simple_version\:6.12,processors\:8,maxMemory\:25155866624,maxSwap\:182536105984] │ │ │ │ │ +testJDK_OS=[name\:Linux,arch\:aarch64,version\:6.12.113+deb13-cloud-arm64,family\:linux,simple_arch\:aarch64,simple_version\:6.12,processors\:12,maxMemory\:33596653568,maxSwap\:137438949376] │ │ │ │ │ testJDK_os.arch=aarch64 │ │ │ │ │ testJDK_os.name=Linux │ │ │ │ │ -testJDK_os.version=6.12.113+deb13-arm64 │ │ │ │ │ -totalTime=248 │ │ │ │ │ +testJDK_os.version=6.12.113+deb13-cloud-arm64 │ │ │ │ │ +totalTime=281 │ │ │ │ │ user.name=sbuild │ │ │ │ │ work=/tmp/jdk/JTwork/java/net/MulticastSocket │ │ │ │ │ │ │ │ │ │ #section:script_messages │ │ │ │ │ ----------messages:(7/466)---------- │ │ │ │ │ JDK under test: /build/reproducible-path/openjdk-21-21.0.13+9/build/bootcycle-build/images/jdk │ │ │ │ │ openjdk version "21.0.13" 2026-10-20 │ │ │ │ │ @@ -48,38 +48,38 @@ │ │ │ │ │ source directory: /build/reproducible-path/openjdk-21-21.0.13+9/test/lib │ │ │ │ │ class directory: /tmp/jdk/JTwork/classes/java/net/MulticastSocket/SetLoopbackMode.d/test/lib │ │ │ │ │ │ │ │ │ │ #section:build │ │ │ │ │ ----------messages:(5/284)---------- │ │ │ │ │ command: build jdk.test.lib.NetworkConfiguration jdk.test.lib.Platform │ │ │ │ │ reason: User specified action: run build jdk.test.lib.NetworkConfiguration jdk.test.lib.Platform │ │ │ │ │ -started: Thu Oct 22 12:30:14.248 UTC 2026 │ │ │ │ │ -finished: Thu Oct 22 12:30:14.249 UTC 2026 │ │ │ │ │ +started: Fri Oct 23 05:52:02.285 UTC 2026 │ │ │ │ │ +finished: Fri Oct 23 05:52:02.286 UTC 2026 │ │ │ │ │ elapsed time (seconds): 0.001 │ │ │ │ │ result: Passed. All files up to date │ │ │ │ │ │ │ │ │ │ #section:build │ │ │ │ │ -----------messages:(5/185)---------- │ │ │ │ │ +----------messages:(5/183)---------- │ │ │ │ │ command: build SetLoopbackMode │ │ │ │ │ reason: Named class compiled on demand │ │ │ │ │ -started: Thu Oct 22 12:30:14.249 UTC 2026 │ │ │ │ │ -finished: Thu Oct 22 12:30:14.250 UTC 2026 │ │ │ │ │ -elapsed time (seconds): 0.001 │ │ │ │ │ +started: Fri Oct 23 05:52:02.287 UTC 2026 │ │ │ │ │ +finished: Fri Oct 23 05:52:02.287 UTC 2026 │ │ │ │ │ +elapsed time (seconds): 0.0 │ │ │ │ │ result: Passed. All files up to date │ │ │ │ │ │ │ │ │ │ #section:main │ │ │ │ │ -----------messages:(8/411)---------- │ │ │ │ │ +----------messages:(8/410)---------- │ │ │ │ │ command: main SetLoopbackMode │ │ │ │ │ reason: User specified action: run main/othervm SetLoopbackMode │ │ │ │ │ -started: Thu Oct 22 12:30:14.250 UTC 2026 │ │ │ │ │ +started: Fri Oct 23 05:52:02.288 UTC 2026 │ │ │ │ │ Mode: othervm [/othervm specified] │ │ │ │ │ Additional options from @modules: --add-modules java.base --add-exports java.base/java.net=ALL-UNNAMED --add-opens java.base/java.net=ALL-UNNAMED │ │ │ │ │ -Process id: 3099659 │ │ │ │ │ -finished: Thu Oct 22 12:30:14.488 UTC 2026 │ │ │ │ │ -elapsed time (seconds): 0.238 │ │ │ │ │ +Process id: 2004385 │ │ │ │ │ +finished: Fri Oct 23 05:52:02.558 UTC 2026 │ │ │ │ │ +elapsed time (seconds): 0.27 │ │ │ │ │ ----------configuration:(5/139)---------- │ │ │ │ │ Boot Layer │ │ │ │ │ add modules: java.base │ │ │ │ │ add exports: java.base/java.net ALL-UNNAMED │ │ │ │ │ add opens: java.base/java.net ALL-UNNAMED │ │ │ │ │ │ │ │ │ │ ----------System.out:(5/155)---------- │ │ │ │ ├── jtreg-test-output/jdk/JTwork/java/net/MulticastSocket/SetLoopbackModeIPv4.jtr │ │ │ │ │ @@ -1,44 +1,44 @@ │ │ │ │ │ #Test Results (version 2) │ │ │ │ │ -#Thu Oct 22 12:30:14 UTC 2026 │ │ │ │ │ +#Fri Oct 23 05:52:02 UTC 2026 │ │ │ │ │ #-----testdescription----- │ │ │ │ │ $file=/build/reproducible-path/openjdk-21-21.0.13+9/test/jdk/java/net/MulticastSocket/SetLoopbackModeIPv4.java │ │ │ │ │ $root=/build/reproducible-path/openjdk-21-21.0.13+9/test/jdk │ │ │ │ │ keywords=bug4686717 bug8241786 othervm │ │ │ │ │ library=/test/lib │ │ │ │ │ modules=java.base/java.net\:+open │ │ │ │ │ run=USER_SPECIFIED build jdk.test.lib.NetworkConfiguration jdk.test.lib.Platform SetLoopbackMode SetLoopbackModeIPv4\nUSER_SPECIFIED main/othervm -Djava.net.preferIPv4Stack\=true SetLoopbackModeIPv4\n │ │ │ │ │ source=SetLoopbackModeIPv4.java │ │ │ │ │ title=Test MulticastSocket.setLoopbackMode with IPv4 addresses │ │ │ │ │ │ │ │ │ │ #-----environment----- │ │ │ │ │ │ │ │ │ │ #-----testresult----- │ │ │ │ │ description=file\:/build/reproducible-path/openjdk-21-21.0.13+9/test/jdk/java/net/MulticastSocket/SetLoopbackModeIPv4.java │ │ │ │ │ -elapsed=247 0\:00\:00.247 │ │ │ │ │ -end=Thu Oct 22 12\:30\:14 UTC 2026 │ │ │ │ │ +elapsed=303 0\:00\:00.303 │ │ │ │ │ +end=Fri Oct 23 05\:52\:02 UTC 2026 │ │ │ │ │ environment=regtest │ │ │ │ │ execStatus=Failed. Execution failed\: `main' threw exception\: java.net.SocketException\: No such device (setsockopt failed) │ │ │ │ │ harnessLoaderMode=Classpath Loader │ │ │ │ │ harnessVariety=Full Bundle │ │ │ │ │ hostname=sbuild │ │ │ │ │ -javatestOS=Linux 6.12.113+deb13-arm64 (aarch64) │ │ │ │ │ +javatestOS=Linux 6.12.113+deb13-cloud-arm64 (aarch64) │ │ │ │ │ javatestVersion=6.0-ea+b26-2026-03-18-${BUILT_FROM_COMMIT} │ │ │ │ │ jtregVersion=jtreg 8.3 src 1 │ │ │ │ │ modules=java.base/java.net\:+open │ │ │ │ │ script=com.sun.javatest.regtest.exec.RegressionScript │ │ │ │ │ sections=script_messages build build main │ │ │ │ │ -start=Thu Oct 22 12\:30\:14 UTC 2026 │ │ │ │ │ +start=Fri Oct 23 05\:52\:02 UTC 2026 │ │ │ │ │ test=java/net/MulticastSocket/SetLoopbackModeIPv4.java │ │ │ │ │ testJDK=/build/reproducible-path/openjdk-21-21.0.13+9/build/bootcycle-build/images/jdk │ │ │ │ │ -testJDK_OS=[name\:Linux,arch\:aarch64,version\:6.12.113+deb13-arm64,family\:linux,simple_arch\:aarch64,simple_version\:6.12,processors\:8,maxMemory\:25155866624,maxSwap\:182536105984] │ │ │ │ │ +testJDK_OS=[name\:Linux,arch\:aarch64,version\:6.12.113+deb13-cloud-arm64,family\:linux,simple_arch\:aarch64,simple_version\:6.12,processors\:12,maxMemory\:33596653568,maxSwap\:137438949376] │ │ │ │ │ testJDK_os.arch=aarch64 │ │ │ │ │ testJDK_os.name=Linux │ │ │ │ │ -testJDK_os.version=6.12.113+deb13-arm64 │ │ │ │ │ -totalTime=248 │ │ │ │ │ +testJDK_os.version=6.12.113+deb13-cloud-arm64 │ │ │ │ │ +totalTime=305 │ │ │ │ │ user.name=sbuild │ │ │ │ │ work=/tmp/jdk/JTwork/java/net/MulticastSocket │ │ │ │ │ │ │ │ │ │ #section:script_messages │ │ │ │ │ ----------messages:(7/470)---------- │ │ │ │ │ JDK under test: /build/reproducible-path/openjdk-21-21.0.13+9/build/bootcycle-build/images/jdk │ │ │ │ │ openjdk version "21.0.13" 2026-10-20 │ │ │ │ │ @@ -48,38 +48,38 @@ │ │ │ │ │ source directory: /build/reproducible-path/openjdk-21-21.0.13+9/test/lib │ │ │ │ │ class directory: /tmp/jdk/JTwork/classes/java/net/MulticastSocket/SetLoopbackModeIPv4.d/test/lib │ │ │ │ │ │ │ │ │ │ #section:build │ │ │ │ │ ----------messages:(5/356)---------- │ │ │ │ │ command: build jdk.test.lib.NetworkConfiguration jdk.test.lib.Platform SetLoopbackMode SetLoopbackModeIPv4 │ │ │ │ │ reason: User specified action: run build jdk.test.lib.NetworkConfiguration jdk.test.lib.Platform SetLoopbackMode SetLoopbackModeIPv4 │ │ │ │ │ -started: Thu Oct 22 12:30:14.499 UTC 2026 │ │ │ │ │ -finished: Thu Oct 22 12:30:14.500 UTC 2026 │ │ │ │ │ +started: Fri Oct 23 05:52:02.570 UTC 2026 │ │ │ │ │ +finished: Fri Oct 23 05:52:02.571 UTC 2026 │ │ │ │ │ elapsed time (seconds): 0.001 │ │ │ │ │ result: Passed. All files up to date │ │ │ │ │ │ │ │ │ │ #section:build │ │ │ │ │ ----------messages:(5/187)---------- │ │ │ │ │ command: build SetLoopbackModeIPv4 │ │ │ │ │ reason: Named class compiled on demand │ │ │ │ │ -started: Thu Oct 22 12:30:14.501 UTC 2026 │ │ │ │ │ -finished: Thu Oct 22 12:30:14.501 UTC 2026 │ │ │ │ │ +started: Fri Oct 23 05:52:02.572 UTC 2026 │ │ │ │ │ +finished: Fri Oct 23 05:52:02.572 UTC 2026 │ │ │ │ │ elapsed time (seconds): 0.0 │ │ │ │ │ result: Passed. All files up to date │ │ │ │ │ │ │ │ │ │ #section:main │ │ │ │ │ -----------messages:(8/482)---------- │ │ │ │ │ +----------messages:(8/483)---------- │ │ │ │ │ command: main -Djava.net.preferIPv4Stack=true SetLoopbackModeIPv4 │ │ │ │ │ reason: User specified action: run main/othervm -Djava.net.preferIPv4Stack=true SetLoopbackModeIPv4 │ │ │ │ │ -started: Thu Oct 22 12:30:14.501 UTC 2026 │ │ │ │ │ +started: Fri Oct 23 05:52:02.572 UTC 2026 │ │ │ │ │ Mode: othervm [/othervm specified] │ │ │ │ │ Additional options from @modules: --add-modules java.base --add-exports java.base/java.net=ALL-UNNAMED --add-opens java.base/java.net=ALL-UNNAMED │ │ │ │ │ -Process id: 3099682 │ │ │ │ │ -finished: Thu Oct 22 12:30:14.741 UTC 2026 │ │ │ │ │ -elapsed time (seconds): 0.24 │ │ │ │ │ +Process id: 2004407 │ │ │ │ │ +finished: Fri Oct 23 05:52:02.869 UTC 2026 │ │ │ │ │ +elapsed time (seconds): 0.297 │ │ │ │ │ ----------configuration:(5/139)---------- │ │ │ │ │ Boot Layer │ │ │ │ │ add modules: java.base │ │ │ │ │ add exports: java.base/java.net ALL-UNNAMED │ │ │ │ │ add opens: java.base/java.net ALL-UNNAMED │ │ │ │ │ │ │ │ │ │ ----------System.out:(5/155)---------- │ │ │ │ ├── jtreg-test-output/jdk/JTwork/java/net/MulticastSocket/Test.jtr │ │ │ │ │ @@ -1,83 +1,83 @@ │ │ │ │ │ #Test Results (version 2) │ │ │ │ │ -#Thu Oct 22 12:30:14 UTC 2026 │ │ │ │ │ +#Fri Oct 23 05:52:02 UTC 2026 │ │ │ │ │ #-----testdescription----- │ │ │ │ │ $file=/build/reproducible-path/openjdk-21-21.0.13+9/test/jdk/java/net/MulticastSocket/Test.java │ │ │ │ │ $root=/build/reproducible-path/openjdk-21-21.0.13+9/test/jdk │ │ │ │ │ keywords=bug4488458 othervm │ │ │ │ │ library=/test/lib │ │ │ │ │ run=USER_SPECIFIED build jdk.test.lib.NetworkConfiguration jdk.test.lib.Platform\nUSER_SPECIFIED main Test\nUSER_SPECIFIED main/othervm -Djava.net.preferIPv4Stack\=true Test\n │ │ │ │ │ source=Test.java │ │ │ │ │ title=IPv4 and IPv6 multicasting broken on Linux │ │ │ │ │ │ │ │ │ │ #-----environment----- │ │ │ │ │ │ │ │ │ │ #-----testresult----- │ │ │ │ │ description=file\:/build/reproducible-path/openjdk-21-21.0.13+9/test/jdk/java/net/MulticastSocket/Test.java │ │ │ │ │ -elapsed=110 0\:00\:00.110 │ │ │ │ │ -end=Thu Oct 22 12\:30\:14 UTC 2026 │ │ │ │ │ +elapsed=108 0\:00\:00.108 │ │ │ │ │ +end=Fri Oct 23 05\:52\:02 UTC 2026 │ │ │ │ │ environment=regtest │ │ │ │ │ execStatus=Failed. Execution failed\: `main' threw exception\: java.lang.Exception\: Test failed - see log file for details │ │ │ │ │ harnessLoaderMode=Classpath Loader │ │ │ │ │ harnessVariety=Full Bundle │ │ │ │ │ hostname=sbuild │ │ │ │ │ -javatestOS=Linux 6.12.113+deb13-arm64 (aarch64) │ │ │ │ │ +javatestOS=Linux 6.12.113+deb13-cloud-arm64 (aarch64) │ │ │ │ │ javatestVersion=6.0-ea+b26-2026-03-18-${BUILT_FROM_COMMIT} │ │ │ │ │ jtregVersion=jtreg 8.3 src 1 │ │ │ │ │ script=com.sun.javatest.regtest.exec.RegressionScript │ │ │ │ │ sections=script_messages build build main │ │ │ │ │ -start=Thu Oct 22 12\:30\:14 UTC 2026 │ │ │ │ │ +start=Fri Oct 23 05\:52\:02 UTC 2026 │ │ │ │ │ test=java/net/MulticastSocket/Test.java │ │ │ │ │ testJDK=/build/reproducible-path/openjdk-21-21.0.13+9/build/bootcycle-build/images/jdk │ │ │ │ │ -testJDK_OS=[name\:Linux,arch\:aarch64,version\:6.12.113+deb13-arm64,family\:linux,simple_arch\:aarch64,simple_version\:6.12,processors\:8,maxMemory\:25155866624,maxSwap\:182536105984] │ │ │ │ │ +testJDK_OS=[name\:Linux,arch\:aarch64,version\:6.12.113+deb13-cloud-arm64,family\:linux,simple_arch\:aarch64,simple_version\:6.12,processors\:12,maxMemory\:33596653568,maxSwap\:137438949376] │ │ │ │ │ testJDK_os.arch=aarch64 │ │ │ │ │ testJDK_os.name=Linux │ │ │ │ │ -testJDK_os.version=6.12.113+deb13-arm64 │ │ │ │ │ -totalTime=112 │ │ │ │ │ +testJDK_os.version=6.12.113+deb13-cloud-arm64 │ │ │ │ │ +totalTime=111 │ │ │ │ │ user.name=sbuild │ │ │ │ │ work=/tmp/jdk/JTwork/java/net/MulticastSocket │ │ │ │ │ │ │ │ │ │ #section:script_messages │ │ │ │ │ ----------messages:(7/455)---------- │ │ │ │ │ JDK under test: /build/reproducible-path/openjdk-21-21.0.13+9/build/bootcycle-build/images/jdk │ │ │ │ │ openjdk version "21.0.13" 2026-10-20 │ │ │ │ │ OpenJDK Runtime Environment (build 21.0.13+9-1-Debian) │ │ │ │ │ OpenJDK 64-Bit Server VM (build 21.0.13+9-1-Debian, mixed mode, sharing) │ │ │ │ │ Library /test/lib; kind: packages │ │ │ │ │ source directory: /build/reproducible-path/openjdk-21-21.0.13+9/test/lib │ │ │ │ │ class directory: /tmp/jdk/JTwork/classes/java/net/MulticastSocket/Test.d/test/lib │ │ │ │ │ │ │ │ │ │ #section:build │ │ │ │ │ -----------messages:(5/284)---------- │ │ │ │ │ +----------messages:(5/282)---------- │ │ │ │ │ command: build jdk.test.lib.NetworkConfiguration jdk.test.lib.Platform │ │ │ │ │ reason: User specified action: run build jdk.test.lib.NetworkConfiguration jdk.test.lib.Platform │ │ │ │ │ -started: Thu Oct 22 12:30:14.752 UTC 2026 │ │ │ │ │ -finished: Thu Oct 22 12:30:14.753 UTC 2026 │ │ │ │ │ -elapsed time (seconds): 0.001 │ │ │ │ │ +started: Fri Oct 23 05:52:02.879 UTC 2026 │ │ │ │ │ +finished: Fri Oct 23 05:52:02.879 UTC 2026 │ │ │ │ │ +elapsed time (seconds): 0.0 │ │ │ │ │ result: Passed. All files up to date │ │ │ │ │ │ │ │ │ │ #section:build │ │ │ │ │ -----------messages:(5/174)---------- │ │ │ │ │ +----------messages:(5/172)---------- │ │ │ │ │ command: build Test │ │ │ │ │ reason: Named class compiled on demand │ │ │ │ │ -started: Thu Oct 22 12:30:14.753 UTC 2026 │ │ │ │ │ -finished: Thu Oct 22 12:30:14.754 UTC 2026 │ │ │ │ │ -elapsed time (seconds): 0.001 │ │ │ │ │ +started: Fri Oct 23 05:52:02.880 UTC 2026 │ │ │ │ │ +finished: Fri Oct 23 05:52:02.880 UTC 2026 │ │ │ │ │ +elapsed time (seconds): 0.0 │ │ │ │ │ result: Passed. All files up to date │ │ │ │ │ │ │ │ │ │ #section:main │ │ │ │ │ ----------messages:(8/226)---------- │ │ │ │ │ command: main Test │ │ │ │ │ reason: User specified action: run main Test │ │ │ │ │ -started: Thu Oct 22 12:30:14.754 UTC 2026 │ │ │ │ │ +started: Fri Oct 23 05:52:02.881 UTC 2026 │ │ │ │ │ Mode: agentvm │ │ │ │ │ Agent id: 1 │ │ │ │ │ -Process id: 3099630 │ │ │ │ │ -finished: Thu Oct 22 12:30:14.858 UTC 2026 │ │ │ │ │ -elapsed time (seconds): 0.104 │ │ │ │ │ +Process id: 2004357 │ │ │ │ │ +finished: Fri Oct 23 05:52:02.983 UTC 2026 │ │ │ │ │ +elapsed time (seconds): 0.102 │ │ │ │ │ ----------configuration:(17/810)---------- │ │ │ │ │ Boot Layer │ │ │ │ │ class path: /usr/share/jtreg/lib/javatest.jar │ │ │ │ │ /usr/share/jtreg/lib/jtreg.jar │ │ │ │ │ /usr/share/jtreg/lib/junit-platform-console-standalone.jar │ │ │ │ │ /usr/share/jtreg/lib/testng.jar │ │ │ │ │ /usr/share/jtreg/lib/guice.jar │ │ │ │ ├── jtreg-test-output/jdk/JTwork/java/net/SocketOption/OptionsTest.jtr │ │ │ │ │ @@ -1,43 +1,43 @@ │ │ │ │ │ #Test Results (version 2) │ │ │ │ │ -#Thu Oct 22 12:30:15 UTC 2026 │ │ │ │ │ +#Fri Oct 23 05:52:03 UTC 2026 │ │ │ │ │ #-----testdescription----- │ │ │ │ │ $file=/build/reproducible-path/openjdk-21-21.0.13+9/test/jdk/java/net/SocketOption/OptionsTest.java │ │ │ │ │ $root=/build/reproducible-path/openjdk-21-21.0.13+9/test/jdk │ │ │ │ │ keywords=bug8036979 bug8072384 bug8044773 bug8225214 bug8233296 bug8234083 othervm │ │ │ │ │ library=/test/lib │ │ │ │ │ requires=\!vm.graal.enabled │ │ │ │ │ run=USER_SPECIFIED main/othervm -Xcheck\:jni OptionsTest\nUSER_SPECIFIED main/othervm -Xcheck\:jni -Djava.net.preferIPv4Stack\=true OptionsTest\nUSER_SPECIFIED main/othervm --limit-modules\=java.base OptionsTest\nUSER_SPECIFIED main/othervm/policy\=options.policy OptionsTest\n │ │ │ │ │ source=OptionsTest.java │ │ │ │ │ title=\ │ │ │ │ │ │ │ │ │ │ #-----environment----- │ │ │ │ │ │ │ │ │ │ #-----testresult----- │ │ │ │ │ description=file\:/build/reproducible-path/openjdk-21-21.0.13+9/test/jdk/java/net/SocketOption/OptionsTest.java │ │ │ │ │ -elapsed=243 0\:00\:00.243 │ │ │ │ │ -end=Thu Oct 22 12\:30\:15 UTC 2026 │ │ │ │ │ +elapsed=280 0\:00\:00.280 │ │ │ │ │ +end=Fri Oct 23 05\:52\:03 UTC 2026 │ │ │ │ │ environment=regtest │ │ │ │ │ execStatus=Failed. Execution failed\: `main' threw exception\: java.lang.IllegalArgumentException\: Invalid value 'null' │ │ │ │ │ harnessLoaderMode=Classpath Loader │ │ │ │ │ harnessVariety=Full Bundle │ │ │ │ │ hostname=sbuild │ │ │ │ │ -javatestOS=Linux 6.12.113+deb13-arm64 (aarch64) │ │ │ │ │ +javatestOS=Linux 6.12.113+deb13-cloud-arm64 (aarch64) │ │ │ │ │ javatestVersion=6.0-ea+b26-2026-03-18-${BUILT_FROM_COMMIT} │ │ │ │ │ jtregVersion=jtreg 8.3 src 1 │ │ │ │ │ script=com.sun.javatest.regtest.exec.RegressionScript │ │ │ │ │ sections=script_messages build main │ │ │ │ │ -start=Thu Oct 22 12\:30\:14 UTC 2026 │ │ │ │ │ +start=Fri Oct 23 05\:52\:02 UTC 2026 │ │ │ │ │ test=java/net/SocketOption/OptionsTest.java │ │ │ │ │ testJDK=/build/reproducible-path/openjdk-21-21.0.13+9/build/bootcycle-build/images/jdk │ │ │ │ │ -testJDK_OS=[name\:Linux,arch\:aarch64,version\:6.12.113+deb13-arm64,family\:linux,simple_arch\:aarch64,simple_version\:6.12,processors\:8,maxMemory\:25155866624,maxSwap\:182536105984] │ │ │ │ │ +testJDK_OS=[name\:Linux,arch\:aarch64,version\:6.12.113+deb13-cloud-arm64,family\:linux,simple_arch\:aarch64,simple_version\:6.12,processors\:12,maxMemory\:33596653568,maxSwap\:137438949376] │ │ │ │ │ testJDK_os.arch=aarch64 │ │ │ │ │ testJDK_os.name=Linux │ │ │ │ │ -testJDK_os.version=6.12.113+deb13-arm64 │ │ │ │ │ -totalTime=245 │ │ │ │ │ +testJDK_os.version=6.12.113+deb13-cloud-arm64 │ │ │ │ │ +totalTime=282 │ │ │ │ │ user.name=sbuild │ │ │ │ │ work=/tmp/jdk/JTwork/java/net/SocketOption │ │ │ │ │ │ │ │ │ │ #section:script_messages │ │ │ │ │ ----------messages:(7/459)---------- │ │ │ │ │ JDK under test: /build/reproducible-path/openjdk-21-21.0.13+9/build/bootcycle-build/images/jdk │ │ │ │ │ openjdk version "21.0.13" 2026-10-20 │ │ │ │ │ @@ -47,28 +47,28 @@ │ │ │ │ │ source directory: /build/reproducible-path/openjdk-21-21.0.13+9/test/lib │ │ │ │ │ class directory: /tmp/jdk/JTwork/classes/java/net/SocketOption/OptionsTest.d/test/lib │ │ │ │ │ │ │ │ │ │ #section:build │ │ │ │ │ ----------messages:(5/181)---------- │ │ │ │ │ command: build OptionsTest │ │ │ │ │ reason: Named class compiled on demand │ │ │ │ │ -started: Thu Oct 22 12:30:14.868 UTC 2026 │ │ │ │ │ -finished: Thu Oct 22 12:30:14.869 UTC 2026 │ │ │ │ │ +started: Fri Oct 23 05:52:02.995 UTC 2026 │ │ │ │ │ +finished: Fri Oct 23 05:52:02.996 UTC 2026 │ │ │ │ │ elapsed time (seconds): 0.001 │ │ │ │ │ result: Passed. All files up to date │ │ │ │ │ │ │ │ │ │ #section:main │ │ │ │ │ ----------messages:(7/281)---------- │ │ │ │ │ command: main -Xcheck:jni OptionsTest │ │ │ │ │ reason: User specified action: run main/othervm -Xcheck:jni OptionsTest │ │ │ │ │ -started: Thu Oct 22 12:30:14.869 UTC 2026 │ │ │ │ │ +started: Fri Oct 23 05:52:02.996 UTC 2026 │ │ │ │ │ Mode: othervm [/othervm specified] │ │ │ │ │ -Process id: 3099704 │ │ │ │ │ -finished: Thu Oct 22 12:30:15.107 UTC 2026 │ │ │ │ │ -elapsed time (seconds): 0.238 │ │ │ │ │ +Process id: 2004430 │ │ │ │ │ +finished: Fri Oct 23 05:52:03.271 UTC 2026 │ │ │ │ │ +elapsed time (seconds): 0.275 │ │ │ │ │ ----------configuration:(0/0)---------- │ │ │ │ │ ----------System.out:(7/201)---------- │ │ │ │ │ Testing SO_LINGER with:-1 │ │ │ │ │ Testing SO_LINGER with:-2 │ │ │ │ │ Testing SO_LINGER with:-100 │ │ │ │ │ Testing SO_LINGER with:-65534 │ │ │ │ │ Testing SO_LINGER with:-65535 │ │ │ │ ├── jtreg-test-output/jdk/JTwork/java/net/SocketPermission/SocketPermissionTest.jtr │ │ │ │ │ @@ -1,42 +1,42 @@ │ │ │ │ │ #Test Results (version 2) │ │ │ │ │ -#Thu Oct 22 12:30:16 UTC 2026 │ │ │ │ │ +#Fri Oct 23 05:52:04 UTC 2026 │ │ │ │ │ #-----testdescription----- │ │ │ │ │ $file=/build/reproducible-path/openjdk-21-21.0.13+9/test/jdk/java/net/SocketPermission/SocketPermissionTest.java │ │ │ │ │ $root=/build/reproducible-path/openjdk-21-21.0.13+9/test/jdk │ │ │ │ │ keywords=bug8047031 intermittent othervm testng │ │ │ │ │ library=/test/lib │ │ │ │ │ run=USER_SPECIFIED build jdk.test.lib.NetworkConfiguration jdk.test.lib.Platform\nUSER_SPECIFIED testng/othervm -Djava.security.manager\=allow SocketPermissionTest\n │ │ │ │ │ source=SocketPermissionTest.java │ │ │ │ │ title=SocketPermission tests for legacy socket types. │ │ │ │ │ │ │ │ │ │ #-----environment----- │ │ │ │ │ │ │ │ │ │ #-----testresult----- │ │ │ │ │ description=file\:/build/reproducible-path/openjdk-21-21.0.13+9/test/jdk/java/net/SocketPermission/SocketPermissionTest.java │ │ │ │ │ -elapsed=695 0\:00\:00.695 │ │ │ │ │ -end=Thu Oct 22 12\:30\:16 UTC 2026 │ │ │ │ │ +elapsed=728 0\:00\:00.728 │ │ │ │ │ +end=Fri Oct 23 05\:52\:04 UTC 2026 │ │ │ │ │ environment=regtest │ │ │ │ │ execStatus=Failed. Execution failed\: `main' threw exception\: java.lang.Exception\: config failures\: 0, test failures\: 2 │ │ │ │ │ harnessLoaderMode=Classpath Loader │ │ │ │ │ harnessVariety=Full Bundle │ │ │ │ │ hostname=sbuild │ │ │ │ │ -javatestOS=Linux 6.12.113+deb13-arm64 (aarch64) │ │ │ │ │ +javatestOS=Linux 6.12.113+deb13-cloud-arm64 (aarch64) │ │ │ │ │ javatestVersion=6.0-ea+b26-2026-03-18-${BUILT_FROM_COMMIT} │ │ │ │ │ jtregVersion=jtreg 8.3 src 1 │ │ │ │ │ script=com.sun.javatest.regtest.exec.RegressionScript │ │ │ │ │ sections=script_messages build build testng │ │ │ │ │ -start=Thu Oct 22 12\:30\:15 UTC 2026 │ │ │ │ │ +start=Fri Oct 23 05\:52\:03 UTC 2026 │ │ │ │ │ test=java/net/SocketPermission/SocketPermissionTest.java │ │ │ │ │ testJDK=/build/reproducible-path/openjdk-21-21.0.13+9/build/bootcycle-build/images/jdk │ │ │ │ │ -testJDK_OS=[name\:Linux,arch\:aarch64,version\:6.12.113+deb13-arm64,family\:linux,simple_arch\:aarch64,simple_version\:6.12,processors\:8,maxMemory\:25155866624,maxSwap\:182536105984] │ │ │ │ │ +testJDK_OS=[name\:Linux,arch\:aarch64,version\:6.12.113+deb13-cloud-arm64,family\:linux,simple_arch\:aarch64,simple_version\:6.12,processors\:12,maxMemory\:33596653568,maxSwap\:137438949376] │ │ │ │ │ testJDK_os.arch=aarch64 │ │ │ │ │ testJDK_os.name=Linux │ │ │ │ │ -testJDK_os.version=6.12.113+deb13-arm64 │ │ │ │ │ -totalTime=697 │ │ │ │ │ +testJDK_os.version=6.12.113+deb13-cloud-arm64 │ │ │ │ │ +totalTime=729 │ │ │ │ │ user.name=sbuild │ │ │ │ │ work=/tmp/jdk/JTwork/java/net/SocketPermission │ │ │ │ │ │ │ │ │ │ #section:script_messages │ │ │ │ │ ----------messages:(7/472)---------- │ │ │ │ │ JDK under test: /build/reproducible-path/openjdk-21-21.0.13+9/build/bootcycle-build/images/jdk │ │ │ │ │ openjdk version "21.0.13" 2026-10-20 │ │ │ │ │ @@ -46,47 +46,47 @@ │ │ │ │ │ source directory: /build/reproducible-path/openjdk-21-21.0.13+9/test/lib │ │ │ │ │ class directory: /tmp/jdk/JTwork/classes/java/net/SocketPermission/SocketPermissionTest.d/test/lib │ │ │ │ │ │ │ │ │ │ #section:build │ │ │ │ │ ----------messages:(5/284)---------- │ │ │ │ │ command: build jdk.test.lib.NetworkConfiguration jdk.test.lib.Platform │ │ │ │ │ reason: User specified action: run build jdk.test.lib.NetworkConfiguration jdk.test.lib.Platform │ │ │ │ │ -started: Thu Oct 22 12:30:15.452 UTC 2026 │ │ │ │ │ -finished: Thu Oct 22 12:30:15.453 UTC 2026 │ │ │ │ │ +started: Fri Oct 23 05:52:03.426 UTC 2026 │ │ │ │ │ +finished: Fri Oct 23 05:52:03.427 UTC 2026 │ │ │ │ │ elapsed time (seconds): 0.001 │ │ │ │ │ result: Passed. All files up to date │ │ │ │ │ │ │ │ │ │ #section:build │ │ │ │ │ -----------messages:(5/190)---------- │ │ │ │ │ +----------messages:(5/188)---------- │ │ │ │ │ command: build SocketPermissionTest │ │ │ │ │ reason: Named class compiled on demand │ │ │ │ │ -started: Thu Oct 22 12:30:15.453 UTC 2026 │ │ │ │ │ -finished: Thu Oct 22 12:30:15.454 UTC 2026 │ │ │ │ │ -elapsed time (seconds): 0.001 │ │ │ │ │ +started: Fri Oct 23 05:52:03.428 UTC 2026 │ │ │ │ │ +finished: Fri Oct 23 05:52:03.428 UTC 2026 │ │ │ │ │ +elapsed time (seconds): 0.0 │ │ │ │ │ result: Passed. All files up to date │ │ │ │ │ │ │ │ │ │ #section:testng │ │ │ │ │ ----------messages:(7/339)---------- │ │ │ │ │ command: testng -Djava.security.manager=allow SocketPermissionTest │ │ │ │ │ reason: User specified action: run testng/othervm -Djava.security.manager=allow SocketPermissionTest │ │ │ │ │ -started: Thu Oct 22 12:30:15.454 UTC 2026 │ │ │ │ │ +started: Fri Oct 23 05:52:03.428 UTC 2026 │ │ │ │ │ Mode: othervm [/othervm specified] │ │ │ │ │ -Process id: 3099725 │ │ │ │ │ -finished: Thu Oct 22 12:30:16.137 UTC 2026 │ │ │ │ │ -elapsed time (seconds): 0.683 │ │ │ │ │ +Process id: 2004451 │ │ │ │ │ +finished: Fri Oct 23 05:52:04.142 UTC 2026 │ │ │ │ │ +elapsed time (seconds): 0.714 │ │ │ │ │ ----------configuration:(0/0)---------- │ │ │ │ │ -----------System.out:(97/6917)---------- │ │ │ │ │ -[12:30:15.938] config SocketPermissionTest.setupSecurityManager(): success [0ms] │ │ │ │ │ -[12:30:15.968] test SocketPermissionTest.acceptServerSocketTest(): success [23ms] │ │ │ │ │ -[12:30:15.969] config SocketPermissionTest.setupSecurityManager(): success [0ms] │ │ │ │ │ -[12:30:15.985] test SocketPermissionTest.connectDatagramSocketTest(): success [15ms] │ │ │ │ │ -[12:30:15.987] config SocketPermissionTest.setupSecurityManager(): success [0ms] │ │ │ │ │ -[12:30:15.990] test SocketPermissionTest.connectSocketTest(): success [2ms] │ │ │ │ │ -[12:30:15.992] config SocketPermissionTest.setupSecurityManager(): success [0ms] │ │ │ │ │ -[12:30:16.000] test SocketPermissionTest.joinGroupMulticastTest(): failure [9ms] │ │ │ │ │ +----------System.out:(97/6918)---------- │ │ │ │ │ +[05:52:03.958] config SocketPermissionTest.setupSecurityManager(): success [0ms] │ │ │ │ │ +[05:52:03.991] test SocketPermissionTest.acceptServerSocketTest(): success [26ms] │ │ │ │ │ +[05:52:03.993] config SocketPermissionTest.setupSecurityManager(): success [0ms] │ │ │ │ │ +[05:52:04.008] test SocketPermissionTest.connectDatagramSocketTest(): success [14ms] │ │ │ │ │ +[05:52:04.010] config SocketPermissionTest.setupSecurityManager(): success [0ms] │ │ │ │ │ +[05:52:04.013] test SocketPermissionTest.connectSocketTest(): success [2ms] │ │ │ │ │ +[05:52:04.014] config SocketPermissionTest.setupSecurityManager(): success [0ms] │ │ │ │ │ +[05:52:04.023] test SocketPermissionTest.joinGroupMulticastTest(): failure [10ms] │ │ │ │ │ java.util.NoSuchElementException: No value present │ │ │ │ │ at java.base/java.util.Optional.get(Optional.java:143) │ │ │ │ │ at SocketPermissionTest.joinGroupMulticastTest(SocketPermissionTest.java:227) │ │ │ │ │ at java.base/jdk.internal.reflect.DirectMethodHandleAccessor.invoke(DirectMethodHandleAccessor.java:103) │ │ │ │ │ at java.base/java.lang.reflect.Method.invoke(Method.java:580) │ │ │ │ │ at org.testng.internal.invokers.MethodInvocationHelper.invokeMethod(MethodInvocationHelper.java:136) │ │ │ │ │ at org.testng.internal.invokers.TestInvoker.invokeMethod(TestInvoker.java:658) │ │ │ │ │ @@ -111,22 +111,22 @@ │ │ │ │ │ at org.testng.TestNG.run(TestNG.java:1060) │ │ │ │ │ at com.sun.javatest.regtest.agent.TestNGRunner.main(TestNGRunner.java:109) │ │ │ │ │ at com.sun.javatest.regtest.agent.TestNGRunner.main(TestNGRunner.java:65) │ │ │ │ │ at java.base/jdk.internal.reflect.DirectMethodHandleAccessor.invoke(DirectMethodHandleAccessor.java:103) │ │ │ │ │ at java.base/java.lang.reflect.Method.invoke(Method.java:580) │ │ │ │ │ at com.sun.javatest.regtest.agent.MainWrapper$MainTask.run(MainWrapper.java:143) │ │ │ │ │ at java.base/java.lang.Thread.run(Thread.java:1583) │ │ │ │ │ -[12:30:16.002] config SocketPermissionTest.setupSecurityManager(): success [0ms] │ │ │ │ │ -[12:30:16.004] test SocketPermissionTest.listenDatagramSocketTest(): success [1ms] │ │ │ │ │ -[12:30:16.005] config SocketPermissionTest.setupSecurityManager(): success [0ms] │ │ │ │ │ -[12:30:16.007] test SocketPermissionTest.listenMulticastSocketTest(): success [1ms] │ │ │ │ │ -[12:30:16.008] config SocketPermissionTest.setupSecurityManager(): success [0ms] │ │ │ │ │ -[12:30:16.010] test SocketPermissionTest.listenServerSocketTest(): success [1ms] │ │ │ │ │ -[12:30:16.011] config SocketPermissionTest.setupSecurityManager(): success [0ms] │ │ │ │ │ -[12:30:16.012] test SocketPermissionTest.sendDatagramPacketTest(): failure [1ms] │ │ │ │ │ +[05:52:04.026] config SocketPermissionTest.setupSecurityManager(): success [0ms] │ │ │ │ │ +[05:52:04.029] test SocketPermissionTest.listenDatagramSocketTest(): success [2ms] │ │ │ │ │ +[05:52:04.030] config SocketPermissionTest.setupSecurityManager(): success [0ms] │ │ │ │ │ +[05:52:04.032] test SocketPermissionTest.listenMulticastSocketTest(): success [1ms] │ │ │ │ │ +[05:52:04.033] config SocketPermissionTest.setupSecurityManager(): success [0ms] │ │ │ │ │ +[05:52:04.035] test SocketPermissionTest.listenServerSocketTest(): success [1ms] │ │ │ │ │ +[05:52:04.036] config SocketPermissionTest.setupSecurityManager(): success [0ms] │ │ │ │ │ +[05:52:04.039] test SocketPermissionTest.sendDatagramPacketTest(): failure [2ms] │ │ │ │ │ java.security.PrivilegedActionException: java.net.SocketException: Network is unreachable │ │ │ │ │ at java.base/java.security.AccessController.doPrivileged(AccessController.java:718) │ │ │ │ │ at SocketPermissionTest.sendDatagramPacketTest(SocketPermissionTest.java:195) │ │ │ │ │ at java.base/jdk.internal.reflect.DirectMethodHandleAccessor.invoke(DirectMethodHandleAccessor.java:103) │ │ │ │ │ at java.base/java.lang.reflect.Method.invoke(Method.java:580) │ │ │ │ │ at org.testng.internal.invokers.MethodInvocationHelper.invokeMethod(MethodInvocationHelper.java:136) │ │ │ │ │ at org.testng.internal.invokers.TestInvoker.invokeMethod(TestInvoker.java:658) │ │ │ │ ├── jtreg-test-output/jdk/JTwork/sun/security/krb5/auto/Addresses.jtr │ │ │ │ │ @@ -1,44 +1,44 @@ │ │ │ │ │ #Test Results (version 2) │ │ │ │ │ -#Thu Oct 22 12:30:18 UTC 2026 │ │ │ │ │ +#Fri Oct 23 05:52:07 UTC 2026 │ │ │ │ │ #-----testdescription----- │ │ │ │ │ $file=/build/reproducible-path/openjdk-21-21.0.13+9/test/jdk/sun/security/krb5/auto/Addresses.java │ │ │ │ │ $root=/build/reproducible-path/openjdk-21-21.0.13+9/test/jdk │ │ │ │ │ keywords=bug8031111 bug8194486 othervm │ │ │ │ │ library=/test/lib │ │ │ │ │ modules=java.base/jdk.internal.misc java.base/sun.security.util java.security.jgss/sun.security.jgss java.security.jgss/sun.security.jgss.krb5 java.security.jgss/sun.security.krb5\:+open java.security.jgss/sun.security.krb5.internal\:+open java.security.jgss/sun.security.krb5.internal.ccache java.security.jgss/sun.security.krb5.internal.rcache java.security.jgss/sun.security.krb5.internal.crypto java.security.jgss/sun.security.krb5.internal.ktab jdk.security.auth jdk.security.jgss │ │ │ │ │ run=USER_SPECIFIED compile -XDignore.symbol.file Addresses.java\nUSER_SPECIFIED main jdk.test.lib.FileInstaller TestHosts TestHosts\nUSER_SPECIFIED main/othervm -Djdk.net.hosts.file\=TestHosts Addresses\n │ │ │ │ │ source=Addresses.java │ │ │ │ │ title=fix krb5 caddr │ │ │ │ │ │ │ │ │ │ #-----environment----- │ │ │ │ │ │ │ │ │ │ #-----testresult----- │ │ │ │ │ description=file\:/build/reproducible-path/openjdk-21-21.0.13+9/test/jdk/sun/security/krb5/auto/Addresses.java │ │ │ │ │ -elapsed=2701 0\:00\:02.701 │ │ │ │ │ -end=Thu Oct 22 12\:30\:18 UTC 2026 │ │ │ │ │ +elapsed=2879 0\:00\:02.879 │ │ │ │ │ +end=Fri Oct 23 05\:52\:07 UTC 2026 │ │ │ │ │ environment=regtest │ │ │ │ │ execStatus=Failed. Execution failed\: `main' threw exception\: java.lang.Exception │ │ │ │ │ harnessLoaderMode=Classpath Loader │ │ │ │ │ harnessVariety=Full Bundle │ │ │ │ │ hostname=sbuild │ │ │ │ │ -javatestOS=Linux 6.12.113+deb13-arm64 (aarch64) │ │ │ │ │ +javatestOS=Linux 6.12.113+deb13-cloud-arm64 (aarch64) │ │ │ │ │ javatestVersion=6.0-ea+b26-2026-03-18-${BUILT_FROM_COMMIT} │ │ │ │ │ jtregVersion=jtreg 8.3 src 1 │ │ │ │ │ modules=java.base/jdk.internal.misc java.base/sun.security.util java.security.jgss/sun.security.jgss java.security.jgss/sun.security.jgss.krb5 java.security.jgss/sun.security.krb5\:+open java.security.jgss/sun.security.krb5.internal\:+open java.security.jgss/sun.security.krb5.internal.ccache java.security.jgss/sun.security.krb5.internal.rcache java.security.jgss/sun.security.krb5.internal.crypto java.security.jgss/sun.security.krb5.internal.ktab jdk.security.auth jdk.security.jgss │ │ │ │ │ script=com.sun.javatest.regtest.exec.RegressionScript │ │ │ │ │ sections=script_messages compile build main build main │ │ │ │ │ -start=Thu Oct 22 12\:30\:16 UTC 2026 │ │ │ │ │ +start=Fri Oct 23 05\:52\:04 UTC 2026 │ │ │ │ │ test=sun/security/krb5/auto/Addresses.java │ │ │ │ │ testJDK=/build/reproducible-path/openjdk-21-21.0.13+9/build/bootcycle-build/images/jdk │ │ │ │ │ -testJDK_OS=[name\:Linux,arch\:aarch64,version\:6.12.113+deb13-arm64,family\:linux,simple_arch\:aarch64,simple_version\:6.12,processors\:8,maxMemory\:25155866624,maxSwap\:182536105984] │ │ │ │ │ +testJDK_OS=[name\:Linux,arch\:aarch64,version\:6.12.113+deb13-cloud-arm64,family\:linux,simple_arch\:aarch64,simple_version\:6.12,processors\:12,maxMemory\:33596653568,maxSwap\:137438949376] │ │ │ │ │ testJDK_os.arch=aarch64 │ │ │ │ │ testJDK_os.name=Linux │ │ │ │ │ -testJDK_os.version=6.12.113+deb13-arm64 │ │ │ │ │ -totalTime=2703 │ │ │ │ │ +testJDK_os.version=6.12.113+deb13-cloud-arm64 │ │ │ │ │ +totalTime=2882 │ │ │ │ │ user.name=sbuild │ │ │ │ │ work=/tmp/jdk/JTwork/sun/security/krb5/auto │ │ │ │ │ │ │ │ │ │ #section:script_messages │ │ │ │ │ ----------messages:(7/458)---------- │ │ │ │ │ JDK under test: /build/reproducible-path/openjdk-21-21.0.13+9/build/bootcycle-build/images/jdk │ │ │ │ │ openjdk version "21.0.13" 2026-10-20 │ │ │ │ │ @@ -48,21 +48,21 @@ │ │ │ │ │ source directory: /build/reproducible-path/openjdk-21-21.0.13+9/test/lib │ │ │ │ │ class directory: /tmp/jdk/JTwork/classes/sun/security/krb5/auto/Addresses.d/test/lib │ │ │ │ │ │ │ │ │ │ #section:compile │ │ │ │ │ ----------messages:(9/1175)---------- │ │ │ │ │ command: compile -XDignore.symbol.file /build/reproducible-path/openjdk-21-21.0.13+9/test/jdk/sun/security/krb5/auto/Addresses.java │ │ │ │ │ reason: User specified action: run compile -XDignore.symbol.file Addresses.java │ │ │ │ │ -started: Thu Oct 22 12:30:16.156 UTC 2026 │ │ │ │ │ +started: Fri Oct 23 05:52:04.165 UTC 2026 │ │ │ │ │ Additional options from @modules: --add-modules java.base,java.security.jgss,jdk.security.auth,jdk.security.jgss --add-exports java.base/jdk.internal.misc=ALL-UNNAMED --add-exports java.base/sun.security.util=ALL-UNNAMED --add-exports java.security.jgss/sun.security.jgss=ALL-UNNAMED --add-exports java.security.jgss/sun.security.jgss.krb5=ALL-UNNAMED --add-exports java.security.jgss/sun.security.krb5=ALL-UNNAMED --add-exports java.security.jgss/sun.security.krb5.internal=ALL-UNNAMED --add-exports java.security.jgss/sun.security.krb5.internal.ccache=ALL-UNNAMED --add-exports java.security.jgss/sun.security.krb5.internal.rcache=ALL-UNNAMED --add-exports java.security.jgss/sun.security.krb5.internal.crypto=ALL-UNNAMED --add-exports java.security.jgss/sun.security.krb5.internal.ktab=ALL-UNNAMED │ │ │ │ │ Mode: agentvm │ │ │ │ │ Agent id: 2 │ │ │ │ │ -Process id: 3099754 │ │ │ │ │ -finished: Thu Oct 22 12:30:17.151 UTC 2026 │ │ │ │ │ -elapsed time (seconds): 0.995 │ │ │ │ │ +Process id: 2004481 │ │ │ │ │ +finished: Fri Oct 23 05:52:05.190 UTC 2026 │ │ │ │ │ +elapsed time (seconds): 1.025 │ │ │ │ │ ----------configuration:(23/1523)---------- │ │ │ │ │ Boot Layer (javac runtime environment) │ │ │ │ │ class path: /usr/share/jtreg/lib/javatest.jar │ │ │ │ │ /usr/share/jtreg/lib/jtreg.jar │ │ │ │ │ patch: java.base /tmp/jdk/JTwork/patches/java.base │ │ │ │ │ │ │ │ │ │ javac compilation environment │ │ │ │ │ @@ -135,31 +135,31 @@ │ │ │ │ │ ----------stderr:(0/0)---------- │ │ │ │ │ result: Passed. Compilation successful │ │ │ │ │ │ │ │ │ │ #section:build │ │ │ │ │ ----------messages:(5/196)---------- │ │ │ │ │ command: build jdk.test.lib.FileInstaller │ │ │ │ │ reason: Named class compiled on demand │ │ │ │ │ -started: Thu Oct 22 12:30:17.151 UTC 2026 │ │ │ │ │ -finished: Thu Oct 22 12:30:17.152 UTC 2026 │ │ │ │ │ +started: Fri Oct 23 05:52:05.190 UTC 2026 │ │ │ │ │ +finished: Fri Oct 23 05:52:05.191 UTC 2026 │ │ │ │ │ elapsed time (seconds): 0.001 │ │ │ │ │ result: Passed. All files up to date │ │ │ │ │ │ │ │ │ │ #section:main │ │ │ │ │ ----------messages:(10/925)---------- │ │ │ │ │ command: main jdk.test.lib.FileInstaller TestHosts TestHosts │ │ │ │ │ reason: User specified action: run main jdk.test.lib.FileInstaller TestHosts TestHosts │ │ │ │ │ -started: Thu Oct 22 12:30:17.152 UTC 2026 │ │ │ │ │ +started: Fri Oct 23 05:52:05.192 UTC 2026 │ │ │ │ │ Mode: agentvm │ │ │ │ │ Agent id: 1 │ │ │ │ │ -Process id: 3099630 │ │ │ │ │ +Process id: 2004357 │ │ │ │ │ Additional exports to unnamed modules from @modules: java.base/jdk.internal.misc java.base/sun.security.util java.security.jgss/sun.security.jgss java.security.jgss/sun.security.jgss.krb5 java.security.jgss/sun.security.krb5 java.security.jgss/sun.security.krb5.internal java.security.jgss/sun.security.krb5.internal.ccache java.security.jgss/sun.security.krb5.internal.rcache java.security.jgss/sun.security.krb5.internal.crypto java.security.jgss/sun.security.krb5.internal.ktab │ │ │ │ │ Additional opens to unnamed modules from @modules: java.security.jgss/sun.security.krb5 java.security.jgss/sun.security.krb5.internal │ │ │ │ │ -finished: Thu Oct 22 12:30:17.225 UTC 2026 │ │ │ │ │ -elapsed time (seconds): 0.073 │ │ │ │ │ +finished: Fri Oct 23 05:52:05.277 UTC 2026 │ │ │ │ │ +elapsed time (seconds): 0.085 │ │ │ │ │ ----------configuration:(29/1782)---------- │ │ │ │ │ Boot Layer │ │ │ │ │ class path: /usr/share/jtreg/lib/javatest.jar │ │ │ │ │ /usr/share/jtreg/lib/jtreg.jar │ │ │ │ │ /usr/share/jtreg/lib/junit-platform-console-standalone.jar │ │ │ │ │ /usr/share/jtreg/lib/testng.jar │ │ │ │ │ /usr/share/jtreg/lib/guice.jar │ │ │ │ │ @@ -224,32 +224,32 @@ │ │ │ │ │ ----------System.err:(3/35)---------- │ │ │ │ │ │ │ │ │ │ JavaTest Message: Test complete. │ │ │ │ │ │ │ │ │ │ result: Passed. Execution successful │ │ │ │ │ │ │ │ │ │ #section:build │ │ │ │ │ -----------messages:(5/177)---------- │ │ │ │ │ +----------messages:(5/179)---------- │ │ │ │ │ command: build Addresses │ │ │ │ │ reason: Named class compiled on demand │ │ │ │ │ -started: Thu Oct 22 12:30:17.225 UTC 2026 │ │ │ │ │ -finished: Thu Oct 22 12:30:17.225 UTC 2026 │ │ │ │ │ -elapsed time (seconds): 0.0 │ │ │ │ │ +started: Fri Oct 23 05:52:05.277 UTC 2026 │ │ │ │ │ +finished: Fri Oct 23 05:52:05.278 UTC 2026 │ │ │ │ │ +elapsed time (seconds): 0.001 │ │ │ │ │ result: Passed. All files up to date │ │ │ │ │ │ │ │ │ │ #section:main │ │ │ │ │ ----------messages:(8/1247)---------- │ │ │ │ │ command: main -Djdk.net.hosts.file=TestHosts Addresses │ │ │ │ │ reason: User specified action: run main/othervm -Djdk.net.hosts.file=TestHosts Addresses │ │ │ │ │ -started: Thu Oct 22 12:30:17.226 UTC 2026 │ │ │ │ │ +started: Fri Oct 23 05:52:05.278 UTC 2026 │ │ │ │ │ Mode: othervm [/othervm specified] │ │ │ │ │ Additional options from @modules: --add-modules java.base,java.security.jgss,jdk.security.auth,jdk.security.jgss --add-exports java.base/jdk.internal.misc=ALL-UNNAMED --add-exports java.base/sun.security.util=ALL-UNNAMED --add-exports java.security.jgss/sun.security.jgss=ALL-UNNAMED --add-exports java.security.jgss/sun.security.jgss.krb5=ALL-UNNAMED --add-exports java.security.jgss/sun.security.krb5=ALL-UNNAMED --add-opens java.security.jgss/sun.security.krb5=ALL-UNNAMED --add-exports java.security.jgss/sun.security.krb5.internal=ALL-UNNAMED --add-opens java.security.jgss/sun.security.krb5.internal=ALL-UNNAMED --add-exports java.security.jgss/sun.security.krb5.internal.ccache=ALL-UNNAMED --add-exports java.security.jgss/sun.security.krb5.internal.rcache=ALL-UNNAMED --add-exports java.security.jgss/sun.security.krb5.internal.crypto=ALL-UNNAMED --add-exports java.security.jgss/sun.security.krb5.internal.ktab=ALL-UNNAMED │ │ │ │ │ -Process id: 3099786 │ │ │ │ │ -finished: Thu Oct 22 12:30:18.851 UTC 2026 │ │ │ │ │ -elapsed time (seconds): 1.625 │ │ │ │ │ +Process id: 2004514 │ │ │ │ │ +finished: Fri Oct 23 05:52:07.035 UTC 2026 │ │ │ │ │ +elapsed time (seconds): 1.757 │ │ │ │ │ ----------configuration:(15/1053)---------- │ │ │ │ │ Boot Layer │ │ │ │ │ add modules: java.base java.security.jgss jdk.security.auth jdk.security.jgss │ │ │ │ │ add exports: java.base/jdk.internal.misc ALL-UNNAMED │ │ │ │ │ java.base/sun.security.util ALL-UNNAMED │ │ │ │ │ java.security.jgss/sun.security.jgss ALL-UNNAMED │ │ │ │ │ java.security.jgss/sun.security.jgss.krb5 ALL-UNNAMED │ │ │ │ │ @@ -259,27 +259,27 @@ │ │ │ │ │ java.security.jgss/sun.security.krb5.internal.crypto ALL-UNNAMED │ │ │ │ │ java.security.jgss/sun.security.krb5.internal.ktab ALL-UNNAMED │ │ │ │ │ java.security.jgss/sun.security.krb5.internal.rcache ALL-UNNAMED │ │ │ │ │ add opens: java.security.jgss/sun.security.krb5 ALL-UNNAMED │ │ │ │ │ java.security.jgss/sun.security.krb5.internal ALL-UNNAMED │ │ │ │ │ │ │ │ │ │ ----------System.out:(24/852)---------- │ │ │ │ │ -Start KDC on 15376 │ │ │ │ │ +Start KDC on 15684 │ │ │ │ │ ----------------------------------------------- │ │ │ │ │ >>>>> UDP packet received │ │ │ │ │ -RABBIT.HOLE:15376> dummy@RABBIT.HOLE sends AS-REQ for krbtgt/RABBIT.HOLE@RABBIT.HOLE, KDCOptions: │ │ │ │ │ +RABBIT.HOLE:15684> dummy@RABBIT.HOLE sends AS-REQ for krbtgt/RABBIT.HOLE@RABBIT.HOLE, KDCOptions: │ │ │ │ │ KrbException: Additional pre-authentication required (25) │ │ │ │ │ at KDC.processAsReq(KDC.java:1335) │ │ │ │ │ at KDC.processMessage(KDC.java:809) │ │ │ │ │ at KDC$1.run(KDC.java:1565) │ │ │ │ │ Error 25 Additional pre-authentication required │ │ │ │ │ >>>>> UDP request honored │ │ │ │ │ ----------------------------------------------- │ │ │ │ │ >>>>> UDP packet received │ │ │ │ │ -RABBIT.HOLE:15376> dummy@RABBIT.HOLE sends AS-REQ for krbtgt/RABBIT.HOLE@RABBIT.HOLE, KDCOptions: │ │ │ │ │ +RABBIT.HOLE:15684> dummy@RABBIT.HOLE sends AS-REQ for krbtgt/RABBIT.HOLE@RABBIT.HOLE, KDCOptions: │ │ │ │ │ Return dummy@RABBIT.HOLE ticket for krbtgt/RABBIT.HOLE@RABBIT.HOLE, flags INITIAL;PRE-AUTHENT │ │ │ │ │ >>>>> UDP request honored │ │ │ │ │ /10.0.0.10 │ │ │ │ │ extra1 found │ │ │ │ │ /10.0.0.11 │ │ │ │ │ extra2 found │ │ │ │ │ /10.0.0.12 │ │ ├── ./usr/share/doc/openjdk-21-jre-headless/test-arm64/jtreg_output-hotspot.log.gz │ │ │ ├── jtreg_output-hotspot.log │ │ │ │ @@ -3148,31 +3148,31 @@ │ │ │ │ Results written to /tmp/hotspot/JTwork │ │ │ │ [debian/tests/jtreg-autopkgtest.sh] nothing to cleanup │ │ │ │ grep: debian/tests/hotspot-archs: No such file or directory │ │ │ │ Unable to compare jtreg results: no build jtreport found for hotspot/arm64. │ │ │ │ Reason: '/usr/share/doc/openjdk-21-jre-headless//test-arm64/jtreport-hotspot.tar.gz' does not exist. │ │ │ │ Command exited with non-zero status 77 │ │ │ │ Command being timed: "debian/tests/hotspot" │ │ │ │ - User time (seconds): 13963.24 │ │ │ │ - System time (seconds): 1986.21 │ │ │ │ - Percent of CPU this job got: 142% │ │ │ │ - Elapsed (wall clock) time (h:mm:ss or m:ss): 3:06:05 │ │ │ │ + User time (seconds): 12289.31 │ │ │ │ + System time (seconds): 1870.11 │ │ │ │ + Percent of CPU this job got: 116% │ │ │ │ + Elapsed (wall clock) time (h:mm:ss or m:ss): 3:22:05 │ │ │ │ Average shared text size (kbytes): 0 │ │ │ │ Average unshared data size (kbytes): 0 │ │ │ │ Average stack size (kbytes): 0 │ │ │ │ Average total size (kbytes): 0 │ │ │ │ - Maximum resident set size (kbytes): 6219468 │ │ │ │ + Maximum resident set size (kbytes): 6953232 │ │ │ │ Average resident set size (kbytes): 0 │ │ │ │ - Major (requiring I/O) page faults: 4149 │ │ │ │ - Minor (reclaiming a frame) page faults: 102220230 │ │ │ │ - Voluntary context switches: 60426512 │ │ │ │ - Involuntary context switches: 4813687 │ │ │ │ + Major (requiring I/O) page faults: 162008 │ │ │ │ + Minor (reclaiming a frame) page faults: 138321933 │ │ │ │ + Voluntary context switches: 41686145 │ │ │ │ + Involuntary context switches: 13735534 │ │ │ │ Swaps: 0 │ │ │ │ - File system inputs: 1415304 │ │ │ │ - File system outputs: 0 │ │ │ │ + File system inputs: 14813192 │ │ │ │ + File system outputs: 26509656 │ │ │ │ Socket messages sent: 0 │ │ │ │ Socket messages received: 0 │ │ │ │ Signals delivered: 0 │ │ │ │ Page size (bytes): 4096 │ │ │ │ Exit status: 77 │ │ │ │ ===== END check-hotspot ===== │ │ │ │ ===== START check-langtools ===== │ │ │ │ @@ -7631,31 +7631,31 @@ │ │ │ │ Results written to /tmp/langtools/JTwork │ │ │ │ [debian/tests/jtreg-autopkgtest.sh] nothing to cleanup │ │ │ │ grep: debian/tests/hotspot-archs: No such file or directory │ │ │ │ Unable to compare jtreg results: no build jtreport found for hotspot/arm64. │ │ │ │ Reason: '/usr/share/doc/openjdk-21-jre-headless//test-arm64/jtreport-hotspot.tar.gz' does not exist. │ │ │ │ Command exited with non-zero status 77 │ │ │ │ Command being timed: "debian/tests/langtools" │ │ │ │ - User time (seconds): 4942.76 │ │ │ │ - System time (seconds): 356.55 │ │ │ │ - Percent of CPU this job got: 146% │ │ │ │ - Elapsed (wall clock) time (h:mm:ss or m:ss): 1:00:19 │ │ │ │ + User time (seconds): 4042.76 │ │ │ │ + System time (seconds): 326.36 │ │ │ │ + Percent of CPU this job got: 141% │ │ │ │ + Elapsed (wall clock) time (h:mm:ss or m:ss): 51:38.39 │ │ │ │ Average shared text size (kbytes): 0 │ │ │ │ Average unshared data size (kbytes): 0 │ │ │ │ Average stack size (kbytes): 0 │ │ │ │ Average total size (kbytes): 0 │ │ │ │ - Maximum resident set size (kbytes): 5541904 │ │ │ │ + Maximum resident set size (kbytes): 7697612 │ │ │ │ Average resident set size (kbytes): 0 │ │ │ │ - Major (requiring I/O) page faults: 109 │ │ │ │ - Minor (reclaiming a frame) page faults: 11174972 │ │ │ │ - Voluntary context switches: 3966221 │ │ │ │ - Involuntary context switches: 53348 │ │ │ │ + Major (requiring I/O) page faults: 1677 │ │ │ │ + Minor (reclaiming a frame) page faults: 11526127 │ │ │ │ + Voluntary context switches: 4177562 │ │ │ │ + Involuntary context switches: 1085089 │ │ │ │ Swaps: 0 │ │ │ │ - File system inputs: 159960 │ │ │ │ - File system outputs: 0 │ │ │ │ + File system inputs: 851640 │ │ │ │ + File system outputs: 3202544 │ │ │ │ Socket messages sent: 0 │ │ │ │ Socket messages received: 0 │ │ │ │ Signals delivered: 0 │ │ │ │ Page size (bytes): 4096 │ │ │ │ Exit status: 77 │ │ │ │ ===== END check-langtools ===== │ │ │ │ ===== START check-jaxp ===== │ │ │ │ @@ -8181,62 +8181,62 @@ │ │ │ │ Results written to /tmp/jaxp/JTwork │ │ │ │ [debian/tests/jtreg-autopkgtest.sh] nothing to cleanup │ │ │ │ grep: debian/tests/hotspot-archs: No such file or directory │ │ │ │ Unable to compare jtreg results: no build jtreport found for hotspot/arm64. │ │ │ │ Reason: '/usr/share/doc/openjdk-21-jre-headless//test-arm64/jtreport-hotspot.tar.gz' does not exist. │ │ │ │ Command exited with non-zero status 77 │ │ │ │ Command being timed: "debian/tests/jaxp" │ │ │ │ - User time (seconds): 3259.83 │ │ │ │ - System time (seconds): 199.54 │ │ │ │ - Percent of CPU this job got: 276% │ │ │ │ - Elapsed (wall clock) time (h:mm:ss or m:ss): 20:50.34 │ │ │ │ + User time (seconds): 2566.03 │ │ │ │ + System time (seconds): 177.48 │ │ │ │ + Percent of CPU this job got: 171% │ │ │ │ + Elapsed (wall clock) time (h:mm:ss or m:ss): 26:40.12 │ │ │ │ Average shared text size (kbytes): 0 │ │ │ │ Average unshared data size (kbytes): 0 │ │ │ │ Average stack size (kbytes): 0 │ │ │ │ Average total size (kbytes): 0 │ │ │ │ - Maximum resident set size (kbytes): 428316 │ │ │ │ + Maximum resident set size (kbytes): 508084 │ │ │ │ Average resident set size (kbytes): 0 │ │ │ │ - Major (requiring I/O) page faults: 38 │ │ │ │ - Minor (reclaiming a frame) page faults: 11686046 │ │ │ │ - Voluntary context switches: 2993588 │ │ │ │ - Involuntary context switches: 22271 │ │ │ │ + Major (requiring I/O) page faults: 19 │ │ │ │ + Minor (reclaiming a frame) page faults: 11489677 │ │ │ │ + Voluntary context switches: 4052239 │ │ │ │ + Involuntary context switches: 2065629 │ │ │ │ Swaps: 0 │ │ │ │ - File system inputs: 155920 │ │ │ │ - File system outputs: 0 │ │ │ │ + File system inputs: 2224264 │ │ │ │ + File system outputs: 2901936 │ │ │ │ Socket messages sent: 0 │ │ │ │ Socket messages received: 0 │ │ │ │ Signals delivered: 0 │ │ │ │ Page size (bytes): 4096 │ │ │ │ Exit status: 77 │ │ │ │ ===== END check-jaxp ===== │ │ │ │ ===== START check-jdk ===== │ │ │ │ mkdir -p jtreg-test-output/jdk │ │ │ │ BOOTJDK_HOME=/usr/lib/jvm/java-21-openjdk-arm64 JTREG_OPTIONS= VMNAME=hotspot JDK_TO_TEST=build/bootcycle-build/images/jdk \ │ │ │ │ AUTOPKGTEST_TMP=/tmp/ AUTOPKGTEST_ARTIFACTS=jtreg-test-output/ \ │ │ │ │ /usr/bin/time -v debian/tests/jdk | tee jtreg-test-output/check-jdk.log │ │ │ │ │ │ │ │ -(xfwm4:2613947): atspi-WARNING **: 08:14:23.168: AT-SPI: Error retrieving accessibility bus address: org.freedesktop.DBus.Error.ServiceUnknown: The name org.a11y.Bus was not provided by any .service files │ │ │ │ -dbus-daemon[2613936]: [session uid=999 pid=2613936 pidfd=5] Activating service name='org.xfce.Xfconf' requested by ':1.1' (uid=999 pid=2613947 comm="xfwm4") │ │ │ │ -dbus-daemon[2613936]: [session uid=999 pid=2613936 pidfd=5] Successfully activated service 'org.xfce.Xfconf' │ │ │ │ +(xfwm4:1511599): atspi-WARNING **: 01:20:44.534: AT-SPI: Error retrieving accessibility bus address: org.freedesktop.DBus.Error.ServiceUnknown: The name org.a11y.Bus was not provided by any .service files │ │ │ │ +dbus-daemon[1511588]: [session uid=999 pid=1511588 pidfd=5] Activating service name='org.xfce.Xfconf' requested by ':1.1' (uid=999 pid=1511599 comm="xfwm4") │ │ │ │ +dbus-daemon[1511588]: [session uid=999 pid=1511588 pidfd=5] Successfully activated service 'org.xfce.Xfconf' │ │ │ │ WARNING: Glycin running without sandbox. Bubblewrap (bwrap) doesn't work in the environment. │ │ │ │ dpkg: error: --compare-versions takes three arguments: │ │ │ │ │ │ │ │ Type dpkg --help for help about installing and deinstalling packages [*]; │ │ │ │ Use 'apt' or 'aptitude' for user-friendly package management; │ │ │ │ Type dpkg -Dhelp for a list of dpkg debug flag values; │ │ │ │ Type dpkg --force-help for a list of forcing options; │ │ │ │ Type dpkg-deb --help for help about manipulating *.deb files; │ │ │ │ │ │ │ │ Options marked [*] produce a lot of output - pipe it through 'less' or 'more' ! │ │ │ │ - │ │ │ │ -(xfwm4:2613947): xfwm4-WARNING **: 08:14:26.075: Another compositing manager is running on screen 0 │ │ │ │ - │ │ │ │ -(xfwm4:2613947): xfwm4-WARNING **: 08:14:26.079: Failed to connect to session manager: Failed to connect to the session manager: SESSION_MANAGER environment variable not defined │ │ │ │ Directory "/tmp/jdk/JTwork" not found: creating │ │ │ │ Directory "jtreg-test-output/jdk/0/JTreport" not found: creating │ │ │ │ + │ │ │ │ +(xfwm4:1511599): xfwm4-WARNING **: 01:20:48.139: Another compositing manager is running on screen 0 │ │ │ │ + │ │ │ │ +(xfwm4:1511599): xfwm4-WARNING **: 01:20:48.140: Failed to connect to session manager: Failed to connect to the session manager: SESSION_MANAGER environment variable not defined │ │ │ │ Passed: com/sun/jdi/AcceptTimeout.java │ │ │ │ Passed: com/sun/jdi/AccessSpecifierTest.java │ │ │ │ Passed: com/sun/jdi/AfterThreadDeathTest.java │ │ │ │ Passed: com/sun/jdi/ArrayRangeTest.java │ │ │ │ Passed: com/sun/jdi/ConstantPoolInfo.java │ │ │ │ Passed: com/sun/jdi/CountFilterTest.java │ │ │ │ Passed: com/sun/jdi/EarlyReturnNegativeTest.java │ │ │ │ @@ -14742,33 +14742,33 @@ │ │ │ │ Passed: tools/launcher/TestXcheckJNIWarnings.java#noagent │ │ │ │ Passed: tools/launcher/ToolsOpts.java │ │ │ │ Passed: tools/launcher/TooSmallStackSize.java │ │ │ │ Passed: tools/launcher/UnicodeTest.java │ │ │ │ Passed: tools/launcher/UnresolvedExceptions.java │ │ │ │ Passed: tools/launcher/VersionCheck.java │ │ │ │ Test results: passed: 6,503; failed: 9; skipped: 115; excluded: 38; did not match keywords: 37; did not meet module requirements: 3; did not meet platform requirements: 99 │ │ │ │ +Error: Some tests failed or other problems occurred. │ │ │ │ Framework-based tests: 335,228 = 164,254 TestNG + 170,974 JUnit │ │ │ │ Report written to /build/reproducible-path/openjdk-21-21.0.13+9/jtreg-test-output/jdk/0/JTreport/html/report.html │ │ │ │ Results written to /tmp/jdk/JTwork │ │ │ │ -Error: Some tests failed or other problems occurred. │ │ │ │ Directory "jtreg-test-output/jdk/1/JTreport" not found: creating │ │ │ │ FAILED: java/net/MulticastSocket/B6427403.java │ │ │ │ FAILED: java/net/MulticastSocket/NoLoopbackPackets.java │ │ │ │ FAILED: java/net/MulticastSocket/Promiscuous.java │ │ │ │ FAILED: java/net/MulticastSocket/SetLoopbackMode.java │ │ │ │ FAILED: java/net/MulticastSocket/SetLoopbackModeIPv4.java │ │ │ │ FAILED: java/net/MulticastSocket/Test.java │ │ │ │ FAILED: java/net/SocketOption/OptionsTest.java │ │ │ │ FAILED: java/net/SocketPermission/SocketPermissionTest.java │ │ │ │ FAILED: sun/security/krb5/auto/Addresses.java │ │ │ │ Test results: failed: 9; excluded: 38; did not match keywords: 37; did not match prior status: 6,605 │ │ │ │ +Error: Some tests failed or other problems occurred. │ │ │ │ Framework-based tests: 8 = 8 TestNG + 0 JUnit │ │ │ │ Report written to /build/reproducible-path/openjdk-21-21.0.13+9/jtreg-test-output/jdk/1/JTreport/html/report.html │ │ │ │ Results written to /tmp/jdk/JTwork │ │ │ │ -Error: Some tests failed or other problems occurred. │ │ │ │ Directory "jtreg-test-output/jdk/2/JTreport" not found: creating │ │ │ │ FAILED: java/net/MulticastSocket/B6427403.java │ │ │ │ FAILED: java/net/MulticastSocket/NoLoopbackPackets.java │ │ │ │ FAILED: java/net/MulticastSocket/Promiscuous.java │ │ │ │ FAILED: java/net/MulticastSocket/SetLoopbackMode.java │ │ │ │ FAILED: java/net/MulticastSocket/SetLoopbackModeIPv4.java │ │ │ │ FAILED: java/net/MulticastSocket/Test.java │ │ │ │ @@ -14779,31 +14779,31 @@ │ │ │ │ Framework-based tests: 8 = 8 TestNG + 0 JUnit │ │ │ │ Report written to /build/reproducible-path/openjdk-21-21.0.13+9/jtreg-test-output/jdk/2/JTreport/html/report.html │ │ │ │ Results written to /tmp/jdk/JTwork │ │ │ │ Error: Some tests failed or other problems occurred. │ │ │ │ [debian/tests/jtreg-autopkgtest.sh] nothing to cleanup │ │ │ │ Command exited with non-zero status 2 │ │ │ │ Command being timed: "debian/tests/jdk" │ │ │ │ - User time (seconds): 22228.73 │ │ │ │ - System time (seconds): 1868.59 │ │ │ │ - Percent of CPU this job got: 156% │ │ │ │ - Elapsed (wall clock) time (h:mm:ss or m:ss): 4:16:25 │ │ │ │ + User time (seconds): 22537.96 │ │ │ │ + System time (seconds): 1962.42 │ │ │ │ + Percent of CPU this job got: 150% │ │ │ │ + Elapsed (wall clock) time (h:mm:ss or m:ss): 4:31:52 │ │ │ │ Average shared text size (kbytes): 0 │ │ │ │ Average unshared data size (kbytes): 0 │ │ │ │ Average stack size (kbytes): 0 │ │ │ │ Average total size (kbytes): 0 │ │ │ │ - Maximum resident set size (kbytes): 15232128 │ │ │ │ + Maximum resident set size (kbytes): 14978448 │ │ │ │ Average resident set size (kbytes): 0 │ │ │ │ - Major (requiring I/O) page faults: 1791 │ │ │ │ - Minor (reclaiming a frame) page faults: 73053746 │ │ │ │ - Voluntary context switches: 39755571 │ │ │ │ - Involuntary context switches: 1788511 │ │ │ │ + Major (requiring I/O) page faults: 1935 │ │ │ │ + Minor (reclaiming a frame) page faults: 93176945 │ │ │ │ + Voluntary context switches: 46067941 │ │ │ │ + Involuntary context switches: 7636838 │ │ │ │ Swaps: 0 │ │ │ │ - File system inputs: 1840424 │ │ │ │ - File system outputs: 0 │ │ │ │ + File system inputs: 4046912 │ │ │ │ + File system outputs: 87245752 │ │ │ │ Socket messages sent: 0 │ │ │ │ Socket messages received: 0 │ │ │ │ Signals delivered: 0 │ │ │ │ Page size (bytes): 4096 │ │ │ │ Exit status: 2 │ │ │ │ Killed │ │ │ │ ===== END check-jdk ===== │ │ │ │ @@ -14862,29 +14862,29 @@ │ │ │ │ FAILED: java/net/SocketPermission/SocketPermissionTest.java │ │ │ │ FAILED: sun/security/krb5/auto/Addresses.java │ │ │ │ Test results: failed: 9; excluded: 38; did not match keywords: 37; did not match prior status: 6,605 │ │ │ │ Framework-based tests: 8 = 8 TestNG + 0 JUnit │ │ │ │ [debian/tests/jtreg-autopkgtest.sh] nothing to cleanup │ │ │ │ make[2]: Leaving directory '/build/reproducible-path/openjdk-21-21.0.13+9' │ │ │ │ Command being timed: "/usr/bin/make -f debian/rules -k jtregcheck TEST_SUITES=hotspot langtools jaxp jdk JTREG_OPTIONS=" │ │ │ │ - User time (seconds): 44395.73 │ │ │ │ - System time (seconds): 4412.01 │ │ │ │ - Percent of CPU this job got: 155% │ │ │ │ - Elapsed (wall clock) time (h:mm:ss or m:ss): 8:43:42 │ │ │ │ + User time (seconds): 41437.14 │ │ │ │ + System time (seconds): 4337.56 │ │ │ │ + Percent of CPU this job got: 138% │ │ │ │ + Elapsed (wall clock) time (h:mm:ss or m:ss): 9:12:18 │ │ │ │ Average shared text size (kbytes): 0 │ │ │ │ Average unshared data size (kbytes): 0 │ │ │ │ Average stack size (kbytes): 0 │ │ │ │ Average total size (kbytes): 0 │ │ │ │ - Maximum resident set size (kbytes): 15232128 │ │ │ │ + Maximum resident set size (kbytes): 14978448 │ │ │ │ Average resident set size (kbytes): 0 │ │ │ │ - Major (requiring I/O) page faults: 6092 │ │ │ │ - Minor (reclaiming a frame) page faults: 198153119 │ │ │ │ - Voluntary context switches: 107156840 │ │ │ │ - Involuntary context switches: 6677867 │ │ │ │ + Major (requiring I/O) page faults: 165793 │ │ │ │ + Minor (reclaiming a frame) page faults: 254533162 │ │ │ │ + Voluntary context switches: 95999069 │ │ │ │ + Involuntary context switches: 24525097 │ │ │ │ Swaps: 0 │ │ │ │ - File system inputs: 3571760 │ │ │ │ - File system outputs: 0 │ │ │ │ + File system inputs: 21943528 │ │ │ │ + File system outputs: 119882768 │ │ │ │ Socket messages sent: 0 │ │ │ │ Socket messages received: 0 │ │ │ │ Signals delivered: 0 │ │ │ │ Page size (bytes): 4096 │ │ │ │ Exit status: 0 │ │ ├── ./usr/share/doc/openjdk-21-jre-headless/test-arm64/jtreport-hotspot.tar.gz │ │ │ ├── jtreport-hotspot.tar │ │ │ │ ├── file list │ │ │ │ │ @@ -1,230 +1,230 @@ │ │ │ │ │ -lrwxrwxrwx 0 sbuild (999) sbuild (999) 0 2026-10-22 12:30:47.000000 jtreg-test-output/jdk/JTreport -> 2/JTreport │ │ │ │ │ -drwxr-xr-x 0 sbuild (999) sbuild (999) 0 2026-10-22 12:30:22.000000 jtreg-test-output/jdk/2/JTreport/ │ │ │ │ │ --rw-r--r-- 0 sbuild (999) sbuild (999) 708 2026-10-22 12:30:22.000000 jtreg-test-output/jdk/2/JTreport/index.html │ │ │ │ │ --rw-r--r-- 0 sbuild (999) sbuild (999) 0 2026-10-22 12:30:22.000000 jtreg-test-output/jdk/2/JTreport/reportdir.dat │ │ │ │ │ -drwxr-xr-x 0 sbuild (999) sbuild (999) 0 2026-10-22 12:30:22.000000 jtreg-test-output/jdk/2/JTreport/html/ │ │ │ │ │ --rw-r--r-- 0 sbuild (999) sbuild (999) 762781 2026-10-22 12:30:22.000000 jtreg-test-output/jdk/2/JTreport/html/notRun_gr.html │ │ │ │ │ --rw-r--r-- 0 sbuild (999) sbuild (999) 762508 2026-10-22 12:30:22.000000 jtreg-test-output/jdk/2/JTreport/html/notRun.html │ │ │ │ │ --rw-r--r-- 0 sbuild (999) sbuild (999) 522 2026-10-22 12:30:22.000000 jtreg-test-output/jdk/2/JTreport/html/error_gr.html │ │ │ │ │ --rw-r--r-- 0 sbuild (999) sbuild (999) 474 2026-10-22 12:30:22.000000 jtreg-test-output/jdk/2/JTreport/html/error.html │ │ │ │ │ --rw-r--r-- 0 sbuild (999) sbuild (999) 2751 2026-10-22 12:30:22.000000 jtreg-test-output/jdk/2/JTreport/html/failed_gr.html │ │ │ │ │ --rw-r--r-- 0 sbuild (999) sbuild (999) 2021 2026-10-22 12:30:22.000000 jtreg-test-output/jdk/2/JTreport/html/failed.html │ │ │ │ │ --rw-r--r-- 0 sbuild (999) sbuild (999) 1251629 2026-10-22 12:30:22.000000 jtreg-test-output/jdk/2/JTreport/html/passed_gr.html │ │ │ │ │ --rw-r--r-- 0 sbuild (999) sbuild (999) 1250432 2026-10-22 12:30:22.000000 jtreg-test-output/jdk/2/JTreport/html/passed.html │ │ │ │ │ --rw-r--r-- 0 sbuild (999) sbuild (999) 83175 2026-10-22 12:30:22.000000 jtreg-test-output/jdk/2/JTreport/html/excluded.html │ │ │ │ │ --rw-r--r-- 0 sbuild (999) sbuild (999) 4220 2026-10-22 12:30:22.000000 jtreg-test-output/jdk/2/JTreport/html/env.html │ │ │ │ │ --rw-r--r-- 0 sbuild (999) sbuild (999) 24356 2026-10-22 12:30:22.000000 jtreg-test-output/jdk/2/JTreport/html/config.html │ │ │ │ │ --rw-r--r-- 0 sbuild (999) sbuild (999) 307 2026-10-22 12:30:22.000000 jtreg-test-output/jdk/2/JTreport/html/report.css │ │ │ │ │ --rw-r--r-- 0 sbuild (999) sbuild (999) 1101105 2026-10-22 12:30:22.000000 jtreg-test-output/jdk/2/JTreport/html/index.html │ │ │ │ │ --rw-r--r-- 0 sbuild (999) sbuild (999) 1101105 2026-10-22 12:30:22.000000 jtreg-test-output/jdk/2/JTreport/html/report.html │ │ │ │ │ -drwxr-xr-x 0 sbuild (999) sbuild (999) 0 2026-10-22 12:30:22.000000 jtreg-test-output/jdk/2/JTreport/text/ │ │ │ │ │ --rw-r--r-- 0 sbuild (999) sbuild (999) 132 2026-10-22 12:30:22.000000 jtreg-test-output/jdk/2/JTreport/text/testng.txt │ │ │ │ │ --rw-r--r-- 0 sbuild (999) sbuild (999) 1023561 2026-10-22 12:30:22.000000 jtreg-test-output/jdk/2/JTreport/text/notRun.txt │ │ │ │ │ --rw-r--r-- 0 sbuild (999) sbuild (999) 101 2026-10-22 12:30:22.000000 jtreg-test-output/jdk/2/JTreport/text/stats.txt │ │ │ │ │ --rw-r--r-- 0 sbuild (999) sbuild (999) 116 2026-10-22 12:30:22.000000 jtreg-test-output/jdk/2/JTreport/text/timeStats.txt │ │ │ │ │ --rw-r--r-- 0 sbuild (999) sbuild (999) 21 2026-10-22 12:30:22.000000 jtreg-test-output/jdk/2/JTreport/text/tc_newfailures.txt │ │ │ │ │ --rw-r--r-- 0 sbuild (999) sbuild (999) 21 2026-10-22 12:30:22.000000 jtreg-test-output/jdk/2/JTreport/text/tc_fail2notrun.txt │ │ │ │ │ --rw-r--r-- 0 sbuild (999) sbuild (999) 20 2026-10-22 12:30:22.000000 jtreg-test-output/jdk/2/JTreport/text/tc_fail2error.txt │ │ │ │ │ --rw-r--r-- 0 sbuild (999) sbuild (999) 19 2026-10-22 12:30:22.000000 jtreg-test-output/jdk/2/JTreport/text/tc_fail2pass.txt │ │ │ │ │ --rw-r--r-- 0 sbuild (999) sbuild (999) 22 2026-10-22 12:30:22.000000 jtreg-test-output/jdk/2/JTreport/text/tc_fail2missing.txt │ │ │ │ │ --rw-r--r-- 0 sbuild (999) sbuild (999) 19 2026-10-22 12:30:22.000000 jtreg-test-output/jdk/2/JTreport/text/other_errors.txt │ │ │ │ │ --rw-r--r-- 0 sbuild (999) sbuild (999) 416 2026-10-22 12:30:22.000000 jtreg-test-output/jdk/2/JTreport/text/newfailures.txt │ │ │ │ │ --rw-r--r-- 0 sbuild (999) sbuild (999) 16 2026-10-22 12:30:22.000000 jtreg-test-output/jdk/2/JTreport/text/fail2fail.txt │ │ │ │ │ --rw-r--r-- 0 sbuild (999) sbuild (999) 18 2026-10-22 12:30:22.000000 jtreg-test-output/jdk/2/JTreport/text/fail2notrun.txt │ │ │ │ │ --rw-r--r-- 0 sbuild (999) sbuild (999) 17 2026-10-22 12:30:22.000000 jtreg-test-output/jdk/2/JTreport/text/faiL2error.txt │ │ │ │ │ --rw-r--r-- 0 sbuild (999) sbuild (999) 16 2026-10-22 12:30:22.000000 jtreg-test-output/jdk/2/JTreport/text/fail2pass.txt │ │ │ │ │ --rw-r--r-- 0 sbuild (999) sbuild (999) 19 2026-10-22 12:30:22.000000 jtreg-test-output/jdk/2/JTreport/text/fail2missing.txt │ │ │ │ │ --rw-r--r-- 0 sbuild (999) sbuild (999) 890230 2026-10-22 12:30:22.000000 jtreg-test-output/jdk/2/JTreport/text/summary.txt │ │ │ │ │ --rw-r--r-- 0 sbuild (999) sbuild (999) 548 2026-10-22 12:30:09.000000 jtreg-test-output/jdk/2/JTreport/text/cmdArgs.txt │ │ │ │ │ -drwxr-xr-x 0 sbuild (999) sbuild (999) 0 2026-10-22 12:29:44.000000 jtreg-test-output/jdk/1/JTreport/ │ │ │ │ │ --rw-r--r-- 0 sbuild (999) sbuild (999) 708 2026-10-22 12:29:44.000000 jtreg-test-output/jdk/1/JTreport/index.html │ │ │ │ │ --rw-r--r-- 0 sbuild (999) sbuild (999) 0 2026-10-22 12:29:44.000000 jtreg-test-output/jdk/1/JTreport/reportdir.dat │ │ │ │ │ -drwxr-xr-x 0 sbuild (999) sbuild (999) 0 2026-10-22 12:29:44.000000 jtreg-test-output/jdk/1/JTreport/html/ │ │ │ │ │ --rw-r--r-- 0 sbuild (999) sbuild (999) 762781 2026-10-22 12:29:44.000000 jtreg-test-output/jdk/1/JTreport/html/notRun_gr.html │ │ │ │ │ --rw-r--r-- 0 sbuild (999) sbuild (999) 762508 2026-10-22 12:29:44.000000 jtreg-test-output/jdk/1/JTreport/html/notRun.html │ │ │ │ │ --rw-r--r-- 0 sbuild (999) sbuild (999) 522 2026-10-22 12:29:44.000000 jtreg-test-output/jdk/1/JTreport/html/error_gr.html │ │ │ │ │ --rw-r--r-- 0 sbuild (999) sbuild (999) 474 2026-10-22 12:29:44.000000 jtreg-test-output/jdk/1/JTreport/html/error.html │ │ │ │ │ --rw-r--r-- 0 sbuild (999) sbuild (999) 2751 2026-10-22 12:29:44.000000 jtreg-test-output/jdk/1/JTreport/html/failed_gr.html │ │ │ │ │ --rw-r--r-- 0 sbuild (999) sbuild (999) 2021 2026-10-22 12:29:44.000000 jtreg-test-output/jdk/1/JTreport/html/failed.html │ │ │ │ │ --rw-r--r-- 0 sbuild (999) sbuild (999) 1251629 2026-10-22 12:29:44.000000 jtreg-test-output/jdk/1/JTreport/html/passed_gr.html │ │ │ │ │ --rw-r--r-- 0 sbuild (999) sbuild (999) 1250432 2026-10-22 12:29:44.000000 jtreg-test-output/jdk/1/JTreport/html/passed.html │ │ │ │ │ --rw-r--r-- 0 sbuild (999) sbuild (999) 83175 2026-10-22 12:29:44.000000 jtreg-test-output/jdk/1/JTreport/html/excluded.html │ │ │ │ │ --rw-r--r-- 0 sbuild (999) sbuild (999) 4220 2026-10-22 12:29:44.000000 jtreg-test-output/jdk/1/JTreport/html/env.html │ │ │ │ │ --rw-r--r-- 0 sbuild (999) sbuild (999) 24356 2026-10-22 12:29:44.000000 jtreg-test-output/jdk/1/JTreport/html/config.html │ │ │ │ │ --rw-r--r-- 0 sbuild (999) sbuild (999) 307 2026-10-22 12:29:43.000000 jtreg-test-output/jdk/1/JTreport/html/report.css │ │ │ │ │ --rw-r--r-- 0 sbuild (999) sbuild (999) 1101105 2026-10-22 12:29:44.000000 jtreg-test-output/jdk/1/JTreport/html/index.html │ │ │ │ │ --rw-r--r-- 0 sbuild (999) sbuild (999) 1101105 2026-10-22 12:29:44.000000 jtreg-test-output/jdk/1/JTreport/html/report.html │ │ │ │ │ -drwxr-xr-x 0 sbuild (999) sbuild (999) 0 2026-10-22 12:29:44.000000 jtreg-test-output/jdk/1/JTreport/text/ │ │ │ │ │ --rw-r--r-- 0 sbuild (999) sbuild (999) 132 2026-10-22 12:29:44.000000 jtreg-test-output/jdk/1/JTreport/text/testng.txt │ │ │ │ │ --rw-r--r-- 0 sbuild (999) sbuild (999) 1023561 2026-10-22 12:29:44.000000 jtreg-test-output/jdk/1/JTreport/text/notRun.txt │ │ │ │ │ --rw-r--r-- 0 sbuild (999) sbuild (999) 101 2026-10-22 12:29:44.000000 jtreg-test-output/jdk/1/JTreport/text/stats.txt │ │ │ │ │ --rw-r--r-- 0 sbuild (999) sbuild (999) 116 2026-10-22 12:29:44.000000 jtreg-test-output/jdk/1/JTreport/text/timeStats.txt │ │ │ │ │ --rw-r--r-- 0 sbuild (999) sbuild (999) 21 2026-10-22 12:29:44.000000 jtreg-test-output/jdk/1/JTreport/text/tc_newfailures.txt │ │ │ │ │ --rw-r--r-- 0 sbuild (999) sbuild (999) 21 2026-10-22 12:29:44.000000 jtreg-test-output/jdk/1/JTreport/text/tc_fail2notrun.txt │ │ │ │ │ --rw-r--r-- 0 sbuild (999) sbuild (999) 20 2026-10-22 12:29:44.000000 jtreg-test-output/jdk/1/JTreport/text/tc_fail2error.txt │ │ │ │ │ --rw-r--r-- 0 sbuild (999) sbuild (999) 19 2026-10-22 12:29:44.000000 jtreg-test-output/jdk/1/JTreport/text/tc_fail2pass.txt │ │ │ │ │ --rw-r--r-- 0 sbuild (999) sbuild (999) 22 2026-10-22 12:29:44.000000 jtreg-test-output/jdk/1/JTreport/text/tc_fail2missing.txt │ │ │ │ │ --rw-r--r-- 0 sbuild (999) sbuild (999) 19 2026-10-22 12:29:44.000000 jtreg-test-output/jdk/1/JTreport/text/other_errors.txt │ │ │ │ │ --rw-r--r-- 0 sbuild (999) sbuild (999) 416 2026-10-22 12:29:44.000000 jtreg-test-output/jdk/1/JTreport/text/newfailures.txt │ │ │ │ │ --rw-r--r-- 0 sbuild (999) sbuild (999) 16 2026-10-22 12:29:44.000000 jtreg-test-output/jdk/1/JTreport/text/fail2fail.txt │ │ │ │ │ --rw-r--r-- 0 sbuild (999) sbuild (999) 18 2026-10-22 12:29:44.000000 jtreg-test-output/jdk/1/JTreport/text/fail2notrun.txt │ │ │ │ │ --rw-r--r-- 0 sbuild (999) sbuild (999) 17 2026-10-22 12:29:44.000000 jtreg-test-output/jdk/1/JTreport/text/faiL2error.txt │ │ │ │ │ --rw-r--r-- 0 sbuild (999) sbuild (999) 16 2026-10-22 12:29:44.000000 jtreg-test-output/jdk/1/JTreport/text/fail2pass.txt │ │ │ │ │ --rw-r--r-- 0 sbuild (999) sbuild (999) 19 2026-10-22 12:29:44.000000 jtreg-test-output/jdk/1/JTreport/text/fail2missing.txt │ │ │ │ │ --rw-r--r-- 0 sbuild (999) sbuild (999) 890230 2026-10-22 12:29:44.000000 jtreg-test-output/jdk/1/JTreport/text/summary.txt │ │ │ │ │ --rw-r--r-- 0 sbuild (999) sbuild (999) 548 2026-10-22 12:29:31.000000 jtreg-test-output/jdk/1/JTreport/text/cmdArgs.txt │ │ │ │ │ -drwxr-xr-x 0 sbuild (999) sbuild (999) 0 2026-10-22 12:29:06.000000 jtreg-test-output/jdk/0/JTreport/ │ │ │ │ │ --rw-r--r-- 0 sbuild (999) sbuild (999) 708 2026-10-22 12:29:06.000000 jtreg-test-output/jdk/0/JTreport/index.html │ │ │ │ │ --rw-r--r-- 0 sbuild (999) sbuild (999) 0 2026-10-22 12:29:06.000000 jtreg-test-output/jdk/0/JTreport/reportdir.dat │ │ │ │ │ -drwxr-xr-x 0 sbuild (999) sbuild (999) 0 2026-10-22 12:29:06.000000 jtreg-test-output/jdk/0/JTreport/html/ │ │ │ │ │ --rw-r--r-- 0 sbuild (999) sbuild (999) 20685 2026-10-22 12:29:06.000000 jtreg-test-output/jdk/0/JTreport/html/notRun_gr.html │ │ │ │ │ --rw-r--r-- 0 sbuild (999) sbuild (999) 20340 2026-10-22 12:29:06.000000 jtreg-test-output/jdk/0/JTreport/html/notRun.html │ │ │ │ │ --rw-r--r-- 0 sbuild (999) sbuild (999) 522 2026-10-22 12:29:06.000000 jtreg-test-output/jdk/0/JTreport/html/error_gr.html │ │ │ │ │ --rw-r--r-- 0 sbuild (999) sbuild (999) 474 2026-10-22 12:29:06.000000 jtreg-test-output/jdk/0/JTreport/html/error.html │ │ │ │ │ --rw-r--r-- 0 sbuild (999) sbuild (999) 2751 2026-10-22 12:29:06.000000 jtreg-test-output/jdk/0/JTreport/html/failed_gr.html │ │ │ │ │ --rw-r--r-- 0 sbuild (999) sbuild (999) 2021 2026-10-22 12:29:06.000000 jtreg-test-output/jdk/0/JTreport/html/failed.html │ │ │ │ │ --rw-r--r-- 0 sbuild (999) sbuild (999) 1251629 2026-10-22 12:29:06.000000 jtreg-test-output/jdk/0/JTreport/html/passed_gr.html │ │ │ │ │ --rw-r--r-- 0 sbuild (999) sbuild (999) 1250432 2026-10-22 12:29:06.000000 jtreg-test-output/jdk/0/JTreport/html/passed.html │ │ │ │ │ --rw-r--r-- 0 sbuild (999) sbuild (999) 83175 2026-10-22 12:29:06.000000 jtreg-test-output/jdk/0/JTreport/html/excluded.html │ │ │ │ │ --rw-r--r-- 0 sbuild (999) sbuild (999) 4201 2026-10-22 12:29:06.000000 jtreg-test-output/jdk/0/JTreport/html/env.html │ │ │ │ │ --rw-r--r-- 0 sbuild (999) sbuild (999) 23924 2026-10-22 12:29:06.000000 jtreg-test-output/jdk/0/JTreport/html/config.html │ │ │ │ │ --rw-r--r-- 0 sbuild (999) sbuild (999) 307 2026-10-22 12:29:05.000000 jtreg-test-output/jdk/0/JTreport/html/report.css │ │ │ │ │ --rw-r--r-- 0 sbuild (999) sbuild (999) 1123763 2026-10-22 12:29:06.000000 jtreg-test-output/jdk/0/JTreport/html/index.html │ │ │ │ │ --rw-r--r-- 0 sbuild (999) sbuild (999) 1123763 2026-10-22 12:29:06.000000 jtreg-test-output/jdk/0/JTreport/html/report.html │ │ │ │ │ -drwxr-xr-x 0 sbuild (999) sbuild (999) 0 2026-10-22 12:29:06.000000 jtreg-test-output/jdk/0/JTreport/text/ │ │ │ │ │ --rw-r--r-- 0 sbuild (999) sbuild (999) 86012 2026-10-22 12:29:06.000000 jtreg-test-output/jdk/0/JTreport/text/junit.txt │ │ │ │ │ --rw-r--r-- 0 sbuild (999) sbuild (999) 131917 2026-10-22 12:29:06.000000 jtreg-test-output/jdk/0/JTreport/text/testng.txt │ │ │ │ │ --rw-r--r-- 0 sbuild (999) sbuild (999) 26283 2026-10-22 12:29:06.000000 jtreg-test-output/jdk/0/JTreport/text/notRun.txt │ │ │ │ │ --rw-r--r-- 0 sbuild (999) sbuild (999) 172 2026-10-22 12:29:06.000000 jtreg-test-output/jdk/0/JTreport/text/stats.txt │ │ │ │ │ --rw-r--r-- 0 sbuild (999) sbuild (999) 983 2026-10-22 12:29:06.000000 jtreg-test-output/jdk/0/JTreport/text/timeStats.txt │ │ │ │ │ --rw-r--r-- 0 sbuild (999) sbuild (999) 21 2026-10-22 12:29:06.000000 jtreg-test-output/jdk/0/JTreport/text/tc_newfailures.txt │ │ │ │ │ --rw-r--r-- 0 sbuild (999) sbuild (999) 21 2026-10-22 12:29:06.000000 jtreg-test-output/jdk/0/JTreport/text/tc_fail2notrun.txt │ │ │ │ │ --rw-r--r-- 0 sbuild (999) sbuild (999) 20 2026-10-22 12:29:06.000000 jtreg-test-output/jdk/0/JTreport/text/tc_fail2error.txt │ │ │ │ │ --rw-r--r-- 0 sbuild (999) sbuild (999) 19 2026-10-22 12:29:06.000000 jtreg-test-output/jdk/0/JTreport/text/tc_fail2pass.txt │ │ │ │ │ --rw-r--r-- 0 sbuild (999) sbuild (999) 22 2026-10-22 12:29:06.000000 jtreg-test-output/jdk/0/JTreport/text/tc_fail2missing.txt │ │ │ │ │ --rw-r--r-- 0 sbuild (999) sbuild (999) 19 2026-10-22 12:29:06.000000 jtreg-test-output/jdk/0/JTreport/text/other_errors.txt │ │ │ │ │ --rw-r--r-- 0 sbuild (999) sbuild (999) 416 2026-10-22 12:29:06.000000 jtreg-test-output/jdk/0/JTreport/text/newfailures.txt │ │ │ │ │ --rw-r--r-- 0 sbuild (999) sbuild (999) 16 2026-10-22 12:29:06.000000 jtreg-test-output/jdk/0/JTreport/text/fail2fail.txt │ │ │ │ │ --rw-r--r-- 0 sbuild (999) sbuild (999) 18 2026-10-22 12:29:06.000000 jtreg-test-output/jdk/0/JTreport/text/fail2notrun.txt │ │ │ │ │ --rw-r--r-- 0 sbuild (999) sbuild (999) 17 2026-10-22 12:29:06.000000 jtreg-test-output/jdk/0/JTreport/text/faiL2error.txt │ │ │ │ │ --rw-r--r-- 0 sbuild (999) sbuild (999) 16 2026-10-22 12:29:06.000000 jtreg-test-output/jdk/0/JTreport/text/fail2pass.txt │ │ │ │ │ --rw-r--r-- 0 sbuild (999) sbuild (999) 19 2026-10-22 12:29:06.000000 jtreg-test-output/jdk/0/JTreport/text/fail2missing.txt │ │ │ │ │ --rw-r--r-- 0 sbuild (999) sbuild (999) 890230 2026-10-22 12:29:06.000000 jtreg-test-output/jdk/0/JTreport/text/summary.txt │ │ │ │ │ --rw-r--r-- 0 sbuild (999) sbuild (999) 529 2026-10-22 08:14:26.000000 jtreg-test-output/jdk/0/JTreport/text/cmdArgs.txt │ │ │ │ │ -lrwxrwxrwx 0 sbuild (999) sbuild (999) 0 2026-10-22 08:14:22.000000 jtreg-test-output/jaxp/JTreport -> 0/JTreport │ │ │ │ │ -drwxr-xr-x 0 sbuild (999) sbuild (999) 0 2026-10-22 08:14:20.000000 jtreg-test-output/jaxp/0/JTreport/ │ │ │ │ │ --rw-r--r-- 0 sbuild (999) sbuild (999) 710 2026-10-22 08:14:20.000000 jtreg-test-output/jaxp/0/JTreport/index.html │ │ │ │ │ --rw-r--r-- 0 sbuild (999) sbuild (999) 0 2026-10-22 08:14:20.000000 jtreg-test-output/jaxp/0/JTreport/reportdir.dat │ │ │ │ │ -drwxr-xr-x 0 sbuild (999) sbuild (999) 0 2026-10-22 08:14:20.000000 jtreg-test-output/jaxp/0/JTreport/html/ │ │ │ │ │ --rw-r--r-- 0 sbuild (999) sbuild (999) 695 2026-10-22 08:14:20.000000 jtreg-test-output/jaxp/0/JTreport/html/notRun_gr.html │ │ │ │ │ --rw-r--r-- 0 sbuild (999) sbuild (999) 573 2026-10-22 08:14:20.000000 jtreg-test-output/jaxp/0/JTreport/html/notRun.html │ │ │ │ │ --rw-r--r-- 0 sbuild (999) sbuild (999) 521 2026-10-22 08:14:20.000000 jtreg-test-output/jaxp/0/JTreport/html/error_gr.html │ │ │ │ │ --rw-r--r-- 0 sbuild (999) sbuild (999) 473 2026-10-22 08:14:20.000000 jtreg-test-output/jaxp/0/JTreport/html/error.html │ │ │ │ │ --rw-r--r-- 0 sbuild (999) sbuild (999) 513 2026-10-22 08:14:20.000000 jtreg-test-output/jaxp/0/JTreport/html/failed_gr.html │ │ │ │ │ --rw-r--r-- 0 sbuild (999) sbuild (999) 465 2026-10-22 08:14:20.000000 jtreg-test-output/jaxp/0/JTreport/html/failed.html │ │ │ │ │ --rw-r--r-- 0 sbuild (999) sbuild (999) 110062 2026-10-22 08:14:20.000000 jtreg-test-output/jaxp/0/JTreport/html/passed_gr.html │ │ │ │ │ --rw-r--r-- 0 sbuild (999) sbuild (999) 109973 2026-10-22 08:14:20.000000 jtreg-test-output/jaxp/0/JTreport/html/passed.html │ │ │ │ │ --rw-r--r-- 0 sbuild (999) sbuild (999) 3642 2026-10-22 08:14:20.000000 jtreg-test-output/jaxp/0/JTreport/html/excluded.html │ │ │ │ │ --rw-r--r-- 0 sbuild (999) sbuild (999) 4110 2026-10-22 08:14:20.000000 jtreg-test-output/jaxp/0/JTreport/html/env.html │ │ │ │ │ --rw-r--r-- 0 sbuild (999) sbuild (999) 4423 2026-10-22 08:14:20.000000 jtreg-test-output/jaxp/0/JTreport/html/config.html │ │ │ │ │ --rw-r--r-- 0 sbuild (999) sbuild (999) 307 2026-10-22 08:14:20.000000 jtreg-test-output/jaxp/0/JTreport/html/report.css │ │ │ │ │ --rw-r--r-- 0 sbuild (999) sbuild (999) 58492 2026-10-22 08:14:20.000000 jtreg-test-output/jaxp/0/JTreport/html/index.html │ │ │ │ │ --rw-r--r-- 0 sbuild (999) sbuild (999) 58492 2026-10-22 08:14:20.000000 jtreg-test-output/jaxp/0/JTreport/html/report.html │ │ │ │ │ -drwxr-xr-x 0 sbuild (999) sbuild (999) 0 2026-10-22 08:14:20.000000 jtreg-test-output/jaxp/0/JTreport/text/ │ │ │ │ │ --rw-r--r-- 0 sbuild (999) sbuild (999) 200 2026-10-22 08:14:20.000000 jtreg-test-output/jaxp/0/JTreport/text/junit.txt │ │ │ │ │ --rw-r--r-- 0 sbuild (999) sbuild (999) 69461 2026-10-22 08:14:20.000000 jtreg-test-output/jaxp/0/JTreport/text/testng.txt │ │ │ │ │ --rw-r--r-- 0 sbuild (999) sbuild (999) 116 2026-10-22 08:14:20.000000 jtreg-test-output/jaxp/0/JTreport/text/notRun.txt │ │ │ │ │ --rw-r--r-- 0 sbuild (999) sbuild (999) 65 2026-10-22 08:14:20.000000 jtreg-test-output/jaxp/0/JTreport/text/stats.txt │ │ │ │ │ --rw-r--r-- 0 sbuild (999) sbuild (999) 154 2026-10-22 08:14:20.000000 jtreg-test-output/jaxp/0/JTreport/text/timeStats.txt │ │ │ │ │ --rw-r--r-- 0 sbuild (999) sbuild (999) 21 2026-10-22 08:14:20.000000 jtreg-test-output/jaxp/0/JTreport/text/tc_newfailures.txt │ │ │ │ │ --rw-r--r-- 0 sbuild (999) sbuild (999) 21 2026-10-22 08:14:20.000000 jtreg-test-output/jaxp/0/JTreport/text/tc_fail2notrun.txt │ │ │ │ │ --rw-r--r-- 0 sbuild (999) sbuild (999) 20 2026-10-22 08:14:20.000000 jtreg-test-output/jaxp/0/JTreport/text/tc_fail2error.txt │ │ │ │ │ --rw-r--r-- 0 sbuild (999) sbuild (999) 19 2026-10-22 08:14:20.000000 jtreg-test-output/jaxp/0/JTreport/text/tc_fail2pass.txt │ │ │ │ │ --rw-r--r-- 0 sbuild (999) sbuild (999) 22 2026-10-22 08:14:20.000000 jtreg-test-output/jaxp/0/JTreport/text/tc_fail2missing.txt │ │ │ │ │ --rw-r--r-- 0 sbuild (999) sbuild (999) 19 2026-10-22 08:14:20.000000 jtreg-test-output/jaxp/0/JTreport/text/other_errors.txt │ │ │ │ │ --rw-r--r-- 0 sbuild (999) sbuild (999) 18 2026-10-22 08:14:20.000000 jtreg-test-output/jaxp/0/JTreport/text/newfailures.txt │ │ │ │ │ --rw-r--r-- 0 sbuild (999) sbuild (999) 16 2026-10-22 08:14:20.000000 jtreg-test-output/jaxp/0/JTreport/text/fail2fail.txt │ │ │ │ │ --rw-r--r-- 0 sbuild (999) sbuild (999) 18 2026-10-22 08:14:20.000000 jtreg-test-output/jaxp/0/JTreport/text/fail2notrun.txt │ │ │ │ │ --rw-r--r-- 0 sbuild (999) sbuild (999) 17 2026-10-22 08:14:20.000000 jtreg-test-output/jaxp/0/JTreport/text/faiL2error.txt │ │ │ │ │ --rw-r--r-- 0 sbuild (999) sbuild (999) 16 2026-10-22 08:14:20.000000 jtreg-test-output/jaxp/0/JTreport/text/fail2pass.txt │ │ │ │ │ --rw-r--r-- 0 sbuild (999) sbuild (999) 19 2026-10-22 08:14:20.000000 jtreg-test-output/jaxp/0/JTreport/text/fail2missing.txt │ │ │ │ │ --rw-r--r-- 0 sbuild (999) sbuild (999) 59118 2026-10-22 08:14:20.000000 jtreg-test-output/jaxp/0/JTreport/text/summary.txt │ │ │ │ │ --rw-r--r-- 0 sbuild (999) sbuild (999) 439 2026-10-22 07:53:32.000000 jtreg-test-output/jaxp/0/JTreport/text/cmdArgs.txt │ │ │ │ │ -lrwxrwxrwx 0 sbuild (999) sbuild (999) 0 2026-10-22 07:53:32.000000 jtreg-test-output/langtools/JTreport -> 0/JTreport │ │ │ │ │ -drwxr-xr-x 0 sbuild (999) sbuild (999) 0 2026-10-22 07:53:15.000000 jtreg-test-output/langtools/0/JTreport/ │ │ │ │ │ --rw-r--r-- 0 sbuild (999) sbuild (999) 720 2026-10-22 07:53:15.000000 jtreg-test-output/langtools/0/JTreport/index.html │ │ │ │ │ --rw-r--r-- 0 sbuild (999) sbuild (999) 0 2026-10-22 07:53:15.000000 jtreg-test-output/langtools/0/JTreport/reportdir.dat │ │ │ │ │ -drwxr-xr-x 0 sbuild (999) sbuild (999) 0 2026-10-22 07:53:15.000000 jtreg-test-output/langtools/0/JTreport/html/ │ │ │ │ │ --rw-r--r-- 0 sbuild (999) sbuild (999) 2463 2026-10-22 07:53:15.000000 jtreg-test-output/langtools/0/JTreport/html/notRun_gr.html │ │ │ │ │ --rw-r--r-- 0 sbuild (999) sbuild (999) 2174 2026-10-22 07:53:15.000000 jtreg-test-output/langtools/0/JTreport/html/notRun.html │ │ │ │ │ --rw-r--r-- 0 sbuild (999) sbuild (999) 521 2026-10-22 07:53:15.000000 jtreg-test-output/langtools/0/JTreport/html/error_gr.html │ │ │ │ │ --rw-r--r-- 0 sbuild (999) sbuild (999) 473 2026-10-22 07:53:15.000000 jtreg-test-output/langtools/0/JTreport/html/error.html │ │ │ │ │ --rw-r--r-- 0 sbuild (999) sbuild (999) 513 2026-10-22 07:53:15.000000 jtreg-test-output/langtools/0/JTreport/html/failed_gr.html │ │ │ │ │ --rw-r--r-- 0 sbuild (999) sbuild (999) 465 2026-10-22 07:53:15.000000 jtreg-test-output/langtools/0/JTreport/html/failed.html │ │ │ │ │ --rw-r--r-- 0 sbuild (999) sbuild (999) 885672 2026-10-22 07:53:15.000000 jtreg-test-output/langtools/0/JTreport/html/passed_gr.html │ │ │ │ │ --rw-r--r-- 0 sbuild (999) sbuild (999) 885347 2026-10-22 07:53:15.000000 jtreg-test-output/langtools/0/JTreport/html/passed.html │ │ │ │ │ --rw-r--r-- 0 sbuild (999) sbuild (999) 6195 2026-10-22 07:53:15.000000 jtreg-test-output/langtools/0/JTreport/html/excluded.html │ │ │ │ │ --rw-r--r-- 0 sbuild (999) sbuild (999) 4125 2026-10-22 07:53:15.000000 jtreg-test-output/langtools/0/JTreport/html/env.html │ │ │ │ │ --rw-r--r-- 0 sbuild (999) sbuild (999) 10783 2026-10-22 07:53:15.000000 jtreg-test-output/langtools/0/JTreport/html/config.html │ │ │ │ │ --rw-r--r-- 0 sbuild (999) sbuild (999) 307 2026-10-22 07:53:15.000000 jtreg-test-output/langtools/0/JTreport/html/report.css │ │ │ │ │ --rw-r--r-- 0 sbuild (999) sbuild (999) 541887 2026-10-22 07:53:15.000000 jtreg-test-output/langtools/0/JTreport/html/index.html │ │ │ │ │ --rw-r--r-- 0 sbuild (999) sbuild (999) 541887 2026-10-22 07:53:15.000000 jtreg-test-output/langtools/0/JTreport/html/report.html │ │ │ │ │ -drwxr-xr-x 0 sbuild (999) sbuild (999) 0 2026-10-22 07:53:15.000000 jtreg-test-output/langtools/0/JTreport/text/ │ │ │ │ │ --rw-r--r-- 0 sbuild (999) sbuild (999) 18737 2026-10-22 07:53:15.000000 jtreg-test-output/langtools/0/JTreport/text/junit.txt │ │ │ │ │ --rw-r--r-- 0 sbuild (999) sbuild (999) 9538 2026-10-22 07:53:15.000000 jtreg-test-output/langtools/0/JTreport/text/testng.txt │ │ │ │ │ --rw-r--r-- 0 sbuild (999) sbuild (999) 1921 2026-10-22 07:53:15.000000 jtreg-test-output/langtools/0/JTreport/text/notRun.txt │ │ │ │ │ --rw-r--r-- 0 sbuild (999) sbuild (999) 120 2026-10-22 07:53:15.000000 jtreg-test-output/langtools/0/JTreport/text/stats.txt │ │ │ │ │ --rw-r--r-- 0 sbuild (999) sbuild (999) 478 2026-10-22 07:53:15.000000 jtreg-test-output/langtools/0/JTreport/text/timeStats.txt │ │ │ │ │ --rw-r--r-- 0 sbuild (999) sbuild (999) 21 2026-10-22 07:53:15.000000 jtreg-test-output/langtools/0/JTreport/text/tc_newfailures.txt │ │ │ │ │ --rw-r--r-- 0 sbuild (999) sbuild (999) 21 2026-10-22 07:53:15.000000 jtreg-test-output/langtools/0/JTreport/text/tc_fail2notrun.txt │ │ │ │ │ --rw-r--r-- 0 sbuild (999) sbuild (999) 20 2026-10-22 07:53:15.000000 jtreg-test-output/langtools/0/JTreport/text/tc_fail2error.txt │ │ │ │ │ --rw-r--r-- 0 sbuild (999) sbuild (999) 19 2026-10-22 07:53:15.000000 jtreg-test-output/langtools/0/JTreport/text/tc_fail2pass.txt │ │ │ │ │ --rw-r--r-- 0 sbuild (999) sbuild (999) 22 2026-10-22 07:53:15.000000 jtreg-test-output/langtools/0/JTreport/text/tc_fail2missing.txt │ │ │ │ │ --rw-r--r-- 0 sbuild (999) sbuild (999) 19 2026-10-22 07:53:15.000000 jtreg-test-output/langtools/0/JTreport/text/other_errors.txt │ │ │ │ │ --rw-r--r-- 0 sbuild (999) sbuild (999) 18 2026-10-22 07:53:15.000000 jtreg-test-output/langtools/0/JTreport/text/newfailures.txt │ │ │ │ │ --rw-r--r-- 0 sbuild (999) sbuild (999) 16 2026-10-22 07:53:15.000000 jtreg-test-output/langtools/0/JTreport/text/fail2fail.txt │ │ │ │ │ --rw-r--r-- 0 sbuild (999) sbuild (999) 18 2026-10-22 07:53:15.000000 jtreg-test-output/langtools/0/JTreport/text/fail2notrun.txt │ │ │ │ │ --rw-r--r-- 0 sbuild (999) sbuild (999) 17 2026-10-22 07:53:15.000000 jtreg-test-output/langtools/0/JTreport/text/faiL2error.txt │ │ │ │ │ --rw-r--r-- 0 sbuild (999) sbuild (999) 16 2026-10-22 07:53:15.000000 jtreg-test-output/langtools/0/JTreport/text/fail2pass.txt │ │ │ │ │ --rw-r--r-- 0 sbuild (999) sbuild (999) 19 2026-10-22 07:53:15.000000 jtreg-test-output/langtools/0/JTreport/text/fail2missing.txt │ │ │ │ │ --rw-r--r-- 0 sbuild (999) sbuild (999) 643764 2026-10-22 07:53:15.000000 jtreg-test-output/langtools/0/JTreport/text/summary.txt │ │ │ │ │ --rw-r--r-- 0 sbuild (999) sbuild (999) 454 2026-10-22 06:53:12.000000 jtreg-test-output/langtools/0/JTreport/text/cmdArgs.txt │ │ │ │ │ -lrwxrwxrwx 0 sbuild (999) sbuild (999) 0 2026-10-22 06:53:12.000000 jtreg-test-output/hotspot/JTreport -> 0/JTreport │ │ │ │ │ -drwxr-xr-x 0 sbuild (999) sbuild (999) 0 2026-10-22 06:53:00.000000 jtreg-test-output/hotspot/0/JTreport/ │ │ │ │ │ --rw-r--r-- 0 sbuild (999) sbuild (999) 722 2026-10-22 06:53:00.000000 jtreg-test-output/hotspot/0/JTreport/index.html │ │ │ │ │ --rw-r--r-- 0 sbuild (999) sbuild (999) 0 2026-10-22 06:53:00.000000 jtreg-test-output/hotspot/0/JTreport/reportdir.dat │ │ │ │ │ -drwxr-xr-x 0 sbuild (999) sbuild (999) 0 2026-10-22 06:53:00.000000 jtreg-test-output/hotspot/0/JTreport/html/ │ │ │ │ │ --rw-r--r-- 0 sbuild (999) sbuild (999) 38204 2026-10-22 06:53:00.000000 jtreg-test-output/hotspot/0/JTreport/html/notRun_gr.html │ │ │ │ │ --rw-r--r-- 0 sbuild (999) sbuild (999) 37915 2026-10-22 06:53:00.000000 jtreg-test-output/hotspot/0/JTreport/html/notRun.html │ │ │ │ │ --rw-r--r-- 0 sbuild (999) sbuild (999) 521 2026-10-22 06:53:00.000000 jtreg-test-output/hotspot/0/JTreport/html/error_gr.html │ │ │ │ │ --rw-r--r-- 0 sbuild (999) sbuild (999) 473 2026-10-22 06:53:00.000000 jtreg-test-output/hotspot/0/JTreport/html/error.html │ │ │ │ │ --rw-r--r-- 0 sbuild (999) sbuild (999) 513 2026-10-22 06:53:00.000000 jtreg-test-output/hotspot/0/JTreport/html/failed_gr.html │ │ │ │ │ --rw-r--r-- 0 sbuild (999) sbuild (999) 465 2026-10-22 06:53:00.000000 jtreg-test-output/hotspot/0/JTreport/html/failed.html │ │ │ │ │ --rw-r--r-- 0 sbuild (999) sbuild (999) 631562 2026-10-22 06:53:00.000000 jtreg-test-output/hotspot/0/JTreport/html/passed_gr.html │ │ │ │ │ --rw-r--r-- 0 sbuild (999) sbuild (999) 631133 2026-10-22 06:53:00.000000 jtreg-test-output/hotspot/0/JTreport/html/passed.html │ │ │ │ │ --rw-r--r-- 0 sbuild (999) sbuild (999) 18324 2026-10-22 06:53:00.000000 jtreg-test-output/hotspot/0/JTreport/html/excluded.html │ │ │ │ │ --rw-r--r-- 0 sbuild (999) sbuild (999) 4222 2026-10-22 06:53:00.000000 jtreg-test-output/hotspot/0/JTreport/html/env.html │ │ │ │ │ --rw-r--r-- 0 sbuild (999) sbuild (999) 78257 2026-10-22 06:53:00.000000 jtreg-test-output/hotspot/0/JTreport/html/config.html │ │ │ │ │ --rw-r--r-- 0 sbuild (999) sbuild (999) 307 2026-10-22 06:53:00.000000 jtreg-test-output/hotspot/0/JTreport/html/report.css │ │ │ │ │ --rw-r--r-- 0 sbuild (999) sbuild (999) 526912 2026-10-22 06:53:00.000000 jtreg-test-output/hotspot/0/JTreport/html/index.html │ │ │ │ │ --rw-r--r-- 0 sbuild (999) sbuild (999) 526912 2026-10-22 06:53:00.000000 jtreg-test-output/hotspot/0/JTreport/html/report.html │ │ │ │ │ -drwxr-xr-x 0 sbuild (999) sbuild (999) 0 2026-10-22 06:53:00.000000 jtreg-test-output/hotspot/0/JTreport/text/ │ │ │ │ │ --rw-r--r-- 0 sbuild (999) sbuild (999) 9713 2026-10-22 06:53:00.000000 jtreg-test-output/hotspot/0/JTreport/text/junit.txt │ │ │ │ │ --rw-r--r-- 0 sbuild (999) sbuild (999) 9190 2026-10-22 06:53:00.000000 jtreg-test-output/hotspot/0/JTreport/text/testng.txt │ │ │ │ │ --rw-r--r-- 0 sbuild (999) sbuild (999) 50907 2026-10-22 06:53:00.000000 jtreg-test-output/hotspot/0/JTreport/text/notRun.txt │ │ │ │ │ --rw-r--r-- 0 sbuild (999) sbuild (999) 123 2026-10-22 06:53:00.000000 jtreg-test-output/hotspot/0/JTreport/text/stats.txt │ │ │ │ │ --rw-r--r-- 0 sbuild (999) sbuild (999) 887 2026-10-22 06:53:00.000000 jtreg-test-output/hotspot/0/JTreport/text/timeStats.txt │ │ │ │ │ --rw-r--r-- 0 sbuild (999) sbuild (999) 21 2026-10-22 06:53:00.000000 jtreg-test-output/hotspot/0/JTreport/text/tc_newfailures.txt │ │ │ │ │ --rw-r--r-- 0 sbuild (999) sbuild (999) 21 2026-10-22 06:53:00.000000 jtreg-test-output/hotspot/0/JTreport/text/tc_fail2notrun.txt │ │ │ │ │ --rw-r--r-- 0 sbuild (999) sbuild (999) 20 2026-10-22 06:53:00.000000 jtreg-test-output/hotspot/0/JTreport/text/tc_fail2error.txt │ │ │ │ │ --rw-r--r-- 0 sbuild (999) sbuild (999) 19 2026-10-22 06:53:00.000000 jtreg-test-output/hotspot/0/JTreport/text/tc_fail2pass.txt │ │ │ │ │ --rw-r--r-- 0 sbuild (999) sbuild (999) 22 2026-10-22 06:53:00.000000 jtreg-test-output/hotspot/0/JTreport/text/tc_fail2missing.txt │ │ │ │ │ --rw-r--r-- 0 sbuild (999) sbuild (999) 19 2026-10-22 06:53:00.000000 jtreg-test-output/hotspot/0/JTreport/text/other_errors.txt │ │ │ │ │ --rw-r--r-- 0 sbuild (999) sbuild (999) 18 2026-10-22 06:53:00.000000 jtreg-test-output/hotspot/0/JTreport/text/newfailures.txt │ │ │ │ │ --rw-r--r-- 0 sbuild (999) sbuild (999) 16 2026-10-22 06:53:00.000000 jtreg-test-output/hotspot/0/JTreport/text/fail2fail.txt │ │ │ │ │ --rw-r--r-- 0 sbuild (999) sbuild (999) 18 2026-10-22 06:53:00.000000 jtreg-test-output/hotspot/0/JTreport/text/fail2notrun.txt │ │ │ │ │ --rw-r--r-- 0 sbuild (999) sbuild (999) 17 2026-10-22 06:53:00.000000 jtreg-test-output/hotspot/0/JTreport/text/faiL2error.txt │ │ │ │ │ --rw-r--r-- 0 sbuild (999) sbuild (999) 16 2026-10-22 06:53:00.000000 jtreg-test-output/hotspot/0/JTreport/text/fail2pass.txt │ │ │ │ │ --rw-r--r-- 0 sbuild (999) sbuild (999) 19 2026-10-22 06:53:00.000000 jtreg-test-output/hotspot/0/JTreport/text/fail2missing.txt │ │ │ │ │ --rw-r--r-- 0 sbuild (999) sbuild (999) 475555 2026-10-22 06:53:00.000000 jtreg-test-output/hotspot/0/JTreport/text/summary.txt │ │ │ │ │ --rw-r--r-- 0 sbuild (999) sbuild (999) 551 2026-10-22 03:47:07.000000 jtreg-test-output/hotspot/0/JTreport/text/cmdArgs.txt │ │ │ │ │ +drwxr-xr-x 0 sbuild (999) sbuild (999) 0 2026-10-23 05:51:32.000000 jtreg-test-output/jdk/1/JTreport/ │ │ │ │ │ +-rw-r--r-- 0 sbuild (999) sbuild (999) 708 2026-10-23 05:51:32.000000 jtreg-test-output/jdk/1/JTreport/index.html │ │ │ │ │ +drwxr-xr-x 0 sbuild (999) sbuild (999) 0 2026-10-23 05:51:32.000000 jtreg-test-output/jdk/1/JTreport/html/ │ │ │ │ │ +-rw-r--r-- 0 sbuild (999) sbuild (999) 762507 2026-10-23 05:51:32.000000 jtreg-test-output/jdk/1/JTreport/html/notRun.html │ │ │ │ │ +-rw-r--r-- 0 sbuild (999) sbuild (999) 1101104 2026-10-23 05:51:32.000000 jtreg-test-output/jdk/1/JTreport/html/report.html │ │ │ │ │ +-rw-r--r-- 0 sbuild (999) sbuild (999) 83174 2026-10-23 05:51:32.000000 jtreg-test-output/jdk/1/JTreport/html/excluded.html │ │ │ │ │ +-rw-r--r-- 0 sbuild (999) sbuild (999) 473 2026-10-23 05:51:32.000000 jtreg-test-output/jdk/1/JTreport/html/error.html │ │ │ │ │ +-rw-r--r-- 0 sbuild (999) sbuild (999) 521 2026-10-23 05:51:32.000000 jtreg-test-output/jdk/1/JTreport/html/error_gr.html │ │ │ │ │ +-rw-r--r-- 0 sbuild (999) sbuild (999) 1101104 2026-10-23 05:51:32.000000 jtreg-test-output/jdk/1/JTreport/html/index.html │ │ │ │ │ +-rw-r--r-- 0 sbuild (999) sbuild (999) 1251902 2026-10-23 05:51:32.000000 jtreg-test-output/jdk/1/JTreport/html/passed_gr.html │ │ │ │ │ +-rw-r--r-- 0 sbuild (999) sbuild (999) 2750 2026-10-23 05:51:32.000000 jtreg-test-output/jdk/1/JTreport/html/failed_gr.html │ │ │ │ │ +-rw-r--r-- 0 sbuild (999) sbuild (999) 2020 2026-10-23 05:51:32.000000 jtreg-test-output/jdk/1/JTreport/html/failed.html │ │ │ │ │ +-rw-r--r-- 0 sbuild (999) sbuild (999) 4225 2026-10-23 05:51:32.000000 jtreg-test-output/jdk/1/JTreport/html/env.html │ │ │ │ │ +-rw-r--r-- 0 sbuild (999) sbuild (999) 762780 2026-10-23 05:51:32.000000 jtreg-test-output/jdk/1/JTreport/html/notRun_gr.html │ │ │ │ │ +-rw-r--r-- 0 sbuild (999) sbuild (999) 307 2026-10-23 05:51:31.000000 jtreg-test-output/jdk/1/JTreport/html/report.css │ │ │ │ │ +-rw-r--r-- 0 sbuild (999) sbuild (999) 24356 2026-10-23 05:51:32.000000 jtreg-test-output/jdk/1/JTreport/html/config.html │ │ │ │ │ +-rw-r--r-- 0 sbuild (999) sbuild (999) 1250431 2026-10-23 05:51:32.000000 jtreg-test-output/jdk/1/JTreport/html/passed.html │ │ │ │ │ +drwxr-xr-x 0 sbuild (999) sbuild (999) 0 2026-10-23 05:51:32.000000 jtreg-test-output/jdk/1/JTreport/text/ │ │ │ │ │ +-rw-r--r-- 0 sbuild (999) sbuild (999) 890420 2026-10-23 05:51:32.000000 jtreg-test-output/jdk/1/JTreport/text/summary.txt │ │ │ │ │ +-rw-r--r-- 0 sbuild (999) sbuild (999) 20 2026-10-23 05:51:32.000000 jtreg-test-output/jdk/1/JTreport/text/tc_fail2error.txt │ │ │ │ │ +-rw-r--r-- 0 sbuild (999) sbuild (999) 19 2026-10-23 05:51:32.000000 jtreg-test-output/jdk/1/JTreport/text/tc_fail2pass.txt │ │ │ │ │ +-rw-r--r-- 0 sbuild (999) sbuild (999) 116 2026-10-23 05:51:32.000000 jtreg-test-output/jdk/1/JTreport/text/timeStats.txt │ │ │ │ │ +-rw-r--r-- 0 sbuild (999) sbuild (999) 21 2026-10-23 05:51:32.000000 jtreg-test-output/jdk/1/JTreport/text/tc_fail2notrun.txt │ │ │ │ │ +-rw-r--r-- 0 sbuild (999) sbuild (999) 19 2026-10-23 05:51:32.000000 jtreg-test-output/jdk/1/JTreport/text/fail2missing.txt │ │ │ │ │ +-rw-r--r-- 0 sbuild (999) sbuild (999) 16 2026-10-23 05:51:32.000000 jtreg-test-output/jdk/1/JTreport/text/fail2fail.txt │ │ │ │ │ +-rw-r--r-- 0 sbuild (999) sbuild (999) 22 2026-10-23 05:51:32.000000 jtreg-test-output/jdk/1/JTreport/text/tc_fail2missing.txt │ │ │ │ │ +-rw-r--r-- 0 sbuild (999) sbuild (999) 16 2026-10-23 05:51:32.000000 jtreg-test-output/jdk/1/JTreport/text/fail2pass.txt │ │ │ │ │ +-rw-r--r-- 0 sbuild (999) sbuild (999) 19 2026-10-23 05:51:32.000000 jtreg-test-output/jdk/1/JTreport/text/other_errors.txt │ │ │ │ │ +-rw-r--r-- 0 sbuild (999) sbuild (999) 17 2026-10-23 05:51:32.000000 jtreg-test-output/jdk/1/JTreport/text/faiL2error.txt │ │ │ │ │ +-rw-r--r-- 0 sbuild (999) sbuild (999) 21 2026-10-23 05:51:32.000000 jtreg-test-output/jdk/1/JTreport/text/tc_newfailures.txt │ │ │ │ │ +-rw-r--r-- 0 sbuild (999) sbuild (999) 101 2026-10-23 05:51:32.000000 jtreg-test-output/jdk/1/JTreport/text/stats.txt │ │ │ │ │ +-rw-r--r-- 0 sbuild (999) sbuild (999) 548 2026-10-23 05:51:15.000000 jtreg-test-output/jdk/1/JTreport/text/cmdArgs.txt │ │ │ │ │ +-rw-r--r-- 0 sbuild (999) sbuild (999) 416 2026-10-23 05:51:32.000000 jtreg-test-output/jdk/1/JTreport/text/newfailures.txt │ │ │ │ │ +-rw-r--r-- 0 sbuild (999) sbuild (999) 132 2026-10-23 05:51:32.000000 jtreg-test-output/jdk/1/JTreport/text/testng.txt │ │ │ │ │ +-rw-r--r-- 0 sbuild (999) sbuild (999) 1023561 2026-10-23 05:51:32.000000 jtreg-test-output/jdk/1/JTreport/text/notRun.txt │ │ │ │ │ +-rw-r--r-- 0 sbuild (999) sbuild (999) 18 2026-10-23 05:51:32.000000 jtreg-test-output/jdk/1/JTreport/text/fail2notrun.txt │ │ │ │ │ +-rw-r--r-- 0 sbuild (999) sbuild (999) 0 2026-10-23 05:51:32.000000 jtreg-test-output/jdk/1/JTreport/reportdir.dat │ │ │ │ │ +drwxr-xr-x 0 sbuild (999) sbuild (999) 0 2026-10-23 05:50:41.000000 jtreg-test-output/jdk/0/JTreport/ │ │ │ │ │ +-rw-r--r-- 0 sbuild (999) sbuild (999) 708 2026-10-23 05:50:41.000000 jtreg-test-output/jdk/0/JTreport/index.html │ │ │ │ │ +drwxr-xr-x 0 sbuild (999) sbuild (999) 0 2026-10-23 05:50:41.000000 jtreg-test-output/jdk/0/JTreport/html/ │ │ │ │ │ +-rw-r--r-- 0 sbuild (999) sbuild (999) 20339 2026-10-23 05:50:41.000000 jtreg-test-output/jdk/0/JTreport/html/notRun.html │ │ │ │ │ +-rw-r--r-- 0 sbuild (999) sbuild (999) 1123762 2026-10-23 05:50:41.000000 jtreg-test-output/jdk/0/JTreport/html/report.html │ │ │ │ │ +-rw-r--r-- 0 sbuild (999) sbuild (999) 83174 2026-10-23 05:50:41.000000 jtreg-test-output/jdk/0/JTreport/html/excluded.html │ │ │ │ │ +-rw-r--r-- 0 sbuild (999) sbuild (999) 473 2026-10-23 05:50:41.000000 jtreg-test-output/jdk/0/JTreport/html/error.html │ │ │ │ │ +-rw-r--r-- 0 sbuild (999) sbuild (999) 521 2026-10-23 05:50:41.000000 jtreg-test-output/jdk/0/JTreport/html/error_gr.html │ │ │ │ │ +-rw-r--r-- 0 sbuild (999) sbuild (999) 1123762 2026-10-23 05:50:41.000000 jtreg-test-output/jdk/0/JTreport/html/index.html │ │ │ │ │ +-rw-r--r-- 0 sbuild (999) sbuild (999) 1251902 2026-10-23 05:50:41.000000 jtreg-test-output/jdk/0/JTreport/html/passed_gr.html │ │ │ │ │ +-rw-r--r-- 0 sbuild (999) sbuild (999) 2750 2026-10-23 05:50:41.000000 jtreg-test-output/jdk/0/JTreport/html/failed_gr.html │ │ │ │ │ +-rw-r--r-- 0 sbuild (999) sbuild (999) 2020 2026-10-23 05:50:41.000000 jtreg-test-output/jdk/0/JTreport/html/failed.html │ │ │ │ │ +-rw-r--r-- 0 sbuild (999) sbuild (999) 4206 2026-10-23 05:50:41.000000 jtreg-test-output/jdk/0/JTreport/html/env.html │ │ │ │ │ +-rw-r--r-- 0 sbuild (999) sbuild (999) 20684 2026-10-23 05:50:41.000000 jtreg-test-output/jdk/0/JTreport/html/notRun_gr.html │ │ │ │ │ +-rw-r--r-- 0 sbuild (999) sbuild (999) 307 2026-10-23 05:50:40.000000 jtreg-test-output/jdk/0/JTreport/html/report.css │ │ │ │ │ +-rw-r--r-- 0 sbuild (999) sbuild (999) 23924 2026-10-23 05:50:41.000000 jtreg-test-output/jdk/0/JTreport/html/config.html │ │ │ │ │ +-rw-r--r-- 0 sbuild (999) sbuild (999) 1250431 2026-10-23 05:50:41.000000 jtreg-test-output/jdk/0/JTreport/html/passed.html │ │ │ │ │ +drwxr-xr-x 0 sbuild (999) sbuild (999) 0 2026-10-23 05:50:41.000000 jtreg-test-output/jdk/0/JTreport/text/ │ │ │ │ │ +-rw-r--r-- 0 sbuild (999) sbuild (999) 890420 2026-10-23 05:50:41.000000 jtreg-test-output/jdk/0/JTreport/text/summary.txt │ │ │ │ │ +-rw-r--r-- 0 sbuild (999) sbuild (999) 20 2026-10-23 05:50:41.000000 jtreg-test-output/jdk/0/JTreport/text/tc_fail2error.txt │ │ │ │ │ +-rw-r--r-- 0 sbuild (999) sbuild (999) 19 2026-10-23 05:50:41.000000 jtreg-test-output/jdk/0/JTreport/text/tc_fail2pass.txt │ │ │ │ │ +-rw-r--r-- 0 sbuild (999) sbuild (999) 1007 2026-10-23 05:50:41.000000 jtreg-test-output/jdk/0/JTreport/text/timeStats.txt │ │ │ │ │ +-rw-r--r-- 0 sbuild (999) sbuild (999) 21 2026-10-23 05:50:41.000000 jtreg-test-output/jdk/0/JTreport/text/tc_fail2notrun.txt │ │ │ │ │ +-rw-r--r-- 0 sbuild (999) sbuild (999) 19 2026-10-23 05:50:41.000000 jtreg-test-output/jdk/0/JTreport/text/fail2missing.txt │ │ │ │ │ +-rw-r--r-- 0 sbuild (999) sbuild (999) 16 2026-10-23 05:50:41.000000 jtreg-test-output/jdk/0/JTreport/text/fail2fail.txt │ │ │ │ │ +-rw-r--r-- 0 sbuild (999) sbuild (999) 22 2026-10-23 05:50:41.000000 jtreg-test-output/jdk/0/JTreport/text/tc_fail2missing.txt │ │ │ │ │ +-rw-r--r-- 0 sbuild (999) sbuild (999) 16 2026-10-23 05:50:41.000000 jtreg-test-output/jdk/0/JTreport/text/fail2pass.txt │ │ │ │ │ +-rw-r--r-- 0 sbuild (999) sbuild (999) 19 2026-10-23 05:50:41.000000 jtreg-test-output/jdk/0/JTreport/text/other_errors.txt │ │ │ │ │ +-rw-r--r-- 0 sbuild (999) sbuild (999) 17 2026-10-23 05:50:41.000000 jtreg-test-output/jdk/0/JTreport/text/faiL2error.txt │ │ │ │ │ +-rw-r--r-- 0 sbuild (999) sbuild (999) 21 2026-10-23 05:50:41.000000 jtreg-test-output/jdk/0/JTreport/text/tc_newfailures.txt │ │ │ │ │ +-rw-r--r-- 0 sbuild (999) sbuild (999) 172 2026-10-23 05:50:41.000000 jtreg-test-output/jdk/0/JTreport/text/stats.txt │ │ │ │ │ +-rw-r--r-- 0 sbuild (999) sbuild (999) 529 2026-10-23 01:20:47.000000 jtreg-test-output/jdk/0/JTreport/text/cmdArgs.txt │ │ │ │ │ +-rw-r--r-- 0 sbuild (999) sbuild (999) 416 2026-10-23 05:50:41.000000 jtreg-test-output/jdk/0/JTreport/text/newfailures.txt │ │ │ │ │ +-rw-r--r-- 0 sbuild (999) sbuild (999) 131917 2026-10-23 05:50:41.000000 jtreg-test-output/jdk/0/JTreport/text/testng.txt │ │ │ │ │ +-rw-r--r-- 0 sbuild (999) sbuild (999) 26283 2026-10-23 05:50:41.000000 jtreg-test-output/jdk/0/JTreport/text/notRun.txt │ │ │ │ │ +-rw-r--r-- 0 sbuild (999) sbuild (999) 86012 2026-10-23 05:50:41.000000 jtreg-test-output/jdk/0/JTreport/text/junit.txt │ │ │ │ │ +-rw-r--r-- 0 sbuild (999) sbuild (999) 18 2026-10-23 05:50:41.000000 jtreg-test-output/jdk/0/JTreport/text/fail2notrun.txt │ │ │ │ │ +-rw-r--r-- 0 sbuild (999) sbuild (999) 0 2026-10-23 05:50:41.000000 jtreg-test-output/jdk/0/JTreport/reportdir.dat │ │ │ │ │ +drwxr-xr-x 0 sbuild (999) sbuild (999) 0 2026-10-23 05:52:11.000000 jtreg-test-output/jdk/2/JTreport/ │ │ │ │ │ +-rw-r--r-- 0 sbuild (999) sbuild (999) 708 2026-10-23 05:52:11.000000 jtreg-test-output/jdk/2/JTreport/index.html │ │ │ │ │ +drwxr-xr-x 0 sbuild (999) sbuild (999) 0 2026-10-23 05:52:11.000000 jtreg-test-output/jdk/2/JTreport/html/ │ │ │ │ │ +-rw-r--r-- 0 sbuild (999) sbuild (999) 762507 2026-10-23 05:52:11.000000 jtreg-test-output/jdk/2/JTreport/html/notRun.html │ │ │ │ │ +-rw-r--r-- 0 sbuild (999) sbuild (999) 1101104 2026-10-23 05:52:10.000000 jtreg-test-output/jdk/2/JTreport/html/report.html │ │ │ │ │ +-rw-r--r-- 0 sbuild (999) sbuild (999) 83174 2026-10-23 05:52:11.000000 jtreg-test-output/jdk/2/JTreport/html/excluded.html │ │ │ │ │ +-rw-r--r-- 0 sbuild (999) sbuild (999) 473 2026-10-23 05:52:11.000000 jtreg-test-output/jdk/2/JTreport/html/error.html │ │ │ │ │ +-rw-r--r-- 0 sbuild (999) sbuild (999) 521 2026-10-23 05:52:11.000000 jtreg-test-output/jdk/2/JTreport/html/error_gr.html │ │ │ │ │ +-rw-r--r-- 0 sbuild (999) sbuild (999) 1101104 2026-10-23 05:52:10.000000 jtreg-test-output/jdk/2/JTreport/html/index.html │ │ │ │ │ +-rw-r--r-- 0 sbuild (999) sbuild (999) 1251902 2026-10-23 05:52:11.000000 jtreg-test-output/jdk/2/JTreport/html/passed_gr.html │ │ │ │ │ +-rw-r--r-- 0 sbuild (999) sbuild (999) 2750 2026-10-23 05:52:11.000000 jtreg-test-output/jdk/2/JTreport/html/failed_gr.html │ │ │ │ │ +-rw-r--r-- 0 sbuild (999) sbuild (999) 2020 2026-10-23 05:52:11.000000 jtreg-test-output/jdk/2/JTreport/html/failed.html │ │ │ │ │ +-rw-r--r-- 0 sbuild (999) sbuild (999) 4225 2026-10-23 05:52:11.000000 jtreg-test-output/jdk/2/JTreport/html/env.html │ │ │ │ │ +-rw-r--r-- 0 sbuild (999) sbuild (999) 762780 2026-10-23 05:52:11.000000 jtreg-test-output/jdk/2/JTreport/html/notRun_gr.html │ │ │ │ │ +-rw-r--r-- 0 sbuild (999) sbuild (999) 307 2026-10-23 05:52:10.000000 jtreg-test-output/jdk/2/JTreport/html/report.css │ │ │ │ │ +-rw-r--r-- 0 sbuild (999) sbuild (999) 24356 2026-10-23 05:52:11.000000 jtreg-test-output/jdk/2/JTreport/html/config.html │ │ │ │ │ +-rw-r--r-- 0 sbuild (999) sbuild (999) 1250431 2026-10-23 05:52:11.000000 jtreg-test-output/jdk/2/JTreport/html/passed.html │ │ │ │ │ +drwxr-xr-x 0 sbuild (999) sbuild (999) 0 2026-10-23 05:52:11.000000 jtreg-test-output/jdk/2/JTreport/text/ │ │ │ │ │ +-rw-r--r-- 0 sbuild (999) sbuild (999) 890420 2026-10-23 05:52:11.000000 jtreg-test-output/jdk/2/JTreport/text/summary.txt │ │ │ │ │ +-rw-r--r-- 0 sbuild (999) sbuild (999) 20 2026-10-23 05:52:11.000000 jtreg-test-output/jdk/2/JTreport/text/tc_fail2error.txt │ │ │ │ │ +-rw-r--r-- 0 sbuild (999) sbuild (999) 19 2026-10-23 05:52:11.000000 jtreg-test-output/jdk/2/JTreport/text/tc_fail2pass.txt │ │ │ │ │ +-rw-r--r-- 0 sbuild (999) sbuild (999) 116 2026-10-23 05:52:11.000000 jtreg-test-output/jdk/2/JTreport/text/timeStats.txt │ │ │ │ │ +-rw-r--r-- 0 sbuild (999) sbuild (999) 21 2026-10-23 05:52:11.000000 jtreg-test-output/jdk/2/JTreport/text/tc_fail2notrun.txt │ │ │ │ │ +-rw-r--r-- 0 sbuild (999) sbuild (999) 19 2026-10-23 05:52:11.000000 jtreg-test-output/jdk/2/JTreport/text/fail2missing.txt │ │ │ │ │ +-rw-r--r-- 0 sbuild (999) sbuild (999) 16 2026-10-23 05:52:11.000000 jtreg-test-output/jdk/2/JTreport/text/fail2fail.txt │ │ │ │ │ +-rw-r--r-- 0 sbuild (999) sbuild (999) 22 2026-10-23 05:52:11.000000 jtreg-test-output/jdk/2/JTreport/text/tc_fail2missing.txt │ │ │ │ │ +-rw-r--r-- 0 sbuild (999) sbuild (999) 16 2026-10-23 05:52:11.000000 jtreg-test-output/jdk/2/JTreport/text/fail2pass.txt │ │ │ │ │ +-rw-r--r-- 0 sbuild (999) sbuild (999) 19 2026-10-23 05:52:11.000000 jtreg-test-output/jdk/2/JTreport/text/other_errors.txt │ │ │ │ │ +-rw-r--r-- 0 sbuild (999) sbuild (999) 17 2026-10-23 05:52:11.000000 jtreg-test-output/jdk/2/JTreport/text/faiL2error.txt │ │ │ │ │ +-rw-r--r-- 0 sbuild (999) sbuild (999) 21 2026-10-23 05:52:11.000000 jtreg-test-output/jdk/2/JTreport/text/tc_newfailures.txt │ │ │ │ │ +-rw-r--r-- 0 sbuild (999) sbuild (999) 101 2026-10-23 05:52:11.000000 jtreg-test-output/jdk/2/JTreport/text/stats.txt │ │ │ │ │ +-rw-r--r-- 0 sbuild (999) sbuild (999) 548 2026-10-23 05:51:57.000000 jtreg-test-output/jdk/2/JTreport/text/cmdArgs.txt │ │ │ │ │ +-rw-r--r-- 0 sbuild (999) sbuild (999) 416 2026-10-23 05:52:11.000000 jtreg-test-output/jdk/2/JTreport/text/newfailures.txt │ │ │ │ │ +-rw-r--r-- 0 sbuild (999) sbuild (999) 132 2026-10-23 05:52:11.000000 jtreg-test-output/jdk/2/JTreport/text/testng.txt │ │ │ │ │ +-rw-r--r-- 0 sbuild (999) sbuild (999) 1023561 2026-10-23 05:52:11.000000 jtreg-test-output/jdk/2/JTreport/text/notRun.txt │ │ │ │ │ +-rw-r--r-- 0 sbuild (999) sbuild (999) 18 2026-10-23 05:52:11.000000 jtreg-test-output/jdk/2/JTreport/text/fail2notrun.txt │ │ │ │ │ +-rw-r--r-- 0 sbuild (999) sbuild (999) 0 2026-10-23 05:52:11.000000 jtreg-test-output/jdk/2/JTreport/reportdir.dat │ │ │ │ │ +lrwxrwxrwx 0 sbuild (999) sbuild (999) 0 2026-10-23 05:52:36.000000 jtreg-test-output/jdk/JTreport -> 2/JTreport │ │ │ │ │ +drwxr-xr-x 0 sbuild (999) sbuild (999) 0 2026-10-23 00:53:49.000000 jtreg-test-output/langtools/0/JTreport/ │ │ │ │ │ +-rw-r--r-- 0 sbuild (999) sbuild (999) 720 2026-10-23 00:53:49.000000 jtreg-test-output/langtools/0/JTreport/index.html │ │ │ │ │ +drwxr-xr-x 0 sbuild (999) sbuild (999) 0 2026-10-23 00:53:49.000000 jtreg-test-output/langtools/0/JTreport/html/ │ │ │ │ │ +-rw-r--r-- 0 sbuild (999) sbuild (999) 2175 2026-10-23 00:53:49.000000 jtreg-test-output/langtools/0/JTreport/html/notRun.html │ │ │ │ │ +-rw-r--r-- 0 sbuild (999) sbuild (999) 541888 2026-10-23 00:53:48.000000 jtreg-test-output/langtools/0/JTreport/html/report.html │ │ │ │ │ +-rw-r--r-- 0 sbuild (999) sbuild (999) 6196 2026-10-23 00:53:48.000000 jtreg-test-output/langtools/0/JTreport/html/excluded.html │ │ │ │ │ +-rw-r--r-- 0 sbuild (999) sbuild (999) 474 2026-10-23 00:53:49.000000 jtreg-test-output/langtools/0/JTreport/html/error.html │ │ │ │ │ +-rw-r--r-- 0 sbuild (999) sbuild (999) 522 2026-10-23 00:53:49.000000 jtreg-test-output/langtools/0/JTreport/html/error_gr.html │ │ │ │ │ +-rw-r--r-- 0 sbuild (999) sbuild (999) 541888 2026-10-23 00:53:48.000000 jtreg-test-output/langtools/0/JTreport/html/index.html │ │ │ │ │ +-rw-r--r-- 0 sbuild (999) sbuild (999) 885673 2026-10-23 00:53:49.000000 jtreg-test-output/langtools/0/JTreport/html/passed_gr.html │ │ │ │ │ +-rw-r--r-- 0 sbuild (999) sbuild (999) 514 2026-10-23 00:53:49.000000 jtreg-test-output/langtools/0/JTreport/html/failed_gr.html │ │ │ │ │ +-rw-r--r-- 0 sbuild (999) sbuild (999) 466 2026-10-23 00:53:49.000000 jtreg-test-output/langtools/0/JTreport/html/failed.html │ │ │ │ │ +-rw-r--r-- 0 sbuild (999) sbuild (999) 4132 2026-10-23 00:53:48.000000 jtreg-test-output/langtools/0/JTreport/html/env.html │ │ │ │ │ +-rw-r--r-- 0 sbuild (999) sbuild (999) 2464 2026-10-23 00:53:49.000000 jtreg-test-output/langtools/0/JTreport/html/notRun_gr.html │ │ │ │ │ +-rw-r--r-- 0 sbuild (999) sbuild (999) 307 2026-10-23 00:53:48.000000 jtreg-test-output/langtools/0/JTreport/html/report.css │ │ │ │ │ +-rw-r--r-- 0 sbuild (999) sbuild (999) 10783 2026-10-23 00:53:48.000000 jtreg-test-output/langtools/0/JTreport/html/config.html │ │ │ │ │ +-rw-r--r-- 0 sbuild (999) sbuild (999) 885348 2026-10-23 00:53:49.000000 jtreg-test-output/langtools/0/JTreport/html/passed.html │ │ │ │ │ +drwxr-xr-x 0 sbuild (999) sbuild (999) 0 2026-10-23 00:53:49.000000 jtreg-test-output/langtools/0/JTreport/text/ │ │ │ │ │ +-rw-r--r-- 0 sbuild (999) sbuild (999) 643764 2026-10-23 00:53:49.000000 jtreg-test-output/langtools/0/JTreport/text/summary.txt │ │ │ │ │ +-rw-r--r-- 0 sbuild (999) sbuild (999) 20 2026-10-23 00:53:49.000000 jtreg-test-output/langtools/0/JTreport/text/tc_fail2error.txt │ │ │ │ │ +-rw-r--r-- 0 sbuild (999) sbuild (999) 19 2026-10-23 00:53:49.000000 jtreg-test-output/langtools/0/JTreport/text/tc_fail2pass.txt │ │ │ │ │ +-rw-r--r-- 0 sbuild (999) sbuild (999) 514 2026-10-23 00:53:49.000000 jtreg-test-output/langtools/0/JTreport/text/timeStats.txt │ │ │ │ │ +-rw-r--r-- 0 sbuild (999) sbuild (999) 21 2026-10-23 00:53:49.000000 jtreg-test-output/langtools/0/JTreport/text/tc_fail2notrun.txt │ │ │ │ │ +-rw-r--r-- 0 sbuild (999) sbuild (999) 19 2026-10-23 00:53:49.000000 jtreg-test-output/langtools/0/JTreport/text/fail2missing.txt │ │ │ │ │ +-rw-r--r-- 0 sbuild (999) sbuild (999) 16 2026-10-23 00:53:49.000000 jtreg-test-output/langtools/0/JTreport/text/fail2fail.txt │ │ │ │ │ +-rw-r--r-- 0 sbuild (999) sbuild (999) 22 2026-10-23 00:53:49.000000 jtreg-test-output/langtools/0/JTreport/text/tc_fail2missing.txt │ │ │ │ │ +-rw-r--r-- 0 sbuild (999) sbuild (999) 16 2026-10-23 00:53:49.000000 jtreg-test-output/langtools/0/JTreport/text/fail2pass.txt │ │ │ │ │ +-rw-r--r-- 0 sbuild (999) sbuild (999) 19 2026-10-23 00:53:49.000000 jtreg-test-output/langtools/0/JTreport/text/other_errors.txt │ │ │ │ │ +-rw-r--r-- 0 sbuild (999) sbuild (999) 17 2026-10-23 00:53:49.000000 jtreg-test-output/langtools/0/JTreport/text/faiL2error.txt │ │ │ │ │ +-rw-r--r-- 0 sbuild (999) sbuild (999) 21 2026-10-23 00:53:49.000000 jtreg-test-output/langtools/0/JTreport/text/tc_newfailures.txt │ │ │ │ │ +-rw-r--r-- 0 sbuild (999) sbuild (999) 120 2026-10-23 00:53:49.000000 jtreg-test-output/langtools/0/JTreport/text/stats.txt │ │ │ │ │ +-rw-r--r-- 0 sbuild (999) sbuild (999) 454 2026-10-23 00:02:26.000000 jtreg-test-output/langtools/0/JTreport/text/cmdArgs.txt │ │ │ │ │ +-rw-r--r-- 0 sbuild (999) sbuild (999) 18 2026-10-23 00:53:49.000000 jtreg-test-output/langtools/0/JTreport/text/newfailures.txt │ │ │ │ │ +-rw-r--r-- 0 sbuild (999) sbuild (999) 9538 2026-10-23 00:53:49.000000 jtreg-test-output/langtools/0/JTreport/text/testng.txt │ │ │ │ │ +-rw-r--r-- 0 sbuild (999) sbuild (999) 1921 2026-10-23 00:53:49.000000 jtreg-test-output/langtools/0/JTreport/text/notRun.txt │ │ │ │ │ +-rw-r--r-- 0 sbuild (999) sbuild (999) 18737 2026-10-23 00:53:49.000000 jtreg-test-output/langtools/0/JTreport/text/junit.txt │ │ │ │ │ +-rw-r--r-- 0 sbuild (999) sbuild (999) 18 2026-10-23 00:53:49.000000 jtreg-test-output/langtools/0/JTreport/text/fail2notrun.txt │ │ │ │ │ +-rw-r--r-- 0 sbuild (999) sbuild (999) 0 2026-10-23 00:53:49.000000 jtreg-test-output/langtools/0/JTreport/reportdir.dat │ │ │ │ │ +lrwxrwxrwx 0 sbuild (999) sbuild (999) 0 2026-10-23 00:54:03.000000 jtreg-test-output/langtools/JTreport -> 0/JTreport │ │ │ │ │ +drwxr-xr-x 0 sbuild (999) sbuild (999) 0 2026-10-23 01:20:42.000000 jtreg-test-output/jaxp/0/JTreport/ │ │ │ │ │ +-rw-r--r-- 0 sbuild (999) sbuild (999) 710 2026-10-23 01:20:42.000000 jtreg-test-output/jaxp/0/JTreport/index.html │ │ │ │ │ +drwxr-xr-x 0 sbuild (999) sbuild (999) 0 2026-10-23 01:20:42.000000 jtreg-test-output/jaxp/0/JTreport/html/ │ │ │ │ │ +-rw-r--r-- 0 sbuild (999) sbuild (999) 573 2026-10-23 01:20:42.000000 jtreg-test-output/jaxp/0/JTreport/html/notRun.html │ │ │ │ │ +-rw-r--r-- 0 sbuild (999) sbuild (999) 58492 2026-10-23 01:20:42.000000 jtreg-test-output/jaxp/0/JTreport/html/report.html │ │ │ │ │ +-rw-r--r-- 0 sbuild (999) sbuild (999) 3642 2026-10-23 01:20:42.000000 jtreg-test-output/jaxp/0/JTreport/html/excluded.html │ │ │ │ │ +-rw-r--r-- 0 sbuild (999) sbuild (999) 473 2026-10-23 01:20:42.000000 jtreg-test-output/jaxp/0/JTreport/html/error.html │ │ │ │ │ +-rw-r--r-- 0 sbuild (999) sbuild (999) 521 2026-10-23 01:20:42.000000 jtreg-test-output/jaxp/0/JTreport/html/error_gr.html │ │ │ │ │ +-rw-r--r-- 0 sbuild (999) sbuild (999) 58492 2026-10-23 01:20:42.000000 jtreg-test-output/jaxp/0/JTreport/html/index.html │ │ │ │ │ +-rw-r--r-- 0 sbuild (999) sbuild (999) 110062 2026-10-23 01:20:42.000000 jtreg-test-output/jaxp/0/JTreport/html/passed_gr.html │ │ │ │ │ +-rw-r--r-- 0 sbuild (999) sbuild (999) 513 2026-10-23 01:20:42.000000 jtreg-test-output/jaxp/0/JTreport/html/failed_gr.html │ │ │ │ │ +-rw-r--r-- 0 sbuild (999) sbuild (999) 465 2026-10-23 01:20:42.000000 jtreg-test-output/jaxp/0/JTreport/html/failed.html │ │ │ │ │ +-rw-r--r-- 0 sbuild (999) sbuild (999) 4116 2026-10-23 01:20:42.000000 jtreg-test-output/jaxp/0/JTreport/html/env.html │ │ │ │ │ +-rw-r--r-- 0 sbuild (999) sbuild (999) 695 2026-10-23 01:20:42.000000 jtreg-test-output/jaxp/0/JTreport/html/notRun_gr.html │ │ │ │ │ +-rw-r--r-- 0 sbuild (999) sbuild (999) 307 2026-10-23 01:20:42.000000 jtreg-test-output/jaxp/0/JTreport/html/report.css │ │ │ │ │ +-rw-r--r-- 0 sbuild (999) sbuild (999) 4423 2026-10-23 01:20:42.000000 jtreg-test-output/jaxp/0/JTreport/html/config.html │ │ │ │ │ +-rw-r--r-- 0 sbuild (999) sbuild (999) 109973 2026-10-23 01:20:42.000000 jtreg-test-output/jaxp/0/JTreport/html/passed.html │ │ │ │ │ +drwxr-xr-x 0 sbuild (999) sbuild (999) 0 2026-10-23 01:20:42.000000 jtreg-test-output/jaxp/0/JTreport/text/ │ │ │ │ │ +-rw-r--r-- 0 sbuild (999) sbuild (999) 59118 2026-10-23 01:20:42.000000 jtreg-test-output/jaxp/0/JTreport/text/summary.txt │ │ │ │ │ +-rw-r--r-- 0 sbuild (999) sbuild (999) 20 2026-10-23 01:20:42.000000 jtreg-test-output/jaxp/0/JTreport/text/tc_fail2error.txt │ │ │ │ │ +-rw-r--r-- 0 sbuild (999) sbuild (999) 19 2026-10-23 01:20:42.000000 jtreg-test-output/jaxp/0/JTreport/text/tc_fail2pass.txt │ │ │ │ │ +-rw-r--r-- 0 sbuild (999) sbuild (999) 190 2026-10-23 01:20:42.000000 jtreg-test-output/jaxp/0/JTreport/text/timeStats.txt │ │ │ │ │ +-rw-r--r-- 0 sbuild (999) sbuild (999) 21 2026-10-23 01:20:42.000000 jtreg-test-output/jaxp/0/JTreport/text/tc_fail2notrun.txt │ │ │ │ │ +-rw-r--r-- 0 sbuild (999) sbuild (999) 19 2026-10-23 01:20:42.000000 jtreg-test-output/jaxp/0/JTreport/text/fail2missing.txt │ │ │ │ │ +-rw-r--r-- 0 sbuild (999) sbuild (999) 16 2026-10-23 01:20:42.000000 jtreg-test-output/jaxp/0/JTreport/text/fail2fail.txt │ │ │ │ │ +-rw-r--r-- 0 sbuild (999) sbuild (999) 22 2026-10-23 01:20:42.000000 jtreg-test-output/jaxp/0/JTreport/text/tc_fail2missing.txt │ │ │ │ │ +-rw-r--r-- 0 sbuild (999) sbuild (999) 16 2026-10-23 01:20:42.000000 jtreg-test-output/jaxp/0/JTreport/text/fail2pass.txt │ │ │ │ │ +-rw-r--r-- 0 sbuild (999) sbuild (999) 19 2026-10-23 01:20:42.000000 jtreg-test-output/jaxp/0/JTreport/text/other_errors.txt │ │ │ │ │ +-rw-r--r-- 0 sbuild (999) sbuild (999) 17 2026-10-23 01:20:42.000000 jtreg-test-output/jaxp/0/JTreport/text/faiL2error.txt │ │ │ │ │ +-rw-r--r-- 0 sbuild (999) sbuild (999) 21 2026-10-23 01:20:42.000000 jtreg-test-output/jaxp/0/JTreport/text/tc_newfailures.txt │ │ │ │ │ +-rw-r--r-- 0 sbuild (999) sbuild (999) 65 2026-10-23 01:20:42.000000 jtreg-test-output/jaxp/0/JTreport/text/stats.txt │ │ │ │ │ +-rw-r--r-- 0 sbuild (999) sbuild (999) 439 2026-10-23 00:54:04.000000 jtreg-test-output/jaxp/0/JTreport/text/cmdArgs.txt │ │ │ │ │ +-rw-r--r-- 0 sbuild (999) sbuild (999) 18 2026-10-23 01:20:42.000000 jtreg-test-output/jaxp/0/JTreport/text/newfailures.txt │ │ │ │ │ +-rw-r--r-- 0 sbuild (999) sbuild (999) 69461 2026-10-23 01:20:42.000000 jtreg-test-output/jaxp/0/JTreport/text/testng.txt │ │ │ │ │ +-rw-r--r-- 0 sbuild (999) sbuild (999) 116 2026-10-23 01:20:42.000000 jtreg-test-output/jaxp/0/JTreport/text/notRun.txt │ │ │ │ │ +-rw-r--r-- 0 sbuild (999) sbuild (999) 200 2026-10-23 01:20:42.000000 jtreg-test-output/jaxp/0/JTreport/text/junit.txt │ │ │ │ │ +-rw-r--r-- 0 sbuild (999) sbuild (999) 18 2026-10-23 01:20:42.000000 jtreg-test-output/jaxp/0/JTreport/text/fail2notrun.txt │ │ │ │ │ +-rw-r--r-- 0 sbuild (999) sbuild (999) 0 2026-10-23 01:20:42.000000 jtreg-test-output/jaxp/0/JTreport/reportdir.dat │ │ │ │ │ +lrwxrwxrwx 0 sbuild (999) sbuild (999) 0 2026-10-23 01:20:44.000000 jtreg-test-output/jaxp/JTreport -> 0/JTreport │ │ │ │ │ +drwxr-xr-x 0 sbuild (999) sbuild (999) 0 2026-10-23 00:02:09.000000 jtreg-test-output/hotspot/0/JTreport/ │ │ │ │ │ +-rw-r--r-- 0 sbuild (999) sbuild (999) 722 2026-10-23 00:02:09.000000 jtreg-test-output/hotspot/0/JTreport/index.html │ │ │ │ │ +drwxr-xr-x 0 sbuild (999) sbuild (999) 0 2026-10-23 00:02:09.000000 jtreg-test-output/hotspot/0/JTreport/html/ │ │ │ │ │ +-rw-r--r-- 0 sbuild (999) sbuild (999) 37916 2026-10-23 00:02:09.000000 jtreg-test-output/hotspot/0/JTreport/html/notRun.html │ │ │ │ │ +-rw-r--r-- 0 sbuild (999) sbuild (999) 526913 2026-10-23 00:02:09.000000 jtreg-test-output/hotspot/0/JTreport/html/report.html │ │ │ │ │ +-rw-r--r-- 0 sbuild (999) sbuild (999) 18325 2026-10-23 00:02:09.000000 jtreg-test-output/hotspot/0/JTreport/html/excluded.html │ │ │ │ │ +-rw-r--r-- 0 sbuild (999) sbuild (999) 474 2026-10-23 00:02:09.000000 jtreg-test-output/hotspot/0/JTreport/html/error.html │ │ │ │ │ +-rw-r--r-- 0 sbuild (999) sbuild (999) 522 2026-10-23 00:02:09.000000 jtreg-test-output/hotspot/0/JTreport/html/error_gr.html │ │ │ │ │ +-rw-r--r-- 0 sbuild (999) sbuild (999) 526913 2026-10-23 00:02:09.000000 jtreg-test-output/hotspot/0/JTreport/html/index.html │ │ │ │ │ +-rw-r--r-- 0 sbuild (999) sbuild (999) 631563 2026-10-23 00:02:09.000000 jtreg-test-output/hotspot/0/JTreport/html/passed_gr.html │ │ │ │ │ +-rw-r--r-- 0 sbuild (999) sbuild (999) 514 2026-10-23 00:02:09.000000 jtreg-test-output/hotspot/0/JTreport/html/failed_gr.html │ │ │ │ │ +-rw-r--r-- 0 sbuild (999) sbuild (999) 466 2026-10-23 00:02:09.000000 jtreg-test-output/hotspot/0/JTreport/html/failed.html │ │ │ │ │ +-rw-r--r-- 0 sbuild (999) sbuild (999) 4229 2026-10-23 00:02:09.000000 jtreg-test-output/hotspot/0/JTreport/html/env.html │ │ │ │ │ +-rw-r--r-- 0 sbuild (999) sbuild (999) 38205 2026-10-23 00:02:09.000000 jtreg-test-output/hotspot/0/JTreport/html/notRun_gr.html │ │ │ │ │ +-rw-r--r-- 0 sbuild (999) sbuild (999) 307 2026-10-23 00:02:09.000000 jtreg-test-output/hotspot/0/JTreport/html/report.css │ │ │ │ │ +-rw-r--r-- 0 sbuild (999) sbuild (999) 78257 2026-10-23 00:02:09.000000 jtreg-test-output/hotspot/0/JTreport/html/config.html │ │ │ │ │ +-rw-r--r-- 0 sbuild (999) sbuild (999) 631134 2026-10-23 00:02:09.000000 jtreg-test-output/hotspot/0/JTreport/html/passed.html │ │ │ │ │ +drwxr-xr-x 0 sbuild (999) sbuild (999) 0 2026-10-23 00:02:09.000000 jtreg-test-output/hotspot/0/JTreport/text/ │ │ │ │ │ +-rw-r--r-- 0 sbuild (999) sbuild (999) 475555 2026-10-23 00:02:09.000000 jtreg-test-output/hotspot/0/JTreport/text/summary.txt │ │ │ │ │ +-rw-r--r-- 0 sbuild (999) sbuild (999) 20 2026-10-23 00:02:09.000000 jtreg-test-output/hotspot/0/JTreport/text/tc_fail2error.txt │ │ │ │ │ +-rw-r--r-- 0 sbuild (999) sbuild (999) 19 2026-10-23 00:02:09.000000 jtreg-test-output/hotspot/0/JTreport/text/tc_fail2pass.txt │ │ │ │ │ +-rw-r--r-- 0 sbuild (999) sbuild (999) 899 2026-10-23 00:02:09.000000 jtreg-test-output/hotspot/0/JTreport/text/timeStats.txt │ │ │ │ │ +-rw-r--r-- 0 sbuild (999) sbuild (999) 21 2026-10-23 00:02:09.000000 jtreg-test-output/hotspot/0/JTreport/text/tc_fail2notrun.txt │ │ │ │ │ +-rw-r--r-- 0 sbuild (999) sbuild (999) 19 2026-10-23 00:02:09.000000 jtreg-test-output/hotspot/0/JTreport/text/fail2missing.txt │ │ │ │ │ +-rw-r--r-- 0 sbuild (999) sbuild (999) 16 2026-10-23 00:02:09.000000 jtreg-test-output/hotspot/0/JTreport/text/fail2fail.txt │ │ │ │ │ +-rw-r--r-- 0 sbuild (999) sbuild (999) 22 2026-10-23 00:02:09.000000 jtreg-test-output/hotspot/0/JTreport/text/tc_fail2missing.txt │ │ │ │ │ +-rw-r--r-- 0 sbuild (999) sbuild (999) 16 2026-10-23 00:02:09.000000 jtreg-test-output/hotspot/0/JTreport/text/fail2pass.txt │ │ │ │ │ +-rw-r--r-- 0 sbuild (999) sbuild (999) 19 2026-10-23 00:02:09.000000 jtreg-test-output/hotspot/0/JTreport/text/other_errors.txt │ │ │ │ │ +-rw-r--r-- 0 sbuild (999) sbuild (999) 17 2026-10-23 00:02:09.000000 jtreg-test-output/hotspot/0/JTreport/text/faiL2error.txt │ │ │ │ │ +-rw-r--r-- 0 sbuild (999) sbuild (999) 21 2026-10-23 00:02:09.000000 jtreg-test-output/hotspot/0/JTreport/text/tc_newfailures.txt │ │ │ │ │ +-rw-r--r-- 0 sbuild (999) sbuild (999) 123 2026-10-23 00:02:09.000000 jtreg-test-output/hotspot/0/JTreport/text/stats.txt │ │ │ │ │ +-rw-r--r-- 0 sbuild (999) sbuild (999) 551 2026-10-22 20:40:20.000000 jtreg-test-output/hotspot/0/JTreport/text/cmdArgs.txt │ │ │ │ │ +-rw-r--r-- 0 sbuild (999) sbuild (999) 18 2026-10-23 00:02:09.000000 jtreg-test-output/hotspot/0/JTreport/text/newfailures.txt │ │ │ │ │ +-rw-r--r-- 0 sbuild (999) sbuild (999) 9190 2026-10-23 00:02:09.000000 jtreg-test-output/hotspot/0/JTreport/text/testng.txt │ │ │ │ │ +-rw-r--r-- 0 sbuild (999) sbuild (999) 50907 2026-10-23 00:02:09.000000 jtreg-test-output/hotspot/0/JTreport/text/notRun.txt │ │ │ │ │ +-rw-r--r-- 0 sbuild (999) sbuild (999) 9713 2026-10-23 00:02:09.000000 jtreg-test-output/hotspot/0/JTreport/text/junit.txt │ │ │ │ │ +-rw-r--r-- 0 sbuild (999) sbuild (999) 18 2026-10-23 00:02:09.000000 jtreg-test-output/hotspot/0/JTreport/text/fail2notrun.txt │ │ │ │ │ +-rw-r--r-- 0 sbuild (999) sbuild (999) 0 2026-10-23 00:02:09.000000 jtreg-test-output/hotspot/0/JTreport/reportdir.dat │ │ │ │ │ +lrwxrwxrwx 0 sbuild (999) sbuild (999) 0 2026-10-23 00:02:25.000000 jtreg-test-output/hotspot/JTreport -> 0/JTreport │ │ │ │ ├── jtreg-test-output/jdk/2/JTreport/index.html │ │ │ │ │ @@ -3,15 +3,15 @@ │ │ │ │ │ │ │ │ │ │ │ │ │ │ │ │ │ │ │ │ │ │ │ │ │ Report Index │ │ │ │ │ │ │ │ │ │

/build/reproducible-path/openjdk-21-21.0.13+9/test/jdk

│ │ │ │ │ -Date of report : 22 October 2026 12:30:22 │ │ │ │ │ +Date of report : 23 October 2026 05:52:11 │ │ │ │ │ │ │ │ │ │

│ │ │ │ │ HTML Report │ │ │ │ │
Standard JT Harness HTML report. Can show a summary of the results, configuration information, and environment values.

│ │ │ │ │

│ │ │ │ │ Plain Text Report │ │ │ │ │
Standard JT Harness text report showing only test names and their result status string. Suitable for parsing by external program.

│ │ │ │ │ ├── html2text {} │ │ │ │ │ │ @@ -1,8 +1,8 @@ │ │ │ │ │ │ ************ //bbuuiilldd//rreepprroodduucciibbllee--ppaatthh//ooppeennjjddkk--2211--2211..00..1133++99//tteesstt//jjddkk ************ │ │ │ │ │ │ -Date of report : 22 October 2026 12:30:22 │ │ │ │ │ │ +Date of report : 23 October 2026 05:52:11 │ │ │ │ │ │ _H_T_M_L_ _R_e_p_o_r_t │ │ │ │ │ │ Standard JT Harness HTML report. Can show a summary of the results, │ │ │ │ │ │ configuration information, and environment values. │ │ │ │ │ │ _P_l_a_i_n_ _T_e_x_t_ _R_e_p_o_r_t │ │ │ │ │ │ Standard JT Harness text report showing only test names and their result status │ │ │ │ │ │ string. Suitable for parsing by external program. │ │ │ │ ├── jtreg-test-output/jdk/2/JTreport/html/notRun_gr.html │ │ │ │ │ @@ -47657,18 +47657,18 @@ │ │ │ │ │ 000ba280: 2063 6f72 7265 6374 6c79 0a0a 3c6c 693e correctly..
  • │ │ │ │ │ 000ba290: 7375 6e2f 7365 6375 7269 7479 2f73 6d61 sun/security/sma │ │ │ │ │ 000ba2a0: 7274 6361 7264 696f 2f54 6573 7454 7261 rtcardio/TestTra │ │ │ │ │ 000ba2b0: 6e73 6d69 742e 6a61 7661 3a20 7465 7374 nsmit.java: test │ │ │ │ │ 000ba2c0: 2074 7261 6e73 6d69 7428 2920 776f 726b transmit() work │ │ │ │ │ 000ba2d0: 730a 3c2f 756c 3e0a 3c68 723e 0a3c 736d s..
    .Report gener │ │ │ │ │ -000ba2f0: 6174 6564 206f 6e20 4f63 7420 3232 2c20 ated on Oct 22, │ │ │ │ │ -000ba300: 3230 3236 2031 323a 3330 3a32 32e2 80af 2026 12:30:22... │ │ │ │ │ -000ba310: 504d 0a3c 6272 3e55 7369 6e67 204a 5420 PM.
    Using JT │ │ │ │ │ -000ba320: 4861 726e 6573 7320 362e 3020 6232 363b Harness 6.0 b26; │ │ │ │ │ -000ba330: 2062 7569 6c74 206f 6e20 4d61 7263 6820 built on March │ │ │ │ │ -000ba340: 3138 2c20 3230 3236 2c20 3132 3a30 303a 18, 2026, 12:00: │ │ │ │ │ -000ba350: 3030 e280 af41 4d20 5554 4320 7769 7468 00...AM UTC with │ │ │ │ │ -000ba360: 206f 7065 6e6a 646b 2076 6572 7369 6f6e openjdk version │ │ │ │ │ -000ba370: 2022 3235 2e30 2e33 2d65 6122 2032 3032 "25.0.3-ea" 202 │ │ │ │ │ -000ba380: 362d 3034 2d32 313c 2f73 6d61 6c6c 3e3c 6-04-21< │ │ │ │ │ -000ba390: 2f62 6f64 793e 3c2f 6874 6d6c 3e /body> │ │ │ │ │ +000ba2f0: 6174 6564 206f 6e20 4f63 7420 3233 2c20 ated on Oct 23, │ │ │ │ │ +000ba300: 3230 3236 2035 3a35 323a 3131 e280 af41 2026 5:52:11...A │ │ │ │ │ +000ba310: 4d0a 3c62 723e 5573 696e 6720 4a54 2048 M.
    Using JT H │ │ │ │ │ +000ba320: 6172 6e65 7373 2036 2e30 2062 3236 3b20 arness 6.0 b26; │ │ │ │ │ +000ba330: 6275 696c 7420 6f6e 204d 6172 6368 2031 built on March 1 │ │ │ │ │ +000ba340: 382c 2032 3032 362c 2031 323a 3030 3a30 8, 2026, 12:00:0 │ │ │ │ │ +000ba350: 30e2 80af 414d 2055 5443 2077 6974 6820 0...AM UTC with │ │ │ │ │ +000ba360: 6f70 656e 6a64 6b20 7665 7273 696f 6e20 openjdk version │ │ │ │ │ +000ba370: 2232 352e 302e 332d 6561 2220 3230 3236 "25.0.3-ea" 2026 │ │ │ │ │ +000ba380: 2d30 342d 3231 3c2f 736d 616c 6c3e 3c2f -04-21 │ │ │ │ │ ├── html2text {} │ │ │ │ │ │ @@ -13395,10 +13395,10 @@ │ │ │ │ │ │ ()/endExclusive() works │ │ │ │ │ │ * sun/security/smartcardio/TestMultiplePresent.java: test that │ │ │ │ │ │ CardTerminals.waitForCard() works │ │ │ │ │ │ * sun/security/smartcardio/TestPresent.java: test that the isCardPresent()/ │ │ │ │ │ │ waitForX() APIs work correctly │ │ │ │ │ │ * sun/security/smartcardio/TestTransmit.java: test transmit() works │ │ │ │ │ │ =============================================================================== │ │ │ │ │ │ -Report generated on Oct 22, 2026 12:30:22 PM │ │ │ │ │ │ +Report generated on Oct 23, 2026 5:52:11 AM │ │ │ │ │ │ Using JT Harness 6.0 b26; built on March 18, 2026, 12:00:00 AM UTC with openjdk │ │ │ │ │ │ version "25.0.3-ea" 2026-04-21 │ │ │ │ ├── jtreg-test-output/jdk/2/JTreport/html/notRun.html │ │ │ │ │ @@ -47640,18 +47640,18 @@ │ │ │ │ │ 000ba170: 6f64 756c 6573 2f76 616c 6964 6174 652f odules/validate/ │ │ │ │ │ 000ba180: 5661 6c69 6461 7465 4d6f 6475 6c65 7354 ValidateModulesT │ │ │ │ │ 000ba190: 6573 742e 6a61 7661 3a20 4261 7369 6320 est.java: Basic │ │ │ │ │ 000ba1a0: 7465 7374 2066 6f72 206a 6176 6120 2d2d test for java -- │ │ │ │ │ 000ba1b0: 7661 6c69 6461 7465 2d6d 6f64 756c 6573 validate-modules │ │ │ │ │ 000ba1c0: 0a3c 6272 0a3e 0a3c 6872 3e0a 3c73 6d61 ..
    .Report genera │ │ │ │ │ -000ba1e0: 7465 6420 6f6e 204f 6374 2032 322c 2032 ted on Oct 22, 2 │ │ │ │ │ -000ba1f0: 3032 3620 3132 3a33 303a 3232 e280 af50 026 12:30:22...P │ │ │ │ │ -000ba200: 4d0a 3c62 723e 5573 696e 6720 4a54 2048 M.
    Using JT H │ │ │ │ │ -000ba210: 6172 6e65 7373 2036 2e30 2062 3236 3b20 arness 6.0 b26; │ │ │ │ │ -000ba220: 6275 696c 7420 6f6e 204d 6172 6368 2031 built on March 1 │ │ │ │ │ -000ba230: 382c 2032 3032 362c 2031 323a 3030 3a30 8, 2026, 12:00:0 │ │ │ │ │ -000ba240: 30e2 80af 414d 2055 5443 2077 6974 6820 0...AM UTC with │ │ │ │ │ -000ba250: 6f70 656e 6a64 6b20 7665 7273 696f 6e20 openjdk version │ │ │ │ │ -000ba260: 2232 352e 302e 332d 6561 2220 3230 3236 "25.0.3-ea" 2026 │ │ │ │ │ -000ba270: 2d30 342d 3231 3c2f 736d 616c 6c3e 3c2f -04-21 │ │ │ │ │ +000ba1e0: 7465 6420 6f6e 204f 6374 2032 332c 2032 ted on Oct 23, 2 │ │ │ │ │ +000ba1f0: 3032 3620 353a 3532 3a31 31e2 80af 414d 026 5:52:11...AM │ │ │ │ │ +000ba200: 0a3c 6272 3e55 7369 6e67 204a 5420 4861 .
    Using JT Ha │ │ │ │ │ +000ba210: 726e 6573 7320 362e 3020 6232 363b 2062 rness 6.0 b26; b │ │ │ │ │ +000ba220: 7569 6c74 206f 6e20 4d61 7263 6820 3138 uilt on March 18 │ │ │ │ │ +000ba230: 2c20 3230 3236 2c20 3132 3a30 303a 3030 , 2026, 12:00:00 │ │ │ │ │ +000ba240: e280 af41 4d20 5554 4320 7769 7468 206f ...AM UTC with o │ │ │ │ │ +000ba250: 7065 6e6a 646b 2076 6572 7369 6f6e 2022 penjdk version " │ │ │ │ │ +000ba260: 3235 2e30 2e33 2d65 6122 2032 3032 362d 25.0.3-ea" 2026- │ │ │ │ │ +000ba270: 3034 2d32 313c 2f73 6d61 6c6c 3e3c 2f62 04-21 │ │ │ │ │ ├── html2text {} │ │ │ │ │ │ @@ -12775,10 +12775,10 @@ │ │ │ │ │ │ tools/launcher/modules/patch/systemmodules/PatchSystemModules.java: Patch │ │ │ │ │ │ java.base and user module with ModuleHashes attribute │ │ │ │ │ │ tools/launcher/modules/showmoduleresolution/ShowModuleResolutionTest.java: │ │ │ │ │ │ Basic test for java --show-module-resolution │ │ │ │ │ │ tools/launcher/modules/validate/ValidateModulesTest.java: Basic test for java - │ │ │ │ │ │ -validate-modules │ │ │ │ │ │ =============================================================================== │ │ │ │ │ │ -Report generated on Oct 22, 2026 12:30:22 PM │ │ │ │ │ │ +Report generated on Oct 23, 2026 5:52:11 AM │ │ │ │ │ │ Using JT Harness 6.0 b26; built on March 18, 2026, 12:00:00 AM UTC with openjdk │ │ │ │ │ │ version "25.0.3-ea" 2026-04-21 │ │ │ │ ├── jtreg-test-output/jdk/2/JTreport/html/error_gr.html │ │ │ │ │ @@ -6,9 +6,9 @@ │ │ │ │ │ │ │ │ │ │ JT Harness : Tests that had errors │ │ │ │ │ │ │ │ │ │ │ │ │ │ │ │ │ │ │ │

    JT Harness : Tests that had errors

    Tests are grouped by their final status message. │ │ │ │ │
    │ │ │ │ │ -Report generated on Oct 22, 2026 12:30:22 PM │ │ │ │ │ +Report generated on Oct 23, 2026 5:52:11 AM │ │ │ │ │
    Using JT Harness 6.0 b26; built on March 18, 2026, 12:00:00 AM UTC with openjdk version "25.0.3-ea" 2026-04-21
    │ │ │ │ │ ├── html2text {} │ │ │ │ │ │ @@ -1,6 +1,6 @@ │ │ │ │ │ │ ************ JJTT HHaarrnneessss :: TTeessttss tthhaatt hhaadd eerrrroorrss ************ │ │ │ │ │ │ Tests are grouped by their final status message. │ │ │ │ │ │ =============================================================================== │ │ │ │ │ │ -Report generated on Oct 22, 2026 12:30:22 PM │ │ │ │ │ │ +Report generated on Oct 23, 2026 5:52:11 AM │ │ │ │ │ │ Using JT Harness 6.0 b26; built on March 18, 2026, 12:00:00 AM UTC with openjdk │ │ │ │ │ │ version "25.0.3-ea" 2026-04-21 │ │ │ │ ├── jtreg-test-output/jdk/2/JTreport/html/error.html │ │ │ │ │ @@ -6,9 +6,9 @@ │ │ │ │ │ │ │ │ │ │ JT Harness : Tests that had errors │ │ │ │ │ │ │ │ │ │ │ │ │ │ │ │ │ │ │ │

    JT Harness : Tests that had errors

    │ │ │ │ │
    │ │ │ │ │ -Report generated on Oct 22, 2026 12:30:22 PM │ │ │ │ │ +Report generated on Oct 23, 2026 5:52:11 AM │ │ │ │ │
    Using JT Harness 6.0 b26; built on March 18, 2026, 12:00:00 AM UTC with openjdk version "25.0.3-ea" 2026-04-21
    │ │ │ │ │ ├── html2text {} │ │ │ │ │ │ @@ -1,5 +1,5 @@ │ │ │ │ │ │ ************ JJTT HHaarrnneessss :: TTeessttss tthhaatt hhaadd eerrrroorrss ************ │ │ │ │ │ │ =============================================================================== │ │ │ │ │ │ -Report generated on Oct 22, 2026 12:30:22 PM │ │ │ │ │ │ +Report generated on Oct 23, 2026 5:52:11 AM │ │ │ │ │ │ Using JT Harness 6.0 b26; built on March 18, 2026, 12:00:00 AM UTC with openjdk │ │ │ │ │ │ version "25.0.3-ea" 2026-04-21 │ │ │ │ ├── jtreg-test-output/jdk/2/JTreport/html/failed_gr.html │ │ │ │ │ @@ -56,9 +56,9 @@ │ │ │ │ │
  • │ │ │ │ │ java/net/MulticastSocket/SetLoopbackMode.java: Test MulticastSocket.setLoopbackMode │ │ │ │ │ │ │ │ │ │
  • │ │ │ │ │ java/net/MulticastSocket/SetLoopbackModeIPv4.java: Test MulticastSocket.setLoopbackMode with IPv4 addresses │ │ │ │ │ │ │ │ │ │
    │ │ │ │ │ -Report generated on Oct 22, 2026 12:30:22 PM │ │ │ │ │ +Report generated on Oct 23, 2026 5:52:11 AM │ │ │ │ │
    Using JT Harness 6.0 b26; built on March 18, 2026, 12:00:00 AM UTC with openjdk version "25.0.3-ea" 2026-04-21
    │ │ │ │ │ ├── html2text {} │ │ │ │ │ │ @@ -25,10 +25,10 @@ │ │ │ │ │ │ * _j_a_v_a_/_n_e_t_/_M_u_l_t_i_c_a_s_t_S_o_c_k_e_t_/_N_o_L_o_o_p_b_a_c_k_P_a_c_k_e_t_s_._j_a_v_a: Re-test IPv6 (and │ │ │ │ │ │ specifically MulticastSocket) with latest Linux & USAGI code │ │ │ │ │ │ * _j_a_v_a_/_n_e_t_/_M_u_l_t_i_c_a_s_t_S_o_c_k_e_t_/_S_e_t_L_o_o_p_b_a_c_k_M_o_d_e_._j_a_v_a: Test │ │ │ │ │ │ MulticastSocket.setLoopbackMode │ │ │ │ │ │ * _j_a_v_a_/_n_e_t_/_M_u_l_t_i_c_a_s_t_S_o_c_k_e_t_/_S_e_t_L_o_o_p_b_a_c_k_M_o_d_e_I_P_v_4_._j_a_v_a: Test │ │ │ │ │ │ MulticastSocket.setLoopbackMode with IPv4 addresses │ │ │ │ │ │ =============================================================================== │ │ │ │ │ │ -Report generated on Oct 22, 2026 12:30:22 PM │ │ │ │ │ │ +Report generated on Oct 23, 2026 5:52:11 AM │ │ │ │ │ │ Using JT Harness 6.0 b26; built on March 18, 2026, 12:00:00 AM UTC with openjdk │ │ │ │ │ │ version "25.0.3-ea" 2026-04-21 │ │ │ │ ├── jtreg-test-output/jdk/2/JTreport/html/failed.html │ │ │ │ │ @@ -33,9 +33,9 @@ │ │ │ │ │ java/net/SocketPermission/SocketPermissionTest.java: SocketPermission tests for legacy socket types. │ │ │ │ │
    │ │ │ │ │ sun/security/krb5/auto/Addresses.java: fix krb5 caddr │ │ │ │ │
    │ │ │ │ │
    │ │ │ │ │ -Report generated on Oct 22, 2026 12:30:22 PM │ │ │ │ │ +Report generated on Oct 23, 2026 5:52:11 AM │ │ │ │ │
    Using JT Harness 6.0 b26; built on March 18, 2026, 12:00:00 AM UTC with openjdk version "25.0.3-ea" 2026-04-21
    │ │ │ │ │ ├── html2text {} │ │ │ │ │ │ @@ -11,10 +11,10 @@ │ │ │ │ │ │ MulticastSocket.setLoopbackMode with IPv4 addresses │ │ │ │ │ │ _j_a_v_a_/_n_e_t_/_M_u_l_t_i_c_a_s_t_S_o_c_k_e_t_/_T_e_s_t_._j_a_v_a: IPv4 and IPv6 multicasting broken on Linux │ │ │ │ │ │ _j_a_v_a_/_n_e_t_/_S_o_c_k_e_t_O_p_t_i_o_n_/_O_p_t_i_o_n_s_T_e_s_t_._j_a_v_a: │ │ │ │ │ │ _j_a_v_a_/_n_e_t_/_S_o_c_k_e_t_P_e_r_m_i_s_s_i_o_n_/_S_o_c_k_e_t_P_e_r_m_i_s_s_i_o_n_T_e_s_t_._j_a_v_a: SocketPermission tests for │ │ │ │ │ │ legacy socket types. │ │ │ │ │ │ _s_u_n_/_s_e_c_u_r_i_t_y_/_k_r_b_5_/_a_u_t_o_/_A_d_d_r_e_s_s_e_s_._j_a_v_a: fix krb5 caddr │ │ │ │ │ │ =============================================================================== │ │ │ │ │ │ -Report generated on Oct 22, 2026 12:30:22 PM │ │ │ │ │ │ +Report generated on Oct 23, 2026 5:52:11 AM │ │ │ │ │ │ Using JT Harness 6.0 b26; built on March 18, 2026, 12:00:00 AM UTC with openjdk │ │ │ │ │ │ version "25.0.3-ea" 2026-04-21 │ │ │ │ ├── jtreg-test-output/jdk/2/JTreport/html/passed_gr.html │ │ │ │ │ @@ -242,77986 +242,78003 @@ │ │ │ │ │ 00000f10: 7373 6669 6c65 2f65 7861 6d70 6c65 732f ssfile/examples/ │ │ │ │ │ 00000f20: 5472 616e 7366 6f72 6d45 7861 6d70 6c65 TransformExample │ │ │ │ │ 00000f30: 732e 6a61 7661 3c2f 613e 3a20 5465 7374 s.java: Test │ │ │ │ │ 00000f40: 696e 6720 436c 6173 7366 696c 6520 5472 ing Classfile Tr │ │ │ │ │ 00000f50: 616e 7366 6f72 6d45 7861 6d70 6c65 7320 ansformExamples │ │ │ │ │ 00000f60: 636f 6d70 696c 6174 696f 6e2e 0a3c 2f75 compilation....

    DEBUG: [ │ │ │ │ │ -00000f80: 4874 7470 436c 6965 6e74 2d31 2d57 6f72 HttpClient-1-Wor │ │ │ │ │ -00000f90: 6b65 722d 305d 205b 3933 386d 735d 2053 ker-0] [938ms] S │ │ │ │ │ -00000fa0: 534c 2057 7269 7465 7228 536f 636b 6574 SL Writer(Socket │ │ │ │ │ -00000fb0: 5475 6265 2831 2929 2070 726f 6365 7373 Tube(1)) process │ │ │ │ │ -00000fc0: 4461 7461 2c20 7772 6974 654c 6973 7420 Data, writeList │ │ │ │ │ -00000fd0: 7265 6d61 696e 696e 673a 302c 2068 7354 remaining:0, hsT │ │ │ │ │ -00000fe0: 7269 6767 6572 6564 3a74 7275 652c 206e riggered:true, n │ │ │ │ │ -00000ff0: 6565 6457 7261 703a 7472 7565 3c2f 6834 eedWrap:true

    ....

    Exec │ │ │ │ │ -000010d0: 7574 696f 6e20 6661 696c 6564 2061 7320 ution failed as │ │ │ │ │ -000010e0: 6578 7065 6374 6564 3c2f 6834 3e0a 0a3c expected

    ..< │ │ │ │ │ -000010f0: 756c 3e0a 3c6c 693e 0a3c 6120 6872 6566 ul>.
  • .com/ │ │ │ │ │ -00001140: 7375 6e2f 7365 6375 7269 7479 2f73 6173 sun/security/sas │ │ │ │ │ -00001150: 6c2f 6469 6765 7374 2f55 6e62 6f75 6e64 l/digest/Unbound │ │ │ │ │ -00001160: 2e6a 6176 613c 2f61 3e3a 2053 4153 4c20 .java: SASL │ │ │ │ │ -00001170: 7365 7276 6963 6520 666f 7220 6d75 6c74 service for mult │ │ │ │ │ -00001180: 6970 6c65 2068 6f73 746e 616d 6573 0a0a iple hostnames.. │ │ │ │ │ -00001190: 3c6c 693e 0a3c 6120 6872 6566 3d22 2f74
  • .java │ │ │ │ │ -000011f0: 2f6e 696f 2f63 6861 6e6e 656c 732f 4173 /nio/channels/As │ │ │ │ │ -00001200: 796e 6368 726f 6e6f 7573 4368 616e 6e65 ynchronousChanne │ │ │ │ │ -00001210: 6c47 726f 7570 2f42 6164 5072 6f70 6572 lGroup/BadProper │ │ │ │ │ -00001220: 7469 6573 2e6a 6176 613c 2f61 3e3a 2055 ties.java: U │ │ │ │ │ -00001230: 6e69 7420 7465 7374 2066 6f72 2041 7379 nit test for Asy │ │ │ │ │ -00001240: 6e63 6872 6f6e 6f75 7343 6861 6e6e 656c nchronousChannel │ │ │ │ │ -00001250: 4772 6f75 700a 0a3c 6c69 3e0a 3c61 2068 Group..
  • .sun/securi │ │ │ │ │ -000012b0: 7479 2f6a 6773 732f 7370 6e65 676f 2f4e ty/jgss/spnego/N │ │ │ │ │ -000012c0: 6567 546f 6b65 6e54 6172 6746 6965 6c64 egTokenTargField │ │ │ │ │ -000012d0: 732e 6a61 7661 3c2f 613e 3a20 5350 4e45 s.java: SPNE │ │ │ │ │ -000012e0: 474f 2047 5353 2063 6f64 6520 646f 6573 GO GSS code does │ │ │ │ │ -000012f0: 206e 6f74 2070 6172 7365 2074 6f6b 656e not parse token │ │ │ │ │ -00001300: 7320 696e 2061 6363 6f72 6461 6e63 6520 s in accordance │ │ │ │ │ -00001310: 746f 2052 4643 2032 3437 380a 0a3c 6c69 to RFC 2478..
  • .sun/security/ │ │ │ │ │ -00001370: 6b72 6235 2f61 7574 6f2f 4e6f 4164 6472 krb5/auto/NoAddr │ │ │ │ │ -00001380: 6573 7365 732e 6a61 7661 3c2f 613e 3a20 esses.java: │ │ │ │ │ -00001390: 6e6f 2d61 6464 7265 7373 6573 2073 686f no-addresses sho │ │ │ │ │ -000013a0: 756c 6420 6e6f 7420 6265 2075 7365 6420 uld not be used │ │ │ │ │ -000013b0: 6f6e 2061 6363 6570 746f 7220 7369 6465 on acceptor side │ │ │ │ │ -000013c0: 0a0a 3c6c 693e 0a3c 6120 6872 6566 3d22 ..
  • .sun/securit │ │ │ │ │ -00001410: 792f 6b72 6235 2f61 7574 6f2f 4e6f 6e41 y/krb5/auto/NonA │ │ │ │ │ -00001420: 7363 6969 2e6a 6176 613c 2f61 3e3a 204b scii.java: K │ │ │ │ │ -00001430: 6572 6265 726f 7353 7472 696e 6720 7368 erberosString sh │ │ │ │ │ -00001440: 6f75 6c64 2075 7365 2055 5446 2d38 2062 ould use UTF-8 b │ │ │ │ │ -00001450: 7920 6465 6661 756c 740a 0a3c 6c69 3e0a y default..
  • . │ │ │ │ │ -00001460: 3c61 2068 7265 663d 222f 746d 702f 6a64 sun/secu │ │ │ │ │ -000014b0: 7269 7479 2f6b 7262 352f 6175 746f 2f52 rity/krb5/auto/R │ │ │ │ │ -000014c0: 6570 6c61 7943 6163 6865 4578 7075 6e67 eplayCacheExpung │ │ │ │ │ -000014d0: 652e 6a61 7661 3c2f 613e 3a20 7768 656e e.java: when │ │ │ │ │ -000014e0: 206e 756d 6265 7220 6f66 2065 7870 6972 number of expir │ │ │ │ │ -000014f0: 6564 2065 6e74 7269 6573 206d 696e 7573 ed entries minus │ │ │ │ │ -00001500: 206e 756d 6265 7220 6f66 2067 6f6f 6420 number of good │ │ │ │ │ -00001510: 656e 7472 6965 7320 6973 206d 6f72 6520 entries is more │ │ │ │ │ -00001520: 7468 616e 2033 302c 2065 7870 756e 6765 than 30, expunge │ │ │ │ │ -00001530: 206f 6363 7572 732c 2061 6e64 2065 7870 occurs, and exp │ │ │ │ │ -00001540: 6972 6564 2065 6e74 7269 6573 2061 7265 ired entries are │ │ │ │ │ -00001550: 2066 6f72 676f 7474 656e 2e0a 0a3c 6c69 forgotten...
  • .sun/security/ │ │ │ │ │ -000015b0: 6b72 6235 2f61 7574 6f2f 5361 736c 556e krb5/auto/SaslUn │ │ │ │ │ -000015c0: 626f 756e 642e 6a61 7661 3c2f 613e 3a20 bound.java: │ │ │ │ │ -000015d0: 556e 626f 756e 6420 5341 534c 2073 6572 Unbound SASL ser │ │ │ │ │ -000015e0: 7669 6365 3a20 7468 6520 4753 5341 5049 vice: the GSSAPI │ │ │ │ │ -000015f0: 2f6b 7262 3520 6d65 6368 0a0a 3c6c 693e /krb5 mech..
  • │ │ │ │ │ -00001600: 0a3c 6120 6872 6566 3d22 2f74 6d70 2f6a .sun/secu │ │ │ │ │ -00001650: 7269 7479 2f6b 7262 352f 6175 746f 2f53 rity/krb5/auto/S │ │ │ │ │ -00001660: 706e 6567 6f55 6e6b 6e6f 776e 4d65 6368 pnegoUnknownMech │ │ │ │ │ -00001670: 2e6a 6176 613c 2f61 3e3a 2020 0a0a 3c6c .java: ...sun/security/ │ │ │ │ │ -000016d0: 6b72 6235 2f61 7574 6f2f 5477 6f4f 7254 krb5/auto/TwoOrT │ │ │ │ │ -000016e0: 6872 6565 2e6a 6176 613c 2f61 3e3a 2064 hree.java: d │ │ │ │ │ -000016f0: 6566 6175 6c74 2070 7269 6e63 6970 616c efault principal │ │ │ │ │ -00001700: 2063 616e 2061 6374 2061 7320 616e 796f can act as anyo │ │ │ │ │ -00001710: 6e65 0a0a 3c6c 693e 0a3c 6120 6872 6566 ne..
  • .sun │ │ │ │ │ -00001760: 2f73 6563 7572 6974 792f 6b72 6235 2f61 /security/krb5/a │ │ │ │ │ -00001770: 7574 6f2f 556e 626f 756e 6453 6572 7669 uto/UnboundServi │ │ │ │ │ -00001780: 6365 2e6a 6176 613c 2f61 3e3a 2055 6e62 ce.java: Unb │ │ │ │ │ -00001790: 6f75 6e64 2053 4153 4c20 7365 7276 6963 ound SASL servic │ │ │ │ │ -000017a0: 653a 2074 6865 2047 5353 4150 492f 6b72 e: the GSSAPI/kr │ │ │ │ │ -000017b0: 6235 206d 6563 680a 3c2f 756c 3e0a 0a3c b5 mech...< │ │ │ │ │ -000017c0: 6834 3e45 7865 6375 7469 6f6e 2073 7563 h4>Execution suc │ │ │ │ │ -000017d0: 6365 7373 6675 6c3c 2f68 343e 0a0a 3c75 cessful...
  • .com/ │ │ │ │ │ -00001840: 7375 6e2f 6372 7970 746f 2f70 726f 7669 sun/crypto/provi │ │ │ │ │ -00001850: 6465 722f 416c 676f 7269 7468 6d50 6172 der/AlgorithmPar │ │ │ │ │ -00001860: 616d 6574 6572 732f 4f41 4550 4f72 6465 ameters/OAEPOrde │ │ │ │ │ -00001870: 722e 6a61 7661 3c2f 613e 3a20 456e 7375 r.java: Ensu │ │ │ │ │ -00001880: 7265 7320 4f41 4550 5061 7261 6d65 7465 res OAEPParamete │ │ │ │ │ -00001890: 7273 2072 6561 6420 636f 7272 6563 7420 rs read correct │ │ │ │ │ -000018a0: 656e 636f 6469 6e67 2061 6e64 2072 656a encoding and rej │ │ │ │ │ -000018b0: 6563 7420 656e 636f 6469 6e67 2077 6974 ect encoding wit │ │ │ │ │ -000018c0: 6820 696e 7661 6c69 6420 6f72 6465 7269 h invalid orderi │ │ │ │ │ -000018d0: 6e67 0a0a 3c6c 693e 0a3c 6120 6872 6566 ng..
  • .com/sun/cry │ │ │ │ │ -00001930: 7074 6f2f 7072 6f76 6964 6572 2f43 4943 pto/provider/CIC │ │ │ │ │ -00001940: 4f2f 4349 434f 4368 6169 6e69 6e67 5465 O/CICOChainingTe │ │ │ │ │ -00001950: 7374 2e6a 6176 613c 2f61 3e3a 2054 6869 st.java: Thi │ │ │ │ │ -00001960: 7320 7465 7374 2076 6572 6966 6965 7320 s test verifies │ │ │ │ │ -00001970: 7468 6520 6173 7365 7274 696f 6e20 2254 the assertion "T │ │ │ │ │ -00001980: 6865 2063 6861 696e 696e 6720 6665 6174 he chaining feat │ │ │ │ │ -00001990: 7572 6520 6f66 2046 696c 7465 7220 7374 ure of Filter st │ │ │ │ │ -000019a0: 7265 616d 7320 7368 6f75 6c64 2062 6520 reams should be │ │ │ │ │ -000019b0: 7375 7070 6f72 7465 642e 2220 666f 7220 supported." for │ │ │ │ │ -000019c0: 6665 6174 7572 6520 2243 6970 6865 7249 feature "CipherI │ │ │ │ │ -000019d0: 6e70 7574 5374 7265 616d 2026 616d 703b nputStream & │ │ │ │ │ -000019e0: 2043 6970 6865 724f 7574 7075 7453 7472 CipherOutputStr │ │ │ │ │ -000019f0: 6561 6d22 0a0a 3c6c 693e 0a3c 6120 6872 eam"..
  • .com/sun/cr │ │ │ │ │ -00001a50: 7970 746f 2f70 726f 7669 6465 722f 4349 ypto/provider/CI │ │ │ │ │ -00001a60: 434f 2f43 4943 4f44 4553 4675 6e63 5465 CO/CICODESFuncTe │ │ │ │ │ -00001a70: 7374 2e6a 6176 613c 2f61 3e3a 2074 6f20 st.java: to │ │ │ │ │ -00001a80: 7665 7269 6679 2063 6970 6865 7249 6e70 verify cipherInp │ │ │ │ │ -00001a90: 7574 5374 7265 616d 2061 6e64 2063 6970 utStream and cip │ │ │ │ │ -00001aa0: 6865 7249 6e70 7574 5374 7265 616d 2063 herInputStream c │ │ │ │ │ -00001ab0: 6970 6865 7220 6675 6e63 7469 6f6e 0a0a ipher function.. │ │ │ │ │ -00001ac0: 3c6c 693e 0a3c 6120 6872 6566 3d22 2f74
  • .com │ │ │ │ │ -00001b10: 2f73 756e 2f63 7279 7074 6f2f 7072 6f76 /sun/crypto/prov │ │ │ │ │ -00001b20: 6964 6572 2f43 4943 4f2f 4349 434f 536b ider/CICO/CICOSk │ │ │ │ │ -00001b30: 6970 5465 7374 2e6a 6176 613c 2f61 3e3a ipTest.java: │ │ │ │ │ -00001b40: 2054 6869 7320 7465 7374 2076 6572 6966 This test verif │ │ │ │ │ -00001b50: 6965 7320 7468 6520 6173 7365 7274 696f ies the assertio │ │ │ │ │ -00001b60: 6e20 2254 6865 2073 6b69 7020 6665 6174 n "The skip feat │ │ │ │ │ -00001b70: 7572 6520 6f66 2046 696c 7465 7220 7374 ure of Filter st │ │ │ │ │ -00001b80: 7265 616d 7320 7368 6f75 6c64 2062 6520 reams should be │ │ │ │ │ -00001b90: 7375 7070 6f72 7465 642e 2220 666f 7220 supported." for │ │ │ │ │ -00001ba0: 6665 6174 7572 6520 4369 7068 6572 496e feature CipherIn │ │ │ │ │ -00001bb0: 7075 7453 7472 6561 6d20 616e 6420 4369 putStream and Ci │ │ │ │ │ -00001bc0: 7068 6572 4f75 7470 7574 5374 7265 616d pherOutputStream │ │ │ │ │ -00001bd0: 0a0a 3c6c 693e 0a3c 6120 6872 6566 3d22 ..
  • .com/su │ │ │ │ │ -00001c30: 6e2f 6372 7970 746f 2f70 726f 7669 6465 n/crypto/provide │ │ │ │ │ -00001c40: 722f 4349 434f 2f50 4245 4675 6e63 2f43 r/CICO/PBEFunc/C │ │ │ │ │ -00001c50: 4943 4f50 4245 4675 6e63 5465 7374 2e6a ICOPBEFuncTest.j │ │ │ │ │ -00001c60: 6176 613c 2f61 3e3a 2054 6869 7320 7465 ava: This te │ │ │ │ │ -00001c70: 7374 2076 6572 6966 6965 7320 7468 6520 st verifies the │ │ │ │ │ -00001c80: 6173 7365 7274 696f 6e20 2254 6865 2065 assertion "The e │ │ │ │ │ -00001c90: 6e63 7279 7074 2f64 6563 7279 7074 206d ncrypt/decrypt m │ │ │ │ │ -00001ca0: 6563 6861 6e69 736d 206f 6620 6369 7068 echanism of ciph │ │ │ │ │ -00001cb0: 6572 2073 686f 756c 6420 7065 7266 6f72 er should perfor │ │ │ │ │ -00001cc0: 6d20 636f 7272 6563 746c 792e 2220 666f m correctly." fo │ │ │ │ │ -00001cd0: 7220 6665 6174 7572 6520 2243 6970 6865 r feature "Ciphe │ │ │ │ │ -00001ce0: 7249 6e70 7574 5374 7265 616d 2026 616d rInputStream &am │ │ │ │ │ -00001cf0: 703b 2043 6970 6865 724f 7574 7075 7453 p; CipherOutputS │ │ │ │ │ -00001d00: 7472 6561 6d22 2e0a 0a3c 6c69 3e0a 3c61 tream"...
  • .com/sun/crypto │ │ │ │ │ -00001d70: 2f70 726f 7669 6465 722f 4349 434f 2f50 /provider/CICO/P │ │ │ │ │ -00001d80: 4245 4675 6e63 2f43 6970 6865 724e 4346 BEFunc/CipherNCF │ │ │ │ │ -00001d90: 756e 6354 6573 742e 6a61 7661 3c2f 613e uncTest.java │ │ │ │ │ -00001da0: 3a20 5468 6973 2074 6573 7420 7665 7269 : This test veri │ │ │ │ │ -00001db0: 6669 6573 2074 6865 2061 7373 6572 7469 fies the asserti │ │ │ │ │ -00001dc0: 6f6e 2022 5468 6572 6520 7368 6f75 6c64 on "There should │ │ │ │ │ -00001dd0: 2062 6520 6e6f 2074 7261 6e73 666f 726d be no transform │ │ │ │ │ -00001de0: 6174 696f 6e20 6f6e 2074 6865 2070 6c61 ation on the pla │ │ │ │ │ -00001df0: 696e 7465 7874 2f63 6970 6865 7274 6578 intext/ciphertex │ │ │ │ │ -00001e00: 7420 696e 2065 6e63 7279 7074 696f 6e2f t in encryption/ │ │ │ │ │ -00001e10: 6465 6372 7970 7469 6f6e 206d 6563 6861 decryption mecha │ │ │ │ │ -00001e20: 6e69 736d 2220 666f 7220 6665 6174 7572 nism" for featur │ │ │ │ │ -00001e30: 6520 224e 756c 6c43 6970 6865 7222 2e0a e "NullCipher".. │ │ │ │ │ -00001e40: 0a3c 6c69 3e0a 3c61 2068 7265 663d 222f .
  • . │ │ │ │ │ -00001e90: 636f 6d2f 7375 6e2f 6372 7970 746f 2f70 com/sun/crypto/p │ │ │ │ │ -00001ea0: 726f 7669 6465 722f 4369 7068 6572 2f41 rovider/Cipher/A │ │ │ │ │ -00001eb0: 4541 442f 456e 6372 7970 742e 6a61 7661 EAD/Encrypt.java │ │ │ │ │ -00001ec0: 3c2f 613e 3a20 4145 4144 2065 6e63 7279 : AEAD encry │ │ │ │ │ -00001ed0: 7074 696f 6e2f 6465 6372 7970 7469 6f6e ption/decryption │ │ │ │ │ -00001ee0: 2074 6573 740a 0a3c 6c69 3e0a 3c61 2068 test..
  • .com/ │ │ │ │ │ -00001f40: 7375 6e2f 6372 7970 746f 2f70 726f 7669 sun/crypto/provi │ │ │ │ │ -00001f50: 6465 722f 4369 7068 6572 2f41 4541 442f der/Cipher/AEAD/ │ │ │ │ │ -00001f60: 4743 4d42 7566 6665 7254 6573 742e 6a61 GCMBufferTest.ja │ │ │ │ │ -00001f70: 7661 3c2f 613e 3a20 5573 6520 4369 7068 va: Use Ciph │ │ │ │ │ -00001f80: 6572 2075 7064 6174 6520 616e 6420 646f er update and do │ │ │ │ │ -00001f90: 4669 6e61 6c20 7769 7468 2061 206d 6978 Final with a mix │ │ │ │ │ -00001fa0: 7475 7265 206f 6620 6279 7465 5b5d 2c20 ture of byte[], │ │ │ │ │ -00001fb0: 6279 7465 6275 6666 6572 2c20 616e 6420 bytebuffer, and │ │ │ │ │ -00001fc0: 6f66 6673 6574 2077 6869 6c65 2076 6572 offset while ver │ │ │ │ │ -00001fd0: 6966 7969 6e67 2072 6574 7572 6e20 7661 ifying return va │ │ │ │ │ -00001fe0: 6c75 6573 2e0a 0a3c 6c69 3e0a 3c61 2068 lues...
  • .co │ │ │ │ │ -00002040: 6d2f 7375 6e2f 6372 7970 746f 2f70 726f m/sun/crypto/pro │ │ │ │ │ -00002050: 7669 6465 722f 4369 7068 6572 2f41 4541 vider/Cipher/AEA │ │ │ │ │ -00002060: 442f 4743 4d4c 6172 6765 4461 7461 4b41 D/GCMLargeDataKA │ │ │ │ │ -00002070: 542e 6a61 7661 3c2f 613e 3a20 5665 7269 T.java: Veri │ │ │ │ │ -00002080: 6679 2063 6f72 7265 6374 6e65 7373 206f fy correctness o │ │ │ │ │ -00002090: 6620 6c61 7267 6520 6461 7461 2073 697a f large data siz │ │ │ │ │ -000020a0: 6573 2066 6f72 2047 434d 2e0a 0a3c 6c69 es for GCM...
  • .com/sun │ │ │ │ │ -00002110: 2f63 7279 7074 6f2f 7072 6f76 6964 6572 /crypto/provider │ │ │ │ │ -00002120: 2f43 6970 6865 722f 4145 4144 2f47 434d /Cipher/AEAD/GCM │ │ │ │ │ -00002130: 5061 7261 6d65 7465 7253 7065 6354 6573 ParameterSpecTes │ │ │ │ │ -00002140: 742e 6a61 7661 3c2f 613e 3a20 4368 6563 t.java: Chec │ │ │ │ │ -00002150: 6b20 6966 2047 434d 5061 7261 6d65 7465 k if GCMParamete │ │ │ │ │ -00002160: 7253 7065 6320 776f 726b 7320 6173 2065 rSpec works as e │ │ │ │ │ -00002170: 7870 6563 7465 640a 0a3c 6c69 3e0a 3c61 xpected..
  • .c │ │ │ │ │ -000021d0: 6f6d 2f73 756e 2f63 7279 7074 6f2f 7072 om/sun/crypto/pr │ │ │ │ │ -000021e0: 6f76 6964 6572 2f43 6970 6865 722f 4145 ovider/Cipher/AE │ │ │ │ │ -000021f0: 4144 2f47 434d 5368 6f72 7442 7566 6665 AD/GCMShortBuffe │ │ │ │ │ -00002200: 722e 6a61 7661 3c2f 613e 3a20 4361 6c6c r.java: Call │ │ │ │ │ -00002210: 2064 6563 7279 7074 2064 6f46 696e 616c decrypt doFinal │ │ │ │ │ -00002220: 2829 2077 6974 6820 6469 6666 6572 656e () with differen │ │ │ │ │ -00002230: 7420 6f75 7470 7574 2076 616c 7565 7320 t output values │ │ │ │ │ -00002240: 746f 2073 6565 2069 6620 7468 6520 7468 to see if the th │ │ │ │ │ -00002250: 6520 6f70 6572 6174 696f 6e20 6361 6e20 e operation can │ │ │ │ │ -00002260: 636f 6d70 6c65 7465 2061 6674 6572 2061 complete after a │ │ │ │ │ -00002270: 2053 686f 7274 4275 6666 6572 4578 6365 ShortBufferExce │ │ │ │ │ -00002280: 7074 696f 6e0a 0a3c 6c69 3e0a 3c61 2068 ption..
  • .com/ │ │ │ │ │ -000022e0: 7375 6e2f 6372 7970 746f 2f70 726f 7669 sun/crypto/provi │ │ │ │ │ -000022f0: 6465 722f 4369 7068 6572 2f41 4541 442f der/Cipher/AEAD/ │ │ │ │ │ -00002300: 4743 4d53 686f 7274 496e 7075 742e 6a61 GCMShortInput.ja │ │ │ │ │ -00002310: 7661 3c2f 613e 3a20 4172 6974 686d 6574 va: Arithmet │ │ │ │ │ -00002320: 6963 4578 6365 7074 696f 6e20 696e 2047 icException in G │ │ │ │ │ -00002330: 616c 6f69 7343 6f75 6e74 6572 4d6f 6465 aloisCounterMode │ │ │ │ │ -00002340: 0a0a 3c6c 693e 0a3c 6120 6872 6566 3d22 ..
  • .com/sun/cryp │ │ │ │ │ -000023a0: 746f 2f70 726f 7669 6465 722f 4369 7068 to/provider/Ciph │ │ │ │ │ -000023b0: 6572 2f41 4541 442f 4b65 7957 7261 7070 er/AEAD/KeyWrapp │ │ │ │ │ -000023c0: 6572 2e6a 6176 613c 2f61 3e3a 2043 6865 er.java: Che │ │ │ │ │ -000023d0: 636b 2069 6620 6120 6b65 7920 7772 6170 ck if a key wrap │ │ │ │ │ -000023e0: 7065 7220 776f 726b 7320 7072 6f70 6572 per works proper │ │ │ │ │ -000023f0: 6c79 2077 6974 6820 4743 4d20 6d6f 6465 ly with GCM mode │ │ │ │ │ -00002400: 0a0a 3c6c 693e 0a3c 6120 6872 6566 3d22 ..
  • .com/s │ │ │ │ │ -00002460: 756e 2f63 7279 7074 6f2f 7072 6f76 6964 un/crypto/provid │ │ │ │ │ -00002470: 6572 2f43 6970 6865 722f 4145 4144 2f4f er/Cipher/AEAD/O │ │ │ │ │ -00002480: 7665 726c 6170 4279 7465 4275 6666 6572 verlapByteBuffer │ │ │ │ │ -00002490: 2e6a 6176 613c 2f61 3e3a 2054 6869 7320 .java: This │ │ │ │ │ -000024a0: 7465 7374 7320 6f76 6572 6c61 7070 696e tests overlappin │ │ │ │ │ -000024b0: 6720 6275 6666 6572 7320 7573 696e 6720 g buffers using │ │ │ │ │ -000024c0: 4279 7465 4275 6666 6572 2e73 6c69 6365 ByteBuffer.slice │ │ │ │ │ -000024d0: 2829 2077 6974 6820 6172 7261 792d 6261 () with array-ba │ │ │ │ │ -000024e0: 636b 6564 2042 7974 6542 7566 6665 722c cked ByteBuffer, │ │ │ │ │ -000024f0: 2072 6561 6420 6f6e 6c79 2061 7272 6179 read only array │ │ │ │ │ -00002500: 2d62 6163 6b65 642c 2042 7974 6542 7566 -backed, ByteBuf │ │ │ │ │ -00002510: 6665 722c 2061 6e64 2064 6972 6563 7420 fer, and direct │ │ │ │ │ -00002520: 4279 7465 4275 6666 6572 2e0a 0a3c 6c69 ByteBuffer...
  • .com/sun/crypto │ │ │ │ │ -00002590: 2f70 726f 7669 6465 722f 4369 7068 6572 /provider/Cipher │ │ │ │ │ -000025a0: 2f41 4541 442f 5265 6164 5772 6974 6553 /AEAD/ReadWriteS │ │ │ │ │ -000025b0: 6b69 702e 6a61 7661 3c2f 613e 3a20 5465 kip.java: Te │ │ │ │ │ -000025c0: 7374 2043 4943 4f20 4145 4144 2072 6561 st CICO AEAD rea │ │ │ │ │ -000025d0: 642f 7772 6974 652f 736b 6970 206f 7065 d/write/skip ope │ │ │ │ │ -000025e0: 7261 7469 6f6e 730a 0a3c 6c69 3e0a 3c61 rations..
  • .com/s │ │ │ │ │ -00002640: 756e 2f63 7279 7074 6f2f 7072 6f76 6964 un/crypto/provid │ │ │ │ │ -00002650: 6572 2f43 6970 6865 722f 4145 4144 2f53 er/Cipher/AEAD/S │ │ │ │ │ -00002660: 616d 6542 7566 6665 722e 6a61 7661 3c2f ameBuffer.java: Check if AEA │ │ │ │ │ -00002680: 4420 6f70 6572 6174 696f 6e73 2077 6f72 D operations wor │ │ │ │ │ -00002690: 6b20 636f 7272 6563 746c 7920 7768 656e k correctly when │ │ │ │ │ -000026a0: 2062 7566 6665 7273 2075 7365 6420 666f buffers used fo │ │ │ │ │ -000026b0: 7220 7374 6f72 696e 6720 706c 6169 6e20 r storing plain │ │ │ │ │ -000026c0: 7465 7874 2061 6e64 2063 6970 6865 7220 text and cipher │ │ │ │ │ -000026d0: 7465 7874 2061 7265 206f 7665 726c 6170 text are overlap │ │ │ │ │ -000026e0: 7065 6420 6f72 2074 6865 2073 616d 650a ped or the same. │ │ │ │ │ -000026f0: 0a3c 6c69 3e0a 3c61 2068 7265 663d 222f .
  • .com/sun │ │ │ │ │ -00002750: 2f63 7279 7074 6f2f 7072 6f76 6964 6572 /crypto/provider │ │ │ │ │ -00002760: 2f43 6970 6865 722f 4145 4144 2f53 6561 /Cipher/AEAD/Sea │ │ │ │ │ -00002770: 6c65 644f 626a 6563 7454 6573 742e 6a61 ledObjectTest.ja │ │ │ │ │ -00002780: 7661 3c2f 613e 3a20 4368 6563 6b20 6966 va: Check if │ │ │ │ │ -00002790: 2074 6865 2073 6561 6c2f 756e 7365 616c the seal/unseal │ │ │ │ │ -000027a0: 2066 6561 7475 7265 2077 6f72 6b73 2070 feature works p │ │ │ │ │ -000027b0: 726f 7065 726c 7920 696e 2041 4541 442f roperly in AEAD/ │ │ │ │ │ -000027c0: 4743 4d20 6d6f 6465 2e0a 0a3c 6c69 3e0a GCM mode...
  • . │ │ │ │ │ -000027d0: 3c61 2068 7265 663d 222f 746d 702f 6a64 com/s │ │ │ │ │ -00002820: 756e 2f63 7279 7074 6f2f 7072 6f76 6964 un/crypto/provid │ │ │ │ │ -00002830: 6572 2f43 6970 6865 722f 4145 4144 2f57 er/Cipher/AEAD/W │ │ │ │ │ -00002840: 726f 6e67 4141 442e 6a61 7661 3c2f 613e rongAAD.java │ │ │ │ │ -00002850: 3a20 4368 6563 6b20 6966 2077 726f 6e67 : Check if wrong │ │ │ │ │ -00002860: 206f 7220 656d 7074 7920 4141 4420 6973 or empty AAD is │ │ │ │ │ -00002870: 2072 656a 6563 7465 640a 0a3c 6c69 3e0a rejected..
  • . │ │ │ │ │ -00002880: 3c61 2068 7265 663d 222f 746d 702f 6a64 com/sun/cr │ │ │ │ │ -000028d0: 7970 746f 2f70 726f 7669 6465 722f 4369 ypto/provider/Ci │ │ │ │ │ -000028e0: 7068 6572 2f41 4553 2f43 4943 4f2e 6a61 pher/AES/CICO.ja │ │ │ │ │ -000028f0: 7661 3c2f 613e 3a20 5465 7374 2041 4553 va: Test AES │ │ │ │ │ -00002900: 2063 6970 6865 7273 2077 6974 6820 6469 ciphers with di │ │ │ │ │ -00002910: 6666 6572 656e 7420 6d6f 6465 7320 616e fferent modes an │ │ │ │ │ -00002920: 6420 7061 6464 696e 6720 7363 6865 6d65 d padding scheme │ │ │ │ │ -00002930: 7320 2845 4342 206d 6f64 6520 646f 6573 s (ECB mode does │ │ │ │ │ -00002940: 6e27 7420 7573 6520 4956 292e 0a0a 3c6c n't use IV)....com/sun/ │ │ │ │ │ -000029a0: 6372 7970 746f 2f70 726f 7669 6465 722f crypto/provider/ │ │ │ │ │ -000029b0: 4369 7068 6572 2f41 4553 2f43 5452 2e6a Cipher/AES/CTR.j │ │ │ │ │ -000029c0: 6176 613c 2f61 3e3a 2054 6573 7420 4145 ava: Test AE │ │ │ │ │ -000029d0: 5320 6369 7068 6572 7320 7769 7468 2034 S ciphers with 4 │ │ │ │ │ -000029e0: 2064 6966 6665 7265 6e74 206d 6f64 6573 different modes │ │ │ │ │ -000029f0: 2077 6974 6820 4e6f 5061 6464 696e 672e with NoPadding. │ │ │ │ │ -00002a00: 0a0a 3c6c 693e 0a3c 6120 6872 6566 3d22 ..
  • . │ │ │ │ │ -00002a50: 636f 6d2f 7375 6e2f 6372 7970 746f 2f70 com/sun/crypto/p │ │ │ │ │ -00002a60: 726f 7669 6465 722f 4369 7068 6572 2f41 rovider/Cipher/A │ │ │ │ │ -00002a70: 4553 2f50 6164 6469 6e67 2e6a 6176 613c ES/Padding.java< │ │ │ │ │ -00002a80: 2f61 3e3a 2054 6573 7420 4145 5320 6369 /a>: Test AES ci │ │ │ │ │ -00002a90: 7068 6572 7320 7769 7468 2064 6966 6665 phers with diffe │ │ │ │ │ -00002aa0: 7265 6e74 206d 6f64 6573 2061 6e64 2070 rent modes and p │ │ │ │ │ -00002ab0: 6164 6469 6e67 2073 6368 656d 6573 2028 adding schemes ( │ │ │ │ │ -00002ac0: 4543 4220 6d6f 6465 2064 6f65 736e 2774 ECB mode doesn't │ │ │ │ │ -00002ad0: 2075 7365 2049 5629 2e0a 0a3c 6c69 3e0a use IV)...
  • . │ │ │ │ │ -00002ae0: 3c61 2068 7265 663d 222f 746d 702f 6a64 com │ │ │ │ │ -00002b30: 2f73 756e 2f63 7279 7074 6f2f 7072 6f76 /sun/crypto/prov │ │ │ │ │ -00002b40: 6964 6572 2f43 6970 6865 722f 4145 532f ider/Cipher/AES/ │ │ │ │ │ -00002b50: 5465 7374 3435 3131 3637 362e 6a61 7661 Test4511676.java │ │ │ │ │ -00002b60: 3c2f 613e 3a20 5665 7269 6679 2074 6861 : Verify tha │ │ │ │ │ -00002b70: 7420 4145 5320 6369 7068 6572 2e69 6e69 t AES cipher.ini │ │ │ │ │ -00002b80: 7420 6d65 7468 6f64 2063 6865 636b 206b t method check k │ │ │ │ │ -00002b90: 6579 2073 697a 6520 636f 7272 6563 746c ey size correctl │ │ │ │ │ -00002ba0: 790a 0a3c 6c69 3e0a 3c61 2068 7265 663d y..
  • .com/sun/cry │ │ │ │ │ -00002c00: 7074 6f2f 7072 6f76 6964 6572 2f43 6970 pto/provider/Cip │ │ │ │ │ -00002c10: 6865 722f 4145 532f 5465 7374 3435 3132 her/AES/Test4512 │ │ │ │ │ -00002c20: 3532 342e 6a61 7661 3c2f 613e 3a20 5665 524.java: Ve │ │ │ │ │ -00002c30: 7269 6679 2074 6861 7420 4145 5320 6369 rify that AES ci │ │ │ │ │ -00002c40: 7068 6572 2063 616e 2077 6f72 6b20 7769 pher can work wi │ │ │ │ │ -00002c50: 7468 206d 6f64 6520 2243 4243 222c 2022 th mode "CBC", " │ │ │ │ │ -00002c60: 4f46 4222 2c20 2243 4642 220a 0a3c 6c69 OFB", "CFB"..
  • .c │ │ │ │ │ -00002cc0: 6f6d 2f73 756e 2f63 7279 7074 6f2f 7072 om/sun/crypto/pr │ │ │ │ │ -00002cd0: 6f76 6964 6572 2f43 6970 6865 722f 4145 ovider/Cipher/AE │ │ │ │ │ -00002ce0: 532f 5465 7374 3435 3132 3730 342e 6a61 S/Test4512704.ja │ │ │ │ │ -00002cf0: 7661 3c2f 613e 3a20 5665 7269 6679 2074 va: Verify t │ │ │ │ │ -00002d00: 6861 7420 4145 5320 6369 7068 6572 2063 hat AES cipher c │ │ │ │ │ -00002d10: 616e 2067 656e 6572 6174 6520 6465 6661 an generate defa │ │ │ │ │ -00002d20: 756c 7420 4956 2069 6e20 656e 6372 7970 ult IV in encryp │ │ │ │ │ -00002d30: 7420 6d6f 6465 0a0a 3c6c 693e 0a3c 6120 t mode..
  • .com/su │ │ │ │ │ -00002d90: 6e2f 6372 7970 746f 2f70 726f 7669 6465 n/crypto/provide │ │ │ │ │ -00002da0: 722f 4369 7068 6572 2f41 4553 2f54 6573 r/Cipher/AES/Tes │ │ │ │ │ -00002db0: 7434 3531 3338 3330 2e6a 6176 613c 2f61 t4513830.java: Verify the ou │ │ │ │ │ -00002dd0: 7470 7574 2073 697a 6520 7265 7475 726e tput size return │ │ │ │ │ -00002de0: 6564 2062 7920 4145 5320 6369 7068 6572 ed by AES cipher │ │ │ │ │ -00002df0: 2e67 6574 4f75 7470 7574 5369 7a65 206d .getOutputSize m │ │ │ │ │ -00002e00: 6574 686f 6420 696e 2044 4543 5259 5054 ethod in DECRYPT │ │ │ │ │ -00002e10: 206d 6f64 6520 646f 6573 206e 6f74 2061 mode does not a │ │ │ │ │ -00002e20: 6464 2065 7874 7261 2062 7974 6573 2066 dd extra bytes f │ │ │ │ │ -00002e30: 6f72 2070 6164 6469 6e67 0a0a 3c6c 693e or padding..
  • │ │ │ │ │ -00002e40: 0a3c 6120 6872 6566 3d22 2f74 6d70 2f6a .co │ │ │ │ │ -00002e90: 6d2f 7375 6e2f 6372 7970 746f 2f70 726f m/sun/crypto/pro │ │ │ │ │ -00002ea0: 7669 6465 722f 4369 7068 6572 2f41 4553 vider/Cipher/AES │ │ │ │ │ -00002eb0: 2f54 6573 7434 3531 3733 3535 2e6a 6176 /Test4517355.jav │ │ │ │ │ -00002ec0: 613c 2f61 3e3a 2056 6572 6966 7920 7468 a: Verify th │ │ │ │ │ -00002ed0: 6174 2041 4553 2063 6970 6865 722e 646f at AES cipher.do │ │ │ │ │ -00002ee0: 4669 6e61 6c20 6d65 7468 6f64 2064 6f65 Final method doe │ │ │ │ │ -00002ef0: 7320 4e4f 5420 6e65 6564 206d 6f72 6520 s NOT need more │ │ │ │ │ -00002f00: 7468 616e 206e 6563 6573 7361 7279 2062 than necessary b │ │ │ │ │ -00002f10: 7974 6573 2069 6e20 6465 6372 7970 7420 ytes in decrypt │ │ │ │ │ -00002f20: 6d6f 6465 0a0a 3c6c 693e 0a3c 6120 6872 mode..
  • .com/sun/ │ │ │ │ │ -00002f80: 6372 7970 746f 2f70 726f 7669 6465 722f crypto/provider/ │ │ │ │ │ -00002f90: 4369 7068 6572 2f41 4553 2f54 6573 7434 Cipher/AES/Test4 │ │ │ │ │ -00002fa0: 3632 3630 3730 2e6a 6176 613c 2f61 3e3a 626070.java: │ │ │ │ │ -00002fb0: 2056 6572 6966 7920 7468 6174 2041 4553 Verify that AES │ │ │ │ │ -00002fc0: 2063 6970 6865 7220 6361 6e20 7772 6170 cipher can wrap │ │ │ │ │ -00002fd0: 2061 6e64 2075 6e77 7261 7020 6b65 7973 and unwrap keys │ │ │ │ │ -00002fe0: 0a0a 3c6c 693e 0a3c 6120 6872 6566 3d22 ..
  • .com/sun/cr │ │ │ │ │ -00003040: 7970 746f 2f70 726f 7669 6465 722f 4369 ypto/provider/Ci │ │ │ │ │ -00003050: 7068 6572 2f41 4553 2f54 6573 7441 4553 pher/AES/TestAES │ │ │ │ │ -00003060: 4369 7068 6572 2e6a 6176 613c 2f61 3e3a Cipher.java: │ │ │ │ │ -00003070: 2054 6573 7420 4145 5320 6369 7068 6572 Test AES cipher │ │ │ │ │ -00003080: 7320 7769 7468 2064 6966 6665 7265 6e74 s with different │ │ │ │ │ -00003090: 206d 6f64 6573 2061 6e64 2070 6164 6469 modes and paddi │ │ │ │ │ -000030a0: 6e67 2073 6368 656d 6573 2028 4543 4220 ng schemes (ECB │ │ │ │ │ -000030b0: 6d6f 6465 2064 6f65 736e 2774 2075 7365 mode doesn't use │ │ │ │ │ -000030c0: 2049 5629 2e0a 0a3c 6c69 3e0a 3c61 2068 IV)...
  • .com/sun/c │ │ │ │ │ -00003140: 7279 7074 6f2f 7072 6f76 6964 6572 2f43 rypto/provider/C │ │ │ │ │ -00003150: 6970 6865 722f 4145 532f 5465 7374 4145 ipher/AES/TestAE │ │ │ │ │ -00003160: 5343 6970 6865 7273 2f54 6573 7441 4553 SCiphers/TestAES │ │ │ │ │ -00003170: 5769 7468 4465 6661 756c 7450 726f 7669 WithDefaultProvi │ │ │ │ │ -00003180: 6465 722e 6a61 7661 3c2f 613e 3a20 5465 der.java: Te │ │ │ │ │ -00003190: 7374 2041 4553 2063 6970 6865 7273 2077 st AES ciphers w │ │ │ │ │ -000031a0: 6974 6820 6469 6666 6572 656e 7420 6d6f ith different mo │ │ │ │ │ -000031b0: 6465 7320 616e 6420 7061 6464 696e 6720 des and padding │ │ │ │ │ -000031c0: 7363 6865 6d65 7320 7769 7468 2064 6566 schemes with def │ │ │ │ │ -000031d0: 6175 6c74 2070 726f 7669 6465 720a 0a3c ault provider..< │ │ │ │ │ -000031e0: 6c69 3e0a 3c61 2068 7265 663d 222f 746d li>.co │ │ │ │ │ -00003250: 6d2f 7375 6e2f 6372 7970 746f 2f70 726f m/sun/crypto/pro │ │ │ │ │ -00003260: 7669 6465 722f 4369 7068 6572 2f41 4553 vider/Cipher/AES │ │ │ │ │ -00003270: 2f54 6573 7441 4553 4369 7068 6572 732f /TestAESCiphers/ │ │ │ │ │ -00003280: 5465 7374 4145 5357 6974 6850 726f 7669 TestAESWithProvi │ │ │ │ │ -00003290: 6465 7243 6861 6e67 652e 6a61 7661 3c2f derChange.java: Test AES cip │ │ │ │ │ -000032b0: 6865 7273 2077 6974 6820 6469 6666 6572 hers with differ │ │ │ │ │ -000032c0: 656e 7420 6d6f 6465 7320 616e 6420 7061 ent modes and pa │ │ │ │ │ -000032d0: 6464 696e 6720 7363 6865 6d65 7320 6166 dding schemes af │ │ │ │ │ -000032e0: 7465 7220 7265 6d6f 7665 2074 6865 6e20 ter remove then │ │ │ │ │ -000032f0: 6164 6420 7072 6f76 6964 6572 2e0a 0a3c add provider...< │ │ │ │ │ -00003300: 6c69 3e0a 3c61 2068 7265 663d 222f 746d li>.com/sun/crypto/ │ │ │ │ │ -00003380: 7072 6f76 6964 6572 2f43 6970 6865 722f provider/Cipher/ │ │ │ │ │ -00003390: 4145 532f 5465 7374 4145 5343 6970 6865 AES/TestAESCiphe │ │ │ │ │ -000033a0: 7273 2f54 6573 7441 4553 5769 7468 5265 rs/TestAESWithRe │ │ │ │ │ -000033b0: 6d6f 7665 4164 6450 726f 7669 6465 722e moveAddProvider. │ │ │ │ │ -000033c0: 6a61 7661 3c2f 613e 3a20 5465 7374 2041 java: Test A │ │ │ │ │ -000033d0: 4553 2063 6970 6865 7273 2077 6974 6820 ES ciphers with │ │ │ │ │ -000033e0: 6469 6666 6572 656e 7420 6d6f 6465 7320 different modes │ │ │ │ │ -000033f0: 616e 6420 7061 6464 696e 6720 7363 6865 and padding sche │ │ │ │ │ -00003400: 6d65 7320 6166 7465 7220 7265 6d6f 7665 mes after remove │ │ │ │ │ -00003410: 2064 6566 6175 6c74 2070 726f 7669 6465 default provide │ │ │ │ │ -00003420: 7220 7468 656e 2061 6464 2069 7420 6261 r then add it ba │ │ │ │ │ -00003430: 636b 2e0a 0a3c 6c69 3e0a 3c61 2068 7265 ck...
  • .com/s │ │ │ │ │ -00003490: 756e 2f63 7279 7074 6f2f 7072 6f76 6964 un/crypto/provid │ │ │ │ │ -000034a0: 6572 2f43 6970 6865 722f 4145 532f 5465 er/Cipher/AES/Te │ │ │ │ │ -000034b0: 7374 4349 434f 5769 7468 4743 4d2e 6a61 stCICOWithGCM.ja │ │ │ │ │ -000034c0: 7661 3c2f 613e 3a20 5465 7374 2043 6970 va: Test Cip │ │ │ │ │ -000034d0: 6865 7249 6e70 7574 5374 7265 616d 2f4f herInputStream/O │ │ │ │ │ -000034e0: 7574 7075 7453 7472 6561 6d20 7769 7468 utputStream with │ │ │ │ │ -000034f0: 2041 4553 2047 434d 206d 6f64 652e 0a0a AES GCM mode... │ │ │ │ │ -00003500: 3c6c 693e 0a3c 6120 6872 6566 3d22 2f74
  • .com/ │ │ │ │ │ -00003560: 7375 6e2f 6372 7970 746f 2f70 726f 7669 sun/crypto/provi │ │ │ │ │ -00003570: 6465 722f 4369 7068 6572 2f41 4553 2f54 der/Cipher/AES/T │ │ │ │ │ -00003580: 6573 7443 4943 4f57 6974 6847 434d 416e estCICOWithGCMAn │ │ │ │ │ -00003590: 6441 4144 2e6a 6176 613c 2f61 3e3a 2054 dAAD.java: T │ │ │ │ │ -000035a0: 6573 7420 4369 7068 6572 496e 7075 7453 est CipherInputS │ │ │ │ │ -000035b0: 7472 6561 6d2f 4f75 7470 7574 5374 7265 tream/OutputStre │ │ │ │ │ -000035c0: 616d 2077 6974 6820 4145 5320 4743 4d20 am with AES GCM │ │ │ │ │ -000035d0: 6d6f 6465 2077 6974 6820 4141 442e 0a0a mode with AAD... │ │ │ │ │ -000035e0: 3c6c 693e 0a3c 6120 6872 6566 3d22 2f74
  • .com/sun/crypt │ │ │ │ │ -00003640: 6f2f 7072 6f76 6964 6572 2f43 6970 6865 o/provider/Ciphe │ │ │ │ │ -00003650: 722f 4145 532f 5465 7374 436f 7079 5361 r/AES/TestCopySa │ │ │ │ │ -00003660: 6665 2e6a 6176 613c 2f61 3e3a 2056 6572 fe.java: Ver │ │ │ │ │ -00003670: 6966 7920 7468 6174 2073 616d 6520 6275 ify that same bu │ │ │ │ │ -00003680: 6666 6572 2063 616e 2062 6520 7573 6564 ffer can be used │ │ │ │ │ -00003690: 2061 7320 696e 7075 7420 616e 6420 6f75 as input and ou │ │ │ │ │ -000036a0: 7470 7574 2077 6865 6e20 7573 696e 6720 tput when using │ │ │ │ │ -000036b0: 4369 7068 6572 206f 626a 6563 7473 2e0a Cipher objects.. │ │ │ │ │ -000036c0: 0a3c 6c69 3e0a 3c61 2068 7265 663d 222f .
  • .com/ │ │ │ │ │ -00003720: 7375 6e2f 6372 7970 746f 2f70 726f 7669 sun/crypto/provi │ │ │ │ │ -00003730: 6465 722f 4369 7068 6572 2f41 4553 2f54 der/Cipher/AES/T │ │ │ │ │ -00003740: 6573 7447 434d 4b65 7941 6e64 4976 4368 estGCMKeyAndIvCh │ │ │ │ │ -00003750: 6563 6b2e 6a61 7661 3c2f 613e 3a20 456e eck.java: En │ │ │ │ │ -00003760: 7375 7265 2074 6861 7420 7361 6d65 206b sure that same k │ │ │ │ │ -00003770: 6579 2b69 7620 6361 6e27 7420 6265 2072 ey+iv can't be r │ │ │ │ │ -00003780: 6570 6561 7465 6420 7573 6564 2066 6f72 epeated used for │ │ │ │ │ -00003790: 2065 6e63 7279 7074 696f 6e2e 0a0a 3c6c encryption....co │ │ │ │ │ -000037f0: 6d2f 7375 6e2f 6372 7970 746f 2f70 726f m/sun/crypto/pro │ │ │ │ │ -00003800: 7669 6465 722f 4369 7068 6572 2f41 4553 vider/Cipher/AES │ │ │ │ │ -00003810: 2f54 6573 7447 4841 5348 2e6a 6176 613c /TestGHASH.java< │ │ │ │ │ -00003820: 2f61 3e3a 2054 6573 7420 7665 6374 6f72 /a>: Test vector │ │ │ │ │ -00003830: 7320 666f 7220 636f 6d2e 7375 6e2e 6372 s for com.sun.cr │ │ │ │ │ -00003840: 7970 746f 2e70 726f 7669 6465 722e 4748 ypto.provider.GH │ │ │ │ │ -00003850: 4153 482e 0a0a 3c6c 693e 0a3c 6120 6872 ASH...
  • . │ │ │ │ │ -000038b0: 636f 6d2f 7375 6e2f 6372 7970 746f 2f70 com/sun/crypto/p │ │ │ │ │ -000038c0: 726f 7669 6465 722f 4369 7068 6572 2f41 rovider/Cipher/A │ │ │ │ │ -000038d0: 4553 2f54 6573 7449 534f 3130 3132 3650 ES/TestISO10126P │ │ │ │ │ -000038e0: 6164 6469 6e67 2e6a 6176 613c 2f61 3e3a adding.java: │ │ │ │ │ -000038f0: 2045 6e73 7572 6520 4953 4f31 3031 3236 Ensure ISO10126 │ │ │ │ │ -00003900: 5061 6464 696e 6720 776f 726b 7320 636f Padding works co │ │ │ │ │ -00003910: 7272 6563 746c 792e 0a0a 3c6c 693e 0a3c rrectly...
  • .< │ │ │ │ │ -00003920: 6120 6872 6566 3d22 2f74 6d70 2f6a 646b a href="/tmp/jdk │ │ │ │ │ -00003930: 2f4a 5477 6f72 6b2f 636f 6d2f 7375 6e2f /JTwork/com/sun/ │ │ │ │ │ -00003940: 6372 7970 746f 2f70 726f 7669 6465 722f crypto/provider/ │ │ │ │ │ -00003950: 4369 7068 6572 2f41 4553 2f54 6573 744b Cipher/AES/TestK │ │ │ │ │ -00003960: 4154 466f 7245 4342 5f49 562e 6a74 7222 ATForECB_IV.jtr" │ │ │ │ │ -00003970: 3e63 6f6d 2f73 756e 2f63 7279 7074 6f2f >com/sun/crypto/ │ │ │ │ │ -00003980: 7072 6f76 6964 6572 2f43 6970 6865 722f provider/Cipher/ │ │ │ │ │ -00003990: 4145 532f 5465 7374 4b41 5446 6f72 4543 AES/TestKATForEC │ │ │ │ │ -000039a0: 425f 4956 2e6a 6176 613c 2f61 3e3a 204b B_IV.java: K │ │ │ │ │ -000039b0: 6e6f 776e 2041 6e73 7765 7220 5465 7374 nown Answer Test │ │ │ │ │ -000039c0: 2066 6f72 2041 4553 2063 6970 6865 7220 for AES cipher │ │ │ │ │ -000039d0: 7769 7468 2045 4342 206d 6f64 650a 0a3c with ECB mode..< │ │ │ │ │ -000039e0: 6c69 3e0a 3c61 2068 7265 663d 222f 746d li>.com/sun/cr │ │ │ │ │ -00003a40: 7970 746f 2f70 726f 7669 6465 722f 4369 ypto/provider/Ci │ │ │ │ │ -00003a50: 7068 6572 2f41 4553 2f54 6573 744b 4154 pher/AES/TestKAT │ │ │ │ │ -00003a60: 466f 7245 4342 5f56 4b2e 6a61 7661 3c2f ForECB_VK.java: Known Answer │ │ │ │ │ -00003a80: 2054 6573 7420 666f 7220 4145 5320 6369 Test for AES ci │ │ │ │ │ -00003a90: 7068 6572 2077 6974 6820 4543 4220 6d6f pher with ECB mo │ │ │ │ │ -00003aa0: 6465 0a0a 3c6c 693e 0a3c 6120 6872 6566 de..
  • .com/s │ │ │ │ │ -00003b00: 756e 2f63 7279 7074 6f2f 7072 6f76 6964 un/crypto/provid │ │ │ │ │ -00003b10: 6572 2f43 6970 6865 722f 4145 532f 5465 er/Cipher/AES/Te │ │ │ │ │ -00003b20: 7374 4b41 5446 6f72 4543 425f 5654 2e6a stKATForECB_VT.j │ │ │ │ │ -00003b30: 6176 613c 2f61 3e3a 204b 6e6f 776e 2041 ava: Known A │ │ │ │ │ -00003b40: 6e73 7765 7220 5465 7374 2066 6f72 2041 nswer Test for A │ │ │ │ │ -00003b50: 4553 2063 6970 6865 7220 7769 7468 2045 ES cipher with E │ │ │ │ │ -00003b60: 4342 206d 6f64 650a 0a3c 6c69 3e0a 3c61 CB mode..
  • .com │ │ │ │ │ -00003bc0: 2f73 756e 2f63 7279 7074 6f2f 7072 6f76 /sun/crypto/prov │ │ │ │ │ -00003bd0: 6964 6572 2f43 6970 6865 722f 4145 532f ider/Cipher/AES/ │ │ │ │ │ -00003be0: 5465 7374 4b41 5446 6f72 4743 4d2e 6a61 TestKATForGCM.ja │ │ │ │ │ -00003bf0: 7661 3c2f 613e 3a20 4b6e 6f77 6e20 416e va: Known An │ │ │ │ │ -00003c00: 7377 6572 2054 6573 7420 666f 7220 4145 swer Test for AE │ │ │ │ │ -00003c10: 5320 6369 7068 6572 2077 6974 6820 4743 S cipher with GC │ │ │ │ │ -00003c20: 4d20 6d6f 6465 2073 7570 706f 7274 2069 M mode support i │ │ │ │ │ -00003c30: 6e20 5375 6e4a 4345 2070 726f 7669 6465 n SunJCE provide │ │ │ │ │ -00003c40: 722e 0a0a 3c6c 693e 0a3c 6120 6872 6566 r...
  • .com │ │ │ │ │ -00003ca0: 2f73 756e 2f63 7279 7074 6f2f 7072 6f76 /sun/crypto/prov │ │ │ │ │ -00003cb0: 6964 6572 2f43 6970 6865 722f 4145 532f ider/Cipher/AES/ │ │ │ │ │ -00003cc0: 5465 7374 4e6f 5061 6464 696e 674d 6f64 TestNoPaddingMod │ │ │ │ │ -00003cd0: 6573 2e6a 6176 613c 2f61 3e3a 2045 6e73 es.java: Ens │ │ │ │ │ -00003ce0: 7572 6520 5375 6e4a 4345 2070 726f 7669 ure SunJCE provi │ │ │ │ │ -00003cf0: 6465 7220 7468 726f 7773 2065 7863 6570 der throws excep │ │ │ │ │ -00003d00: 7469 6f6e 2066 6f72 2075 6e73 7570 706f tion for unsuppo │ │ │ │ │ -00003d10: 7274 6564 206d 6f64 6573 2061 6e64 2070 rted modes and p │ │ │ │ │ -00003d20: 6164 6469 6e67 2063 6f6d 6269 6e61 7469 adding combinati │ │ │ │ │ -00003d30: 6f6e 730a 0a3c 6c69 3e0a 3c61 2068 7265 ons..
  • .com/ │ │ │ │ │ -00003d90: 7375 6e2f 6372 7970 746f 2f70 726f 7669 sun/crypto/provi │ │ │ │ │ -00003da0: 6465 722f 4369 7068 6572 2f41 4553 2f54 der/Cipher/AES/T │ │ │ │ │ -00003db0: 6573 744e 6f6e 6578 7061 6e64 696e 672e estNonexpanding. │ │ │ │ │ -00003dc0: 6a61 7661 3c2f 613e 3a20 5465 7374 2041 java: Test A │ │ │ │ │ -00003dd0: 4553 2065 6e63 7279 7074 696f 6e20 7769 ES encryption wi │ │ │ │ │ -00003de0: 7468 206e 6f20 7061 6464 696e 672e 0a0a th no padding... │ │ │ │ │ -00003df0: 3c6c 693e 0a3c 6120 6872 6566 3d22 2f74
  • .com/sun/cry │ │ │ │ │ -00003e50: 7074 6f2f 7072 6f76 6964 6572 2f43 6970 pto/provider/Cip │ │ │ │ │ -00003e60: 6865 722f 4145 532f 5465 7374 5361 6d65 her/AES/TestSame │ │ │ │ │ -00003e70: 4275 6666 6572 2e6a 6176 613c 2f61 3e3a Buffer.java: │ │ │ │ │ -00003e80: 2054 6573 7420 4145 5320 6369 7068 6572 Test AES cipher │ │ │ │ │ -00003e90: 7320 7769 7468 2064 6966 6665 7265 6e74 s with different │ │ │ │ │ -00003ea0: 206d 6f64 6573 2061 6e64 2070 6164 6469 modes and paddi │ │ │ │ │ -00003eb0: 6e67 2073 6368 656d 6573 2028 4543 4220 ng schemes (ECB │ │ │ │ │ -00003ec0: 6d6f 6465 2064 6f65 736e 2774 2075 7365 mode doesn't use │ │ │ │ │ -00003ed0: 2049 5629 2e0a 0a3c 6c69 3e0a 3c61 2068 IV)...
  • .com │ │ │ │ │ -00003f30: 2f73 756e 2f63 7279 7074 6f2f 7072 6f76 /sun/crypto/prov │ │ │ │ │ -00003f40: 6964 6572 2f43 6970 6865 722f 4145 532f ider/Cipher/AES/ │ │ │ │ │ -00003f50: 5465 7374 5368 6f72 7442 7566 6665 722e TestShortBuffer. │ │ │ │ │ -00003f60: 6a61 7661 3c2f 613e 3a20 456e 7375 7265 java: Ensure │ │ │ │ │ -00003f70: 2075 7064 6174 6528 292f 646f 4669 6e61 update()/doFina │ │ │ │ │ -00003f80: 6c28 2920 6d61 7463 6865 7320 6a61 7661 l() matches java │ │ │ │ │ -00003f90: 646f 6320 6465 7363 7269 7074 696f 6e20 doc description │ │ │ │ │ -00003fa0: 7768 656e 2053 686f 7274 4275 6666 6572 when ShortBuffer │ │ │ │ │ -00003fb0: 4578 6365 7074 696f 6e20 6973 2074 6872 Exception is thr │ │ │ │ │ -00003fc0: 6f77 6e2e 0a0a 3c6c 693e 0a3c 6120 6872 own...
  • .com/sun/cryp │ │ │ │ │ -00004030: 746f 2f70 726f 7669 6465 722f 4369 7068 to/provider/Ciph │ │ │ │ │ -00004040: 6572 2f42 6c6f 7766 6973 682f 426c 6f77 er/Blowfish/Blow │ │ │ │ │ -00004050: 6669 7368 5465 7374 5665 6374 6f72 2e6a fishTestVector.j │ │ │ │ │ -00004060: 6176 613c 2f61 3e3a 204b 6e6f 776e 2041 ava: Known A │ │ │ │ │ -00004070: 6e73 7765 7220 5465 7374 2066 6f72 2042 nswer Test for B │ │ │ │ │ -00004080: 6c6f 7766 6973 6820 6369 7068 6572 2077 lowfish cipher w │ │ │ │ │ -00004090: 6974 6820 4543 4220 6d6f 6465 0a0a 3c6c ith ECB mode...com/ │ │ │ │ │ -00004100: 7375 6e2f 6372 7970 746f 2f70 726f 7669 sun/crypto/provi │ │ │ │ │ -00004110: 6465 722f 4369 7068 6572 2f42 6c6f 7766 der/Cipher/Blowf │ │ │ │ │ -00004120: 6973 682f 5465 7374 4369 7068 6572 426c ish/TestCipherBl │ │ │ │ │ -00004130: 6f77 6669 7368 2e6a 6176 613c 2f61 3e3a owfish.java: │ │ │ │ │ -00004140: 2054 6573 7420 426c 6f77 6669 7368 2063 Test Blowfish c │ │ │ │ │ -00004150: 6970 6865 7220 7769 7468 2064 6966 6665 ipher with diffe │ │ │ │ │ -00004160: 7265 6e74 204d 4f44 4553 2061 6e64 2070 rent MODES and p │ │ │ │ │ -00004170: 6164 6469 6e67 0a0a 3c6c 693e 0a3c 6120 adding..
  • .com/su │ │ │ │ │ -000041d0: 6e2f 6372 7970 746f 2f70 726f 7669 6465 n/crypto/provide │ │ │ │ │ -000041e0: 722f 4369 7068 6572 2f43 5452 2f43 6f75 r/Cipher/CTR/Cou │ │ │ │ │ -000041f0: 6e74 6572 4d6f 6465 2e6a 6176 613c 2f61 nterMode.java: Verify that C │ │ │ │ │ -00004210: 5452 206d 6f64 6520 776f 726b 7320 6173 TR mode works as │ │ │ │ │ -00004220: 2065 7870 6563 7465 640a 0a3c 6c69 3e0a expected..
  • . │ │ │ │ │ -00004230: 3c61 2068 7265 663d 222f 746d 702f 6a64 com/sun │ │ │ │ │ -00004280: 2f63 7279 7074 6f2f 7072 6f76 6964 6572 /crypto/provider │ │ │ │ │ -00004290: 2f43 6970 6865 722f 4354 532f 4354 534d /Cipher/CTS/CTSM │ │ │ │ │ -000042a0: 6f64 652e 6a61 7661 3c2f 613e 3a20 5665 ode.java: Ve │ │ │ │ │ -000042b0: 7269 6679 2074 6861 7420 4354 5220 6d6f rify that CTR mo │ │ │ │ │ -000042c0: 6465 2077 6f72 6b73 2061 7320 6578 7065 de works as expe │ │ │ │ │ -000042d0: 6374 6564 0a0a 3c6c 693e 0a3c 6120 6872 cted..
  • .com │ │ │ │ │ -00004330: 2f73 756e 2f63 7279 7074 6f2f 7072 6f76 /sun/crypto/prov │ │ │ │ │ -00004340: 6964 6572 2f43 6970 6865 722f 4368 6143 ider/Cipher/ChaC │ │ │ │ │ -00004350: 6861 3230 2f43 6861 4368 6132 304b 4154 ha20/ChaCha20KAT │ │ │ │ │ -00004360: 2e6a 6176 613c 2f61 3e3a 2043 6861 4368 .java: ChaCh │ │ │ │ │ -00004370: 6132 3020 4369 7068 6572 2049 6d70 6c65 a20 Cipher Imple │ │ │ │ │ -00004380: 6d65 6e74 6174 696f 6e20 284b 4154 290a mentation (KAT). │ │ │ │ │ -00004390: 0a3c 6c69 3e0a 3c61 2068 7265 663d 222f .
  • .com/sun/cry │ │ │ │ │ -00004400: 7074 6f2f 7072 6f76 6964 6572 2f43 6970 pto/provider/Cip │ │ │ │ │ -00004410: 6865 722f 4368 6143 6861 3230 2f43 6861 her/ChaCha20/Cha │ │ │ │ │ -00004420: 4368 6132 304b 6579 4765 6e65 7261 746f Cha20KeyGenerato │ │ │ │ │ -00004430: 7254 6573 742e 6a61 7661 3c2f 613e 3a20 rTest.java: │ │ │ │ │ -00004440: 4368 6143 6861 3230 206b 6579 2067 656e ChaCha20 key gen │ │ │ │ │ -00004450: 6572 6174 6f72 2074 6573 742e 0a0a 3c6c erator test....com/sun │ │ │ │ │ -000044c0: 2f63 7279 7074 6f2f 7072 6f76 6964 6572 /crypto/provider │ │ │ │ │ -000044d0: 2f43 6970 6865 722f 4368 6143 6861 3230 /Cipher/ChaCha20 │ │ │ │ │ -000044e0: 2f43 6861 4368 6132 304e 6f52 6575 7365 /ChaCha20NoReuse │ │ │ │ │ -000044f0: 2e6a 6176 613c 2f61 3e3a 2043 6861 4368 .java: ChaCh │ │ │ │ │ -00004500: 6132 3020 4369 7068 6572 2049 6d70 6c65 a20 Cipher Imple │ │ │ │ │ -00004510: 6d65 6e74 6174 696f 6e20 286b 6579 2f6e mentation (key/n │ │ │ │ │ -00004520: 6f6e 6365 2072 6575 7365 2070 726f 7465 once reuse prote │ │ │ │ │ -00004530: 6374 696f 6e29 0a0a 3c6c 693e 0a3c 6120 ction)..
  • .com │ │ │ │ │ -000045a0: 2f73 756e 2f63 7279 7074 6f2f 7072 6f76 /sun/crypto/prov │ │ │ │ │ -000045b0: 6964 6572 2f43 6970 6865 722f 4368 6143 ider/Cipher/ChaC │ │ │ │ │ -000045c0: 6861 3230 2f43 6861 4368 6132 3050 6f6c ha20/ChaCha20Pol │ │ │ │ │ -000045d0: 7931 3330 3550 6172 616d 5465 7374 2e6a y1305ParamTest.j │ │ │ │ │ -000045e0: 6176 613c 2f61 3e3a 2043 6861 4368 6132 ava: ChaCha2 │ │ │ │ │ -000045f0: 3020 4369 7068 6572 2049 6d70 6c65 6d65 0 Cipher Impleme │ │ │ │ │ -00004600: 6e74 6174 696f 6e20 2870 6172 616d 6574 ntation (paramet │ │ │ │ │ -00004610: 6572 7329 0a0a 3c6c 693e 0a3c 6120 6872 ers)..
  • . │ │ │ │ │ -00004670: 636f 6d2f 7375 6e2f 6372 7970 746f 2f70 com/sun/crypto/p │ │ │ │ │ -00004680: 726f 7669 6465 722f 4369 7068 6572 2f43 rovider/Cipher/C │ │ │ │ │ -00004690: 6861 4368 6132 302f 4f75 7470 7574 5369 haCha20/OutputSi │ │ │ │ │ -000046a0: 7a65 5465 7374 2e6a 6176 613c 2f61 3e3a zeTest.java: │ │ │ │ │ -000046b0: 2043 6861 4368 6132 302d 506f 6c79 3133 ChaCha20-Poly13 │ │ │ │ │ -000046c0: 3035 2054 4c53 2063 6970 6865 7220 7375 05 TLS cipher su │ │ │ │ │ -000046d0: 6974 6520 6465 6372 7970 7469 6f6e 2074 ite decryption t │ │ │ │ │ -000046e0: 6872 6f77 7320 5368 6f72 7442 7566 6665 hrows ShortBuffe │ │ │ │ │ -000046f0: 7245 7863 6570 7469 6f6e 0a0a 3c6c 693e rException..
  • │ │ │ │ │ -00004700: 0a3c 6120 6872 6566 3d22 2f74 6d70 2f6a .com/sun/c │ │ │ │ │ -00004770: 7279 7074 6f2f 7072 6f76 6964 6572 2f43 rypto/provider/C │ │ │ │ │ -00004780: 6970 6865 722f 4368 6143 6861 3230 2f75 ipher/ChaCha20/u │ │ │ │ │ -00004790: 6e69 7474 6573 742f 4368 6143 6861 3230 nittest/ChaCha20 │ │ │ │ │ -000047a0: 4369 7068 6572 556e 6974 5465 7374 2e6a CipherUnitTest.j │ │ │ │ │ -000047b0: 6176 613c 2f61 3e3a 2055 6e69 7420 7465 ava: Unit te │ │ │ │ │ -000047c0: 7374 2066 6f72 2063 6f6d 2e73 756e 2e63 st for com.sun.c │ │ │ │ │ -000047d0: 7279 7074 6f2e 7072 6f76 6964 6572 2e43 rypto.provider.C │ │ │ │ │ -000047e0: 6861 4368 6132 3043 6970 6865 722e 0a0a haCha20Cipher... │ │ │ │ │ -000047f0: 3c6c 693e 0a3c 6120 6872 6566 3d22 2f74
  • .com/sun/c │ │ │ │ │ -00004870: 7279 7074 6f2f 7072 6f76 6964 6572 2f43 rypto/provider/C │ │ │ │ │ -00004880: 6970 6865 722f 4368 6143 6861 3230 2f75 ipher/ChaCha20/u │ │ │ │ │ -00004890: 6e69 7474 6573 742f 4368 6143 6861 3230 nittest/ChaCha20 │ │ │ │ │ -000048a0: 506f 6c79 3133 3035 5061 7261 6d65 7465 Poly1305Paramete │ │ │ │ │ -000048b0: 7273 556e 6974 5465 7374 2e6a 6176 613c rsUnitTest.java< │ │ │ │ │ -000048c0: 2f61 3e3a 2055 6e69 7420 7465 7374 2066 /a>: Unit test f │ │ │ │ │ -000048d0: 6f72 2063 6f6d 2e73 756e 2e63 7279 7074 or com.sun.crypt │ │ │ │ │ -000048e0: 6f2e 7072 6f76 6964 6572 2e43 6861 4368 o.provider.ChaCh │ │ │ │ │ -000048f0: 6132 3050 6f6c 7931 3330 3550 6172 616d a20Poly1305Param │ │ │ │ │ -00004900: 6574 6572 732e 0a0a 3c6c 693e 0a3c 6120 eters...
  • .com/sun/c │ │ │ │ │ -00004980: 7279 7074 6f2f 7072 6f76 6964 6572 2f43 rypto/provider/C │ │ │ │ │ -00004990: 6970 6865 722f 4368 6143 6861 3230 2f75 ipher/ChaCha20/u │ │ │ │ │ -000049a0: 6e69 7474 6573 742f 506f 6c79 3133 3035 nittest/Poly1305 │ │ │ │ │ -000049b0: 556e 6974 5465 7374 4472 6976 6572 2e6a UnitTestDriver.j │ │ │ │ │ -000049c0: 6176 6123 6964 303c 2f61 3e3a 2055 6e69 ava#id0: Uni │ │ │ │ │ -000049d0: 7420 7465 7374 2066 6f72 2063 6f6d 2e73 t test for com.s │ │ │ │ │ -000049e0: 756e 2e63 7279 7074 6f2e 7072 6f76 6964 un.crypto.provid │ │ │ │ │ -000049f0: 6572 2e50 6f6c 7931 3330 352e 0a0a 3c6c er.Poly1305....com │ │ │ │ │ -00004a70: 2f73 756e 2f63 7279 7074 6f2f 7072 6f76 /sun/crypto/prov │ │ │ │ │ -00004a80: 6964 6572 2f43 6970 6865 722f 4368 6143 ider/Cipher/ChaC │ │ │ │ │ -00004a90: 6861 3230 2f75 6e69 7474 6573 742f 506f ha20/unittest/Po │ │ │ │ │ -00004aa0: 6c79 3133 3035 556e 6974 5465 7374 4472 ly1305UnitTestDr │ │ │ │ │ -00004ab0: 6976 6572 2e6a 6176 6123 6964 313c 2f61 iver.java#id1: Unit test for │ │ │ │ │ -00004ad0: 2063 6f6d 2e73 756e 2e63 7279 7074 6f2e com.sun.crypto. │ │ │ │ │ -00004ae0: 7072 6f76 6964 6572 2e50 6f6c 7931 3330 provider.Poly130 │ │ │ │ │ -00004af0: 352e 0a0a 3c6c 693e 0a3c 6120 6872 6566 5...
  • .com/sun/crypt │ │ │ │ │ -00004b70: 6f2f 7072 6f76 6964 6572 2f43 6970 6865 o/provider/Ciphe │ │ │ │ │ -00004b80: 722f 4368 6143 6861 3230 2f75 6e69 7474 r/ChaCha20/unitt │ │ │ │ │ -00004b90: 6573 742f 506f 6c79 3133 3035 556e 6974 est/Poly1305Unit │ │ │ │ │ -00004ba0: 5465 7374 4472 6976 6572 2e6a 6176 6123 TestDriver.java# │ │ │ │ │ -00004bb0: 6964 323c 2f61 3e3a 2055 6e69 7420 7465 id2: Unit te │ │ │ │ │ -00004bc0: 7374 2066 6f72 2063 6f6d 2e73 756e 2e63 st for com.sun.c │ │ │ │ │ -00004bd0: 7279 7074 6f2e 7072 6f76 6964 6572 2e50 rypto.provider.P │ │ │ │ │ -00004be0: 6f6c 7931 3330 352e 0a0a 3c6c 693e 0a3c oly1305...
  • .< │ │ │ │ │ -00004bf0: 6120 6872 6566 3d22 2f74 6d70 2f6a 646b a href="/tmp/jdk │ │ │ │ │ -00004c00: 2f4a 5477 6f72 6b2f 636f 6d2f 7375 6e2f /JTwork/com/sun/ │ │ │ │ │ -00004c10: 6372 7970 746f 2f70 726f 7669 6465 722f crypto/provider/ │ │ │ │ │ -00004c20: 4369 7068 6572 2f43 6861 4368 6132 302f Cipher/ChaCha20/ │ │ │ │ │ -00004c30: 756e 6974 7465 7374 2f50 6f6c 7931 3330 unittest/Poly130 │ │ │ │ │ -00004c40: 3555 6e69 7454 6573 7444 7269 7665 725f 5UnitTestDriver_ │ │ │ │ │ -00004c50: 6964 332e 6a74 7222 3e63 6f6d 2f73 756e id3.jtr">com/sun │ │ │ │ │ -00004c60: 2f63 7279 7074 6f2f 7072 6f76 6964 6572 /crypto/provider │ │ │ │ │ -00004c70: 2f43 6970 6865 722f 4368 6143 6861 3230 /Cipher/ChaCha20 │ │ │ │ │ -00004c80: 2f75 6e69 7474 6573 742f 506f 6c79 3133 /unittest/Poly13 │ │ │ │ │ -00004c90: 3035 556e 6974 5465 7374 4472 6976 6572 05UnitTestDriver │ │ │ │ │ -00004ca0: 2e6a 6176 6123 6964 333c 2f61 3e3a 2055 .java#id3: U │ │ │ │ │ -00004cb0: 6e69 7420 7465 7374 2066 6f72 2049 6e74 nit test for Int │ │ │ │ │ -00004cc0: 7269 6e73 6963 4361 6e64 6964 6174 6520 rinsicCandidate │ │ │ │ │ -00004cd0: 696e 2063 6f6d 2e73 756e 2e63 7279 7074 in com.sun.crypt │ │ │ │ │ -00004ce0: 6f2e 7072 6f76 6964 6572 2e50 6f6c 7931 o.provider.Poly1 │ │ │ │ │ -00004cf0: 3330 352e 0a0a 3c6c 693e 0a3c 6120 6872 305...
  • .com/sun/cry │ │ │ │ │ -00004d70: 7074 6f2f 7072 6f76 6964 6572 2f43 6970 pto/provider/Cip │ │ │ │ │ -00004d80: 6865 722f 4368 6143 6861 3230 2f75 6e69 her/ChaCha20/uni │ │ │ │ │ -00004d90: 7474 6573 742f 506f 6c79 3133 3035 556e ttest/Poly1305Un │ │ │ │ │ -00004da0: 6974 5465 7374 4472 6976 6572 2e6a 6176 itTestDriver.jav │ │ │ │ │ -00004db0: 6123 6964 343c 2f61 3e3a 2055 6e69 7420 a#id4: Unit │ │ │ │ │ -00004dc0: 7465 7374 2066 6f72 2049 6e74 7269 6e73 test for Intrins │ │ │ │ │ -00004dd0: 6963 4361 6e64 6964 6174 6520 696e 2063 icCandidate in c │ │ │ │ │ -00004de0: 6f6d 2e73 756e 2e63 7279 7074 6f2e 7072 om.sun.crypto.pr │ │ │ │ │ -00004df0: 6f76 6964 6572 2e50 6f6c 7931 3330 352e ovider.Poly1305. │ │ │ │ │ -00004e00: 0a0a 3c6c 693e 0a3c 6120 6872 6566 3d22 ..
  • .com/su │ │ │ │ │ -00004e60: 6e2f 6372 7970 746f 2f70 726f 7669 6465 n/crypto/provide │ │ │ │ │ -00004e70: 722f 4369 7068 6572 2f44 4553 2f44 4553 r/Cipher/DES/DES │ │ │ │ │ -00004e80: 4b65 7943 6c65 616e 7570 5465 7374 2e6a KeyCleanupTest.j │ │ │ │ │ -00004e90: 6176 613c 2f61 3e3a 2056 6572 6966 7920 ava: Verify │ │ │ │ │ -00004ea0: 7468 6174 206b 6579 2073 746f 7261 6765 that key storage │ │ │ │ │ -00004eb0: 2069 7320 636c 6561 7265 640a 0a3c 6c69 is cleared..
  • .com/sun/cryp │ │ │ │ │ -00004f20: 746f 2f70 726f 7669 6465 722f 4369 7068 to/provider/Ciph │ │ │ │ │ -00004f30: 6572 2f44 4553 2f44 4553 5365 6372 6574 er/DES/DESSecret │ │ │ │ │ -00004f40: 4b65 7953 7065 632e 6a61 7661 3c2f 613e KeySpec.java │ │ │ │ │ -00004f50: 3a20 4368 616e 6765 2053 6563 7265 744b : Change SecretK │ │ │ │ │ -00004f60: 6579 4661 6374 6f72 792e 6765 6e65 7261 eyFactory.genera │ │ │ │ │ -00004f70: 7465 5365 6372 6574 2074 6f20 616c 6c6f teSecret to allo │ │ │ │ │ -00004f80: 7720 5365 6372 6574 4b65 7953 7065 6320 w SecretKeySpec │ │ │ │ │ -00004f90: 746f 2062 6520 7061 7373 6564 2061 6e64 to be passed and │ │ │ │ │ -00004fa0: 2075 7365 6420 666f 7220 6372 6561 7469 used for creati │ │ │ │ │ -00004fb0: 6e67 2061 2044 4553 2061 6e64 2044 4553 ng a DES and DES │ │ │ │ │ -00004fc0: 6564 6520 6b65 7973 2e0a 0a3c 6c69 3e0a ede keys...
  • . │ │ │ │ │ -00004fd0: 3c61 2068 7265 663d 222f 746d 702f 6a64 com/ │ │ │ │ │ -00005020: 7375 6e2f 6372 7970 746f 2f70 726f 7669 sun/crypto/provi │ │ │ │ │ -00005030: 6465 722f 4369 7068 6572 2f44 4553 2f44 der/Cipher/DES/D │ │ │ │ │ -00005040: 6573 4150 4954 6573 742e 6a61 7661 3c2f esAPITest.java: DesAPITest.. │ │ │ │ │ -00005060: 3c6c 693e 0a3c 6120 6872 6566 3d22 2f74
  • .com/sun/c │ │ │ │ │ -000050c0: 7279 7074 6f2f 7072 6f76 6964 6572 2f43 rypto/provider/C │ │ │ │ │ -000050d0: 6970 6865 722f 4445 532f 446f 4669 6e61 ipher/DES/DoFina │ │ │ │ │ -000050e0: 6c52 6574 7572 6e4c 656e 2e6a 6176 613c lReturnLen.java< │ │ │ │ │ -000050f0: 2f61 3e3a 204d 616b 6573 2073 7572 6520 /a>: Makes sure │ │ │ │ │ -00005100: 7468 6174 2043 6970 6865 722e 646f 4669 that Cipher.doFi │ │ │ │ │ -00005110: 6e61 6c28 2920 7265 7475 726e 7320 7468 nal() returns th │ │ │ │ │ -00005120: 6520 7269 6768 7420 6e75 6d62 6572 206f e right number o │ │ │ │ │ -00005130: 6620 6279 7465 7320 7772 6974 7465 6e0a f bytes written. │ │ │ │ │ -00005140: 0a3c 6c69 3e0a 3c61 2068 7265 663d 222f .
  • . │ │ │ │ │ -00005190: 636f 6d2f 7375 6e2f 6372 7970 746f 2f70 com/sun/crypto/p │ │ │ │ │ -000051a0: 726f 7669 6465 722f 4369 7068 6572 2f44 rovider/Cipher/D │ │ │ │ │ -000051b0: 4553 2f46 6c75 7368 4275 672e 6a61 7661 ES/FlushBug.java │ │ │ │ │ -000051c0: 3c2f 613e 3a20 466c 7573 6842 7567 0a0a : FlushBug.. │ │ │ │ │ -000051d0: 3c6c 693e 0a3c 6120 6872 6566 3d22 2f74
  • .com/sun/crypto │ │ │ │ │ -00005230: 2f70 726f 7669 6465 722f 4369 7068 6572 /provider/Cipher │ │ │ │ │ -00005240: 2f44 4553 2f4b 6579 5772 6170 7069 6e67 /DES/KeyWrapping │ │ │ │ │ -00005250: 2e6a 6176 613c 2f61 3e3a 204b 6579 5772 .java: KeyWr │ │ │ │ │ -00005260: 6170 7069 6e67 0a0a 3c6c 693e 0a3c 6120 apping..
  • .com/su │ │ │ │ │ -000052c0: 6e2f 6372 7970 746f 2f70 726f 7669 6465 n/crypto/provide │ │ │ │ │ -000052d0: 722f 4369 7068 6572 2f44 4553 2f50 6164 r/Cipher/DES/Pad │ │ │ │ │ -000052e0: 6469 6e67 5465 7374 2e6a 6176 613c 2f61 dingTest.java: PaddingTest.. │ │ │ │ │ -00005300: 3c6c 693e 0a3c 6120 6872 6566 3d22 2f74
  • .com/sun/cr │ │ │ │ │ -00005360: 7970 746f 2f70 726f 7669 6465 722f 4369 ypto/provider/Ci │ │ │ │ │ -00005370: 7068 6572 2f44 4553 2f50 6572 666f 726d pher/DES/Perform │ │ │ │ │ -00005380: 616e 6365 5465 7374 2e6a 6176 613c 2f61 anceTest.java: This test che │ │ │ │ │ -000053a0: 636b 7320 7065 7266 6f72 6d61 6e63 6520 cks performance │ │ │ │ │ -000053b0: 6f66 2076 6172 696f 7573 2063 6970 6865 of various ciphe │ │ │ │ │ -000053c0: 7273 2e0a 0a3c 6c69 3e0a 3c61 2068 7265 rs...
  • .com/sun/cryp │ │ │ │ │ -00005420: 746f 2f70 726f 7669 6465 722f 4369 7068 to/provider/Ciph │ │ │ │ │ -00005430: 6572 2f44 4553 2f53 6561 6c74 6573 742e er/DES/Sealtest. │ │ │ │ │ -00005440: 6a61 7661 3c2f 613e 3a20 5365 616c 7465 java: Sealte │ │ │ │ │ -00005450: 7374 0a0a 3c6c 693e 0a3c 6120 6872 6566 st..
  • .com/sun/ │ │ │ │ │ -000054b0: 6372 7970 746f 2f70 726f 7669 6465 722f crypto/provider/ │ │ │ │ │ -000054c0: 4369 7068 6572 2f44 4553 2f54 6573 7443 Cipher/DES/TestC │ │ │ │ │ -000054d0: 6970 6865 7244 4553 2e6a 6176 613c 2f61 ipherDES.java: Test DES/DESe │ │ │ │ │ -000054f0: 6465 2063 6970 6865 7220 7769 7468 2064 de cipher with d │ │ │ │ │ -00005500: 6966 6665 7265 6e74 204d 4f44 4553 2061 ifferent MODES a │ │ │ │ │ -00005510: 6e64 2070 6164 6469 6e67 0a0a 3c6c 693e nd padding..
  • │ │ │ │ │ -00005520: 0a3c 6120 6872 6566 3d22 2f74 6d70 2f6a .com/sun/crypt │ │ │ │ │ -00005580: 6f2f 7072 6f76 6964 6572 2f43 6970 6865 o/provider/Ciphe │ │ │ │ │ -00005590: 722f 4445 532f 5465 7374 4369 7068 6572 r/DES/TestCipher │ │ │ │ │ -000055a0: 4445 5365 6465 2e6a 6176 613c 2f61 3e3a DESede.java: │ │ │ │ │ -000055b0: 2054 6573 7420 4445 532f 4445 5365 6465 Test DES/DESede │ │ │ │ │ -000055c0: 2063 6970 6865 7220 7769 7468 2064 6966 cipher with dif │ │ │ │ │ -000055d0: 6665 7265 6e74 204d 4f44 4553 2061 6e64 ferent MODES and │ │ │ │ │ -000055e0: 2070 6164 6469 6e67 0a0a 3c6c 693e 0a3c padding..
  • .< │ │ │ │ │ -000055f0: 6120 6872 6566 3d22 2f74 6d70 2f6a 646b a href="/tmp/jdk │ │ │ │ │ -00005600: 2f4a 5477 6f72 6b2f 636f 6d2f 7375 6e2f /JTwork/com/sun/ │ │ │ │ │ -00005610: 6372 7970 746f 2f70 726f 7669 6465 722f crypto/provider/ │ │ │ │ │ -00005620: 4369 7068 6572 2f44 4553 2f54 6578 7450 Cipher/DES/TextP │ │ │ │ │ -00005630: 4b43 5335 5061 6464 696e 6754 6573 742e KCS5PaddingTest. │ │ │ │ │ -00005640: 6a74 7222 3e63 6f6d 2f73 756e 2f63 7279 jtr">com/sun/cry │ │ │ │ │ -00005650: 7074 6f2f 7072 6f76 6964 6572 2f43 6970 pto/provider/Cip │ │ │ │ │ -00005660: 6865 722f 4445 532f 5465 7874 504b 4353 her/DES/TextPKCS │ │ │ │ │ -00005670: 3550 6164 6469 6e67 5465 7374 2e6a 6176 5PaddingTest.jav │ │ │ │ │ -00005680: 613c 2f61 3e3a 2054 6869 7320 7465 7374 a: This test │ │ │ │ │ -00005690: 2063 6865 636b 7320 626f 756e 6461 7279 checks boundary │ │ │ │ │ -000056a0: 2063 6f6e 6469 7469 6f6e 7320 666f 7220 conditions for │ │ │ │ │ -000056b0: 7465 7374 696e 6720 5368 6f72 7442 7566 testing ShortBuf │ │ │ │ │ -000056c0: 6665 7245 7863 6570 7469 6f6e 2e0a 0a3c ferException...< │ │ │ │ │ -000056d0: 6c69 3e0a 3c61 2068 7265 663d 222f 746d li>.com/sun/ │ │ │ │ │ -00005730: 6372 7970 746f 2f70 726f 7669 6465 722f crypto/provider/ │ │ │ │ │ -00005740: 4369 7068 6572 2f4a 4345 2f42 7567 732f Cipher/JCE/Bugs/ │ │ │ │ │ -00005750: 3436 3836 3633 322f 456d 7074 792e 6a61 4686632/Empty.ja │ │ │ │ │ -00005760: 7661 3c2f 613e 3a20 546f 2076 6572 6966 va: To verif │ │ │ │ │ -00005770: 7920 4369 7068 6572 2e69 6e69 7420 7769 y Cipher.init wi │ │ │ │ │ -00005780: 6c6c 2074 6872 6f77 2049 6e76 616c 6964 ll throw Invalid │ │ │ │ │ -00005790: 4b65 7945 7863 6570 7469 6f6e 2077 6974 KeyException wit │ │ │ │ │ -000057a0: 6820 4e6f 6e2d 656d 7074 7920 6d65 7373 h Non-empty mess │ │ │ │ │ -000057b0: 6167 6520 7768 656e 2063 7265 6174 6520 age when create │ │ │ │ │ -000057c0: 5365 6372 6574 4b65 7953 7065 6320 7769 SecretKeySpec wi │ │ │ │ │ -000057d0: 7468 2069 6e76 616c 6964 2044 4553 206b th invalid DES k │ │ │ │ │ -000057e0: 6579 0a0a 3c6c 693e 0a3c 6120 6872 6566 ey..
  • .com/su │ │ │ │ │ -00005840: 6e2f 6372 7970 746f 2f70 726f 7669 6465 n/crypto/provide │ │ │ │ │ -00005850: 722f 4369 7068 6572 2f4b 6579 5772 6170 r/Cipher/KeyWrap │ │ │ │ │ -00005860: 2f4e 4953 5457 7261 704b 4154 2e6a 6176 /NISTWrapKAT.jav │ │ │ │ │ -00005870: 613c 2f61 3e3a 2056 6572 6966 7920 7468 a: Verify th │ │ │ │ │ -00005880: 6174 2074 6865 2041 4553 2d4b 6579 2d57 at the AES-Key-W │ │ │ │ │ -00005890: 7261 7020 616e 6420 4145 532d 4b65 792d rap and AES-Key- │ │ │ │ │ -000058a0: 5772 6170 2d50 6164 2063 6970 6865 7273 Wrap-Pad ciphers │ │ │ │ │ -000058b0: 2077 6f72 6b20 6173 2065 7870 6563 7465 work as expecte │ │ │ │ │ -000058c0: 6420 7573 696e 6720 4e49 5354 2074 6573 d using NIST tes │ │ │ │ │ -000058d0: 7420 7665 6374 6f72 732e 0a0a 3c6c 693e t vectors...
  • │ │ │ │ │ -000058e0: 0a3c 6120 6872 6566 3d22 2f74 6d70 2f6a .c │ │ │ │ │ -00005940: 6f6d 2f73 756e 2f63 7279 7074 6f2f 7072 om/sun/crypto/pr │ │ │ │ │ -00005950: 6f76 6964 6572 2f43 6970 6865 722f 4b65 ovider/Cipher/Ke │ │ │ │ │ -00005960: 7957 7261 702f 5465 7374 4369 7068 6572 yWrap/TestCipher │ │ │ │ │ -00005970: 4b65 7957 7261 7070 6572 5465 7374 2e6a KeyWrapperTest.j │ │ │ │ │ -00005980: 6176 613c 2f61 3e3a 2054 6573 7473 2066 ava: Tests f │ │ │ │ │ -00005990: 6f72 206b 6579 2077 7261 7020 616e 6420 or key wrap and │ │ │ │ │ -000059a0: 756e 7772 6170 206f 7065 7261 7469 6f6e unwrap operation │ │ │ │ │ -000059b0: 730a 0a3c 6c69 3e0a 3c61 2068 7265 663d s..
  • .com/sun │ │ │ │ │ -00005a10: 2f63 7279 7074 6f2f 7072 6f76 6964 6572 /crypto/provider │ │ │ │ │ -00005a20: 2f43 6970 6865 722f 4b65 7957 7261 702f /Cipher/KeyWrap/ │ │ │ │ │ -00005a30: 5465 7374 4765 6e65 7261 6c2e 6a61 7661 TestGeneral.java │ │ │ │ │ -00005a40: 3c2f 613e 3a20 5665 7269 6679 2067 656e : Verify gen │ │ │ │ │ -00005a50: 6572 616c 2070 726f 7065 7274 6965 7320 eral properties │ │ │ │ │ -00005a60: 6f66 2074 6865 2041 4553 2f4b 572f 4e6f of the AES/KW/No │ │ │ │ │ -00005a70: 5061 6464 696e 672c 2041 4553 2f4b 572f Padding, AES/KW/ │ │ │ │ │ -00005a80: 504b 4353 3550 6164 6469 6e67 2c20 616e PKCS5Padding, an │ │ │ │ │ -00005a90: 6420 4145 532f 4b57 502f 4e6f 5061 6464 d AES/KWP/NoPadd │ │ │ │ │ -00005aa0: 696e 6720 696d 706c 7320 6f66 2053 756e ing impls of Sun │ │ │ │ │ -00005ab0: 4a43 4520 7072 6f76 6964 6572 2e0a 0a3c JCE provider...< │ │ │ │ │ -00005ac0: 6c69 3e0a 3c61 2068 7265 663d 222f 746d li>.com/su │ │ │ │ │ -00005b20: 6e2f 6372 7970 746f 2f70 726f 7669 6465 n/crypto/provide │ │ │ │ │ -00005b30: 722f 4369 7068 6572 2f4b 6579 5772 6170 r/Cipher/KeyWrap │ │ │ │ │ -00005b40: 2f54 6573 744b 6579 5369 7a65 4368 6563 /TestKeySizeChec │ │ │ │ │ -00005b50: 6b2e 6a61 7661 3c2f 613e 3a20 5665 7269 k.java: Veri │ │ │ │ │ -00005b60: 6679 2063 6970 6865 7220 6b65 7920 7369 fy cipher key si │ │ │ │ │ -00005b70: 7a65 2072 6573 7472 6963 7469 6f6e 2069 ze restriction i │ │ │ │ │ -00005b80: 7320 656e 666f 7263 6564 2070 726f 7065 s enforced prope │ │ │ │ │ -00005b90: 726c 7920 7769 7468 2049 4b45 0a0a 3c6c rly with IKE...com/sun/crypto │ │ │ │ │ -00005c00: 2f70 726f 7669 6465 722f 4369 7068 6572 /provider/Cipher │ │ │ │ │ -00005c10: 2f4b 6579 5772 6170 2f58 4d4c 456e 634b /KeyWrap/XMLEncK │ │ │ │ │ -00005c20: 4154 2e6a 6176 613c 2f61 3e3a 2056 6572 AT.java: Ver │ │ │ │ │ -00005c30: 6966 7920 7468 6174 2074 6865 2074 776f ify that the two │ │ │ │ │ -00005c40: 206b 6579 2077 7261 7020 6369 7068 6572 key wrap cipher │ │ │ │ │ -00005c50: 732c 2069 2e65 2e0a 0a3c 6c69 3e0a 3c61 s, i.e...
  • .c │ │ │ │ │ -00005cb0: 6f6d 2f73 756e 2f63 7279 7074 6f2f 7072 om/sun/crypto/pr │ │ │ │ │ -00005cc0: 6f76 6964 6572 2f43 6970 6865 722f 5042 ovider/Cipher/PB │ │ │ │ │ -00005cd0: 452f 4368 6563 6b50 4245 4b65 7953 697a E/CheckPBEKeySiz │ │ │ │ │ -00005ce0: 652e 6a61 7661 3c2f 613e 3a20 200a 0a3c e.java: ..< │ │ │ │ │ -00005cf0: 6c69 3e0a 3c61 2068 7265 663d 222f 746d li>.co │ │ │ │ │ -00005d50: 6d2f 7375 6e2f 6372 7970 746f 2f70 726f m/sun/crypto/pro │ │ │ │ │ -00005d60: 7669 6465 722f 4369 7068 6572 2f50 4245 vider/Cipher/PBE │ │ │ │ │ -00005d70: 2f44 6563 7279 7074 5769 7468 6f75 7450 /DecryptWithoutP │ │ │ │ │ -00005d80: 6172 616d 6574 6572 732e 6a61 7661 3c2f arameters.java: Ensure that │ │ │ │ │ -00005da0: 496e 7661 6c69 644b 6579 4578 6365 7074 InvalidKeyExcept │ │ │ │ │ -00005db0: 696f 6e20 6973 2074 6872 6f77 6e20 7768 ion is thrown wh │ │ │ │ │ -00005dc0: 656e 2064 6563 7279 7074 696e 6720 7769 en decrypting wi │ │ │ │ │ -00005dd0: 7468 6f75 7420 7061 7261 6d65 7465 7273 thout parameters │ │ │ │ │ -00005de0: 2061 7320 6a61 7661 646f 6320 6861 7320 as javadoc has │ │ │ │ │ -00005df0: 7374 6174 6564 2e0a 0a3c 6c69 3e0a 3c61 stated...
  • .co │ │ │ │ │ -00005e50: 6d2f 7375 6e2f 6372 7970 746f 2f70 726f m/sun/crypto/pro │ │ │ │ │ -00005e60: 7669 6465 722f 4369 7068 6572 2f50 4245 vider/Cipher/PBE │ │ │ │ │ -00005e70: 2f4e 6567 6174 6976 654c 656e 6774 682e /NegativeLength. │ │ │ │ │ -00005e80: 6a61 7661 3c2f 613e 3a20 496e 636f 7272 java: Incorr │ │ │ │ │ -00005e90: 6563 7420 636f 6e64 6974 696f 6e20 6368 ect condition ch │ │ │ │ │ -00005ea0: 6563 6b20 696e 2050 424b 4446 324b 6579 eck in PBKDF2Key │ │ │ │ │ -00005eb0: 496d 706c 2e6a 6176 610a 0a3c 6c69 3e0a Impl.java..
  • . │ │ │ │ │ -00005ec0: 3c61 2068 7265 663d 222f 746d 702f 6a64 com/sun/cr │ │ │ │ │ -00005f20: 7970 746f 2f70 726f 7669 6465 722f 4369 ypto/provider/Ci │ │ │ │ │ -00005f30: 7068 6572 2f50 4245 2f50 4245 496e 7661 pher/PBE/PBEInva │ │ │ │ │ -00005f40: 6c69 6450 6172 616d 7354 6573 742e 6a61 lidParamsTest.ja │ │ │ │ │ -00005f50: 7661 3c2f 613e 3a20 456e 7375 7265 2074 va: Ensure t │ │ │ │ │ -00005f60: 6861 7420 496e 7661 6c69 6441 6c67 6f72 hat InvalidAlgor │ │ │ │ │ -00005f70: 6974 686d 5061 7261 6d65 7465 7245 7863 ithmParameterExc │ │ │ │ │ -00005f80: 6570 7469 6f6e 2069 7320 7468 726f 776e eption is thrown │ │ │ │ │ -00005f90: 2061 7320 6a61 7661 646f 6320 7370 6563 as javadoc spec │ │ │ │ │ -00005fa0: 6966 6965 6420 7768 656e 2070 6172 616d ified when param │ │ │ │ │ -00005fb0: 6574 6572 7320 6f66 2074 6865 2077 726f eters of the wro │ │ │ │ │ -00005fc0: 6e67 2074 7970 6520 6172 6520 7573 6564 ng type are used │ │ │ │ │ -00005fd0: 2e0a 0a3c 6c69 3e0a 3c61 2068 7265 663d ...
  • .com/s │ │ │ │ │ -00006030: 756e 2f63 7279 7074 6f2f 7072 6f76 6964 un/crypto/provid │ │ │ │ │ -00006040: 6572 2f43 6970 6865 722f 5042 452f 5042 er/Cipher/PBE/PB │ │ │ │ │ -00006050: 454b 6579 436c 6561 6e75 7054 6573 742e EKeyCleanupTest. │ │ │ │ │ -00006060: 6a61 7661 3c2f 613e 3a20 5665 7269 6679 java: Verify │ │ │ │ │ -00006070: 2074 6861 7420 6b65 7920 7374 6f72 6167 that key storag │ │ │ │ │ -00006080: 6520 6973 2063 6c65 6172 6564 0a0a 3c6c e is cleared...c │ │ │ │ │ -000060e0: 6f6d 2f73 756e 2f63 7279 7074 6f2f 7072 om/sun/crypto/pr │ │ │ │ │ -000060f0: 6f76 6964 6572 2f43 6970 6865 722f 5042 ovider/Cipher/PB │ │ │ │ │ -00006100: 452f 5042 454b 6579 5465 7374 2e6a 6176 E/PBEKeyTest.jav │ │ │ │ │ -00006110: 613c 2f61 3e3a 2074 6573 7420 5042 454b a: test PBEK │ │ │ │ │ -00006120: 6579 0a0a 3c6c 693e 0a3c 6120 6872 6566 ey..
  • . │ │ │ │ │ -00006180: 636f 6d2f 7375 6e2f 6372 7970 746f 2f70 com/sun/crypto/p │ │ │ │ │ -00006190: 726f 7669 6465 722f 4369 7068 6572 2f50 rovider/Cipher/P │ │ │ │ │ -000061a0: 4245 2f50 4245 4b65 7973 416c 676f 7269 BE/PBEKeysAlgori │ │ │ │ │ -000061b0: 7468 6d4e 616d 6573 2e6a 6176 613c 2f61 thmNames.java: JCE Reference │ │ │ │ │ -000061d0: 2047 7569 6465 2068 6173 2072 6563 6f6d Guide has recom │ │ │ │ │ -000061e0: 6d65 6e64 6174 696f 6e73 2c20 6e6f 7420 mendations, not │ │ │ │ │ -000061f0: 7265 7175 6972 656d 656e 7473 2c20 666f requirements, fo │ │ │ │ │ -00006200: 7220 616c 676f 7269 7468 6d20 6e61 6d65 r algorithm name │ │ │ │ │ -00006210: 730a 0a3c 6c69 3e0a 3c61 2068 7265 663d s..
  • .com/s │ │ │ │ │ -00006270: 756e 2f63 7279 7074 6f2f 7072 6f76 6964 un/crypto/provid │ │ │ │ │ -00006280: 6572 2f43 6970 6865 722f 5042 452f 5042 er/Cipher/PBE/PB │ │ │ │ │ -00006290: 4550 6172 616d 6574 6572 7354 6573 742e EParametersTest. │ │ │ │ │ -000062a0: 6a61 7661 3c2f 613e 3a20 656e 7375 7265 java: ensure │ │ │ │ │ -000062b0: 2074 6861 7420 7468 6520 416c 676f 7269 that the Algori │ │ │ │ │ -000062c0: 7468 6d50 6172 616d 6574 6572 7320 6f62 thmParameters ob │ │ │ │ │ -000062d0: 6a65 6374 2072 6574 7572 6e65 6420 6279 ject returned by │ │ │ │ │ -000062e0: 2050 4245 2063 6970 6865 7273 2068 6176 PBE ciphers hav │ │ │ │ │ -000062f0: 6520 7468 6520 6d61 7463 6869 6e67 2061 e the matching a │ │ │ │ │ -00006300: 6c67 6f72 6974 686d 206e 616d 652e 0a0a lgorithm name... │ │ │ │ │ -00006310: 3c6c 693e 0a3c 6120 6872 6566 3d22 2f74
  • . │ │ │ │ │ -00006360: 636f 6d2f 7375 6e2f 6372 7970 746f 2f70 com/sun/crypto/p │ │ │ │ │ -00006370: 726f 7669 6465 722f 4369 7068 6572 2f50 rovider/Cipher/P │ │ │ │ │ -00006380: 4245 2f50 4245 5332 5465 7374 2e6a 6176 BE/PBES2Test.jav │ │ │ │ │ -00006390: 613c 2f61 3e3a 2050 4245 3a20 6e65 6564 a: PBE: need │ │ │ │ │ -000063a0: 206e 6577 2061 6c67 6f72 6974 686d 2073 new algorithm s │ │ │ │ │ -000063b0: 7570 706f 7274 2069 6e20 7061 7373 776f upport in passwo │ │ │ │ │ -000063c0: 7264 2062 6173 6564 2065 6e63 7279 7074 rd based encrypt │ │ │ │ │ -000063d0: 696f 6e0a 0a3c 6c69 3e0a 3c61 2068 7265 ion..
  • .com/sun/c │ │ │ │ │ -00006440: 7279 7074 6f2f 7072 6f76 6964 6572 2f43 rypto/provider/C │ │ │ │ │ -00006450: 6970 6865 722f 5042 452f 5042 4553 616d ipher/PBE/PBESam │ │ │ │ │ -00006460: 6542 7566 6665 722f 5042 4553 616d 6542 eBuffer/PBESameB │ │ │ │ │ -00006470: 7566 6665 722e 6a61 7661 3c2f 613e 3a20 uffer.java: │ │ │ │ │ -00006480: 5665 7269 6679 2074 6861 7420 7361 6d65 Verify that same │ │ │ │ │ -00006490: 2065 6e63 7279 7074 2f64 6563 7279 7074 encrypt/decrypt │ │ │ │ │ -000064a0: 2062 7566 6665 7220 6361 6e20 6265 2075 buffer can be u │ │ │ │ │ -000064b0: 7365 6420 666f 7220 5042 4520 6369 7068 sed for PBE ciph │ │ │ │ │ -000064c0: 6572 730a 0a3c 6c69 3e0a 3c61 2068 7265 ers..
  • .com/s │ │ │ │ │ -00006520: 756e 2f63 7279 7074 6f2f 7072 6f76 6964 un/crypto/provid │ │ │ │ │ -00006530: 6572 2f43 6970 6865 722f 5042 452f 5042 er/Cipher/PBE/PB │ │ │ │ │ -00006540: 4553 6561 6c65 644f 626a 6563 742e 6a61 ESealedObject.ja │ │ │ │ │ -00006550: 7661 3c2f 613e 3a20 7465 7374 2069 6620 va: test if │ │ │ │ │ -00006560: 7365 616c 2f75 6e73 6561 6c20 776f 726b seal/unseal work │ │ │ │ │ -00006570: 7320 636f 7272 6563 746c 7920 7769 7468 s correctly with │ │ │ │ │ -00006580: 2050 4245 2061 6c67 6f72 6974 686d 730a PBE algorithms. │ │ │ │ │ -00006590: 0a3c 6c69 3e0a 3c61 2068 7265 663d 222f .
  • .com/sun/c │ │ │ │ │ -000065f0: 7279 7074 6f2f 7072 6f76 6964 6572 2f43 rypto/provider/C │ │ │ │ │ -00006600: 6970 6865 722f 5042 452f 5042 4b44 4632 ipher/PBE/PBKDF2 │ │ │ │ │ -00006610: 5472 616e 736c 6174 652e 6a61 7661 3c2f Translate.java: Verify if th │ │ │ │ │ -00006630: 6520 5365 6372 6574 4b65 7946 6163 746f e SecretKeyFacto │ │ │ │ │ -00006640: 7279 2e74 7261 6e73 6c61 7465 4b65 7928 ry.translateKey( │ │ │ │ │ -00006650: 2920 6d65 7468 6f64 2077 6f72 6b73 0a0a ) method works.. │ │ │ │ │ -00006660: 3c6c 693e 0a3c 6120 6872 6566 3d22 2f74
  • .com/sun/crypto │ │ │ │ │ +00000f80: 4874 7470 436c 6965 6e74 2d32 2d53 656c HttpClient-2-Sel │ │ │ │ │ +00000f90: 6563 746f 724d 616e 6167 6572 5d20 5b31 ectorManager] [1 │ │ │ │ │ +00000fa0: 3673 2036 3239 6d73 5d20 5365 6c65 6374 6s 629ms] Select │ │ │ │ │ +00000fb0: 6f72 4174 7461 6368 6d65 6e74 206b 6579 orAttachment key │ │ │ │ │ +00000fc0: 2063 616e 6365 6c6c 6564 2066 6f72 206a cancelled for j │ │ │ │ │ +00000fd0: 6176 612e 6e69 6f2e 6368 616e 6e65 6c73 ava.nio.channels │ │ │ │ │ +00000fe0: 2e53 6f63 6b65 7443 6861 6e6e 656c 5b63 .SocketChannel[c │ │ │ │ │ +00000ff0: 6c6f 7365 645d 3c2f 6834 3e0a 0a3c 756c losed]....DEBUG: [HttpCl │ │ │ │ │ +000010a0: 6965 6e74 2d34 362d 576f 726b 6572 2d30 ient-46-Worker-0 │ │ │ │ │ +000010b0: 5d20 5b33 7320 3733 316d 735d 2050 6c61 ] [3s 731ms] Pla │ │ │ │ │ +000010c0: 696e 4874 7470 436f 6e6e 6563 7469 6f6e inHttpConnection │ │ │ │ │ +000010d0: 2853 6f63 6b65 7454 7562 6528 3436 2929 (SocketTube(46)) │ │ │ │ │ +000010e0: 2043 6c6f 7369 6e67 2063 6861 6e6e 656c Closing channel │ │ │ │ │ +000010f0: 3a20 6368 616e 6e65 6c20 7265 6769 7374 : channel regist │ │ │ │ │ +00001100: 6572 6564 2077 6974 6820 7365 6c65 6374 ered with select │ │ │ │ │ +00001110: 6f72 2c20 6b65 792e 696e 7465 7265 7374 or, key.interest │ │ │ │ │ +00001120: 4f70 733d 302c 2073 612e 696e 7465 7265 Ops=0, sa.intere │ │ │ │ │ +00001130: 7374 4f70 733d 303c 2f68 343e 0a0a 3c75 stOps=0...
  • .j │ │ │ │ │ +00001190: 6176 612f 6e65 742f 6874 7470 636c 6965 ava/net/httpclie │ │ │ │ │ +000011a0: 6e74 2f68 7474 7032 2f42 6164 4865 6164 nt/http2/BadHead │ │ │ │ │ +000011b0: 6572 7354 6573 742e 6a61 7661 3c2f 613e ersTest.java │ │ │ │ │ +000011c0: 3a20 200a 3c2f 756c 3e0a 0a3c 6834 3e45 : ...

    E │ │ │ │ │ +000011d0: 7865 6375 7469 6f6e 2066 6169 6c65 6420 xecution failed │ │ │ │ │ +000011e0: 6173 2065 7870 6563 7465 643c 2f68 343e as expected

    │ │ │ │ │ +000011f0: 0a0a 3c75 6c3e 0a3c 6c69 3e0a 3c61 2068 .. │ │ │ │ │ +000018c0: 0a0a 3c68 343e 4578 6563 7574 696f 6e20 ..

    Execution │ │ │ │ │ +000018d0: 7375 6363 6573 7366 756c 3c2f 6834 3e0a successful

    . │ │ │ │ │ +000018e0: 0a3c 756c 3e0a 3c6c 693e 0a3c 6120 6872 .