--- /srv/rebuilderd/tmp/rebuilderddSnk47/inputs/openjdk-21-jdk_21.0.13+9-1_arm64.deb +++ /srv/rebuilderd/tmp/rebuilderddSnk47/out/openjdk-21-jdk_21.0.13+9-1_arm64.deb ├── file list │ @@ -1,3 +1,3 @@ │ -rw-r--r-- 0 0 0 4 2026-10-22 01:19:01.000000 debian-binary │ --rw-r--r-- 0 0 0 1840 2026-10-22 01:19:01.000000 control.tar.xz │ --rw-r--r-- 0 0 0 3589192 2026-10-22 01:19:01.000000 data.tar.xz │ +-rw-r--r-- 0 0 0 1836 2026-10-22 01:19:01.000000 control.tar.xz │ +-rw-r--r-- 0 0 0 3568052 2026-10-22 01:19:01.000000 data.tar.xz ├── control.tar.xz │ ├── control.tar │ │ ├── ./control │ │ │ @@ -1,13 +1,13 @@ │ │ │ Package: openjdk-21-jdk │ │ │ Source: openjdk-21 │ │ │ Version: 21.0.13+9-1 │ │ │ Architecture: arm64 │ │ │ Maintainer: OpenJDK Team │ │ │ -Installed-Size: 3778 │ │ │ +Installed-Size: 3790 │ │ │ Depends: openjdk-21-jre (= 21.0.13+9-1), openjdk-21-jdk-headless (= 21.0.13+9-1), libc6 (>= 2.34), zlib1g (>= 1:1.1.4) │ │ │ Recommends: libxt-dev │ │ │ Suggests: openjdk-21-demo, openjdk-21-source, visualvm │ │ │ Provides: java-compiler, java-sdk (= 21), java10-sdk, java11-sdk, java12-sdk, java13-sdk, java14-sdk, java15-sdk, java16-sdk, java17-sdk, java18-sdk, java19-sdk, java2-sdk, java20-sdk, java21-sdk, java5-sdk, java6-sdk, java7-sdk, java8-sdk, java9-sdk │ │ │ Section: java │ │ │ Priority: optional │ │ │ Multi-Arch: same │ │ ├── ./md5sums │ │ │ ├── ./md5sums │ │ │ │┄ Files differ ├── data.tar.xz │ ├── data.tar │ │ ├── file list │ │ │ @@ -17,13 +17,13 @@ │ │ │ drwxr-xr-x 0 root (0) root (0) 0 2026-10-22 01:19:01.000000 ./usr/share/doc/ │ │ │ drwxr-xr-x 0 root (0) root (0) 0 2026-10-22 01:19:01.000000 ./usr/share/doc/openjdk-21-jre-headless/ │ │ │ drwxr-xr-x 0 root (0) root (0) 0 2026-10-22 01:19:01.000000 ./usr/share/doc/openjdk-21-jre-headless/test-arm64/ │ │ │ -rw-r--r-- 0 root (0) root (0) 28695 2026-10-22 01:19:01.000000 ./usr/share/doc/openjdk-21-jre-headless/test-arm64/check-hotspot-hotspot.log.gz │ │ │ -rw-r--r-- 0 root (0) root (0) 3919 2026-10-22 01:19:01.000000 ./usr/share/doc/openjdk-21-jre-headless/test-arm64/check-jaxp-hotspot.log.gz │ │ │ -rw-r--r-- 0 root (0) root (0) 55751 2026-10-22 01:19:01.000000 ./usr/share/doc/openjdk-21-jre-headless/test-arm64/check-jdk-hotspot.log.gz │ │ │ -rw-r--r-- 0 root (0) root (0) 35242 2026-10-22 01:19:01.000000 ./usr/share/doc/openjdk-21-jre-headless/test-arm64/check-langtools-hotspot.log.gz │ │ │ --rw-r--r-- 0 root (0) root (0) 8548 2026-10-22 01:19:01.000000 ./usr/share/doc/openjdk-21-jre-headless/test-arm64/failed_tests-hotspot.tar.gz │ │ │ +-rw-r--r-- 0 root (0) root (0) 8582 2026-10-22 01:19:01.000000 ./usr/share/doc/openjdk-21-jre-headless/test-arm64/failed_tests-hotspot.tar.gz │ │ │ -rw-r--r-- 0 root (0) root (0) 3397 2026-10-22 01:19:01.000000 ./usr/share/doc/openjdk-21-jre-headless/test-arm64/jtreg-summary-hotspot.log │ │ │ --rw-r--r-- 0 root (0) root (0) 127870 2026-10-22 01:19:01.000000 ./usr/share/doc/openjdk-21-jre-headless/test-arm64/jtreg_output-hotspot.log.gz │ │ │ --rw-r--r-- 0 root (0) root (0) 3493287 2026-10-22 01:19:01.000000 ./usr/share/doc/openjdk-21-jre-headless/test-arm64/jtreport-hotspot.tar.gz │ │ │ +-rw-r--r-- 0 root (0) root (0) 127911 2026-10-22 01:19:01.000000 ./usr/share/doc/openjdk-21-jre-headless/test-arm64/jtreg_output-hotspot.log.gz │ │ │ +-rw-r--r-- 0 root (0) root (0) 3506020 2026-10-22 01:19:01.000000 ./usr/share/doc/openjdk-21-jre-headless/test-arm64/jtreport-hotspot.tar.gz │ │ │ lrwxrwxrwx 0 root (0) root (0) 0 2026-10-22 01:19:01.000000 ./usr/lib/jvm/openjdk-21/src.zip -> lib/src.zip │ │ │ lrwxrwxrwx 0 root (0) root (0) 0 2026-10-22 01:19:01.000000 ./usr/share/doc/openjdk-21-jdk -> openjdk-21-jre │ │ ├── ./usr/share/doc/openjdk-21-jre-headless/test-arm64/failed_tests-hotspot.tar.gz │ │ │ ├── failed_tests-hotspot.tar │ │ │ │ ├── file list │ │ │ │ │ @@ -1,9 +1,9 @@ │ │ │ │ │ --rw-r--r-- 0 sbuild (999) sbuild (999) 6775 2026-10-22 12:30:14.000000 jtreg-test-output/jdk/JTwork/java/net/MulticastSocket/B6427403.jtr │ │ │ │ │ --rw-r--r-- 0 sbuild (999) sbuild (999) 7796 2026-10-22 12:30:14.000000 jtreg-test-output/jdk/JTwork/java/net/MulticastSocket/NoLoopbackPackets.jtr │ │ │ │ │ --rw-r--r-- 0 sbuild (999) sbuild (999) 7800 2026-10-22 12:30:14.000000 jtreg-test-output/jdk/JTwork/java/net/MulticastSocket/Promiscuous.jtr │ │ │ │ │ --rw-r--r-- 0 sbuild (999) sbuild (999) 8419 2026-10-22 12:30:14.000000 jtreg-test-output/jdk/JTwork/java/net/MulticastSocket/SetLoopbackMode.jtr │ │ │ │ │ --rw-r--r-- 0 sbuild (999) sbuild (999) 8833 2026-10-22 12:30:14.000000 jtreg-test-output/jdk/JTwork/java/net/MulticastSocket/SetLoopbackModeIPv4.jtr │ │ │ │ │ --rw-r--r-- 0 sbuild (999) sbuild (999) 9692 2026-10-22 12:30:14.000000 jtreg-test-output/jdk/JTwork/java/net/MulticastSocket/Test.jtr │ │ │ │ │ --rw-r--r-- 0 sbuild (999) sbuild (999) 7441 2026-10-22 12:30:15.000000 jtreg-test-output/jdk/JTwork/java/net/SocketOption/OptionsTest.jtr │ │ │ │ │ --rw-r--r-- 0 sbuild (999) sbuild (999) 15124 2026-10-22 12:30:16.000000 jtreg-test-output/jdk/JTwork/java/net/SocketPermission/SocketPermissionTest.jtr │ │ │ │ │ --rw-r--r-- 0 sbuild (999) sbuild (999) 25681 2026-10-22 12:30:18.000000 jtreg-test-output/jdk/JTwork/sun/security/krb5/auto/Addresses.jtr │ │ │ │ │ +-rw-r--r-- 0 sbuild (999) sbuild (999) 6794 2026-10-30 04:03:37.000000 jtreg-test-output/jdk/JTwork/java/net/MulticastSocket/B6427403.jtr │ │ │ │ │ +-rw-r--r-- 0 sbuild (999) sbuild (999) 7813 2026-10-30 04:03:37.000000 jtreg-test-output/jdk/JTwork/java/net/MulticastSocket/NoLoopbackPackets.jtr │ │ │ │ │ +-rw-r--r-- 0 sbuild (999) sbuild (999) 7817 2026-10-30 04:03:37.000000 jtreg-test-output/jdk/JTwork/java/net/MulticastSocket/Promiscuous.jtr │ │ │ │ │ +-rw-r--r-- 0 sbuild (999) sbuild (999) 8436 2026-10-30 04:03:38.000000 jtreg-test-output/jdk/JTwork/java/net/MulticastSocket/SetLoopbackMode.jtr │ │ │ │ │ +-rw-r--r-- 0 sbuild (999) sbuild (999) 8853 2026-10-30 04:03:38.000000 jtreg-test-output/jdk/JTwork/java/net/MulticastSocket/SetLoopbackModeIPv4.jtr │ │ │ │ │ +-rw-r--r-- 0 sbuild (999) sbuild (999) 9709 2026-10-30 04:03:38.000000 jtreg-test-output/jdk/JTwork/java/net/MulticastSocket/Test.jtr │ │ │ │ │ +-rw-r--r-- 0 sbuild (999) sbuild (999) 7460 2026-10-30 04:03:38.000000 jtreg-test-output/jdk/JTwork/java/net/SocketOption/OptionsTest.jtr │ │ │ │ │ +-rw-r--r-- 0 sbuild (999) sbuild (999) 15144 2026-10-30 04:03:39.000000 jtreg-test-output/jdk/JTwork/java/net/SocketPermission/SocketPermissionTest.jtr │ │ │ │ │ +-rw-r--r-- 0 sbuild (999) sbuild (999) 25700 2026-10-30 04:03:42.000000 jtreg-test-output/jdk/JTwork/sun/security/krb5/auto/Addresses.jtr │ │ │ │ ├── jtreg-test-output/jdk/JTwork/java/net/MulticastSocket/B6427403.jtr │ │ │ │ │ @@ -1,70 +1,70 @@ │ │ │ │ │ #Test Results (version 2) │ │ │ │ │ -#Thu Oct 22 12:30:14 UTC 2026 │ │ │ │ │ +#Fri Oct 30 04:03:37 UTC 2026 │ │ │ │ │ #-----testdescription----- │ │ │ │ │ $file=/build/reproducible-path/openjdk-21-21.0.13+9/test/jdk/java/net/MulticastSocket/B6427403.java │ │ │ │ │ $root=/build/reproducible-path/openjdk-21-21.0.13+9/test/jdk │ │ │ │ │ keywords=bug6427403 │ │ │ │ │ run=USER_SPECIFIED main B6427403\n │ │ │ │ │ source=B6427403.java │ │ │ │ │ title=java.net.MulticastSocket.joinGroup() reports 'socket closed' │ │ │ │ │ │ │ │ │ │ #-----environment----- │ │ │ │ │ │ │ │ │ │ #-----testresult----- │ │ │ │ │ description=file\:/build/reproducible-path/openjdk-21-21.0.13+9/test/jdk/java/net/MulticastSocket/B6427403.java │ │ │ │ │ -elapsed=694 0\:00\:00.694 │ │ │ │ │ -end=Thu Oct 22 12\:30\:14 UTC 2026 │ │ │ │ │ +elapsed=727 0\:00\:00.727 │ │ │ │ │ +end=Fri Oct 30 04\:03\:37 UTC 2026 │ │ │ │ │ environment=regtest │ │ │ │ │ execStatus=Failed. Execution failed\: `main' threw exception\: java.net.SocketException\: No such device (setsockopt failed) │ │ │ │ │ harnessLoaderMode=Classpath Loader │ │ │ │ │ harnessVariety=Full Bundle │ │ │ │ │ hostname=sbuild │ │ │ │ │ -javatestOS=Linux 6.12.113+deb13-arm64 (aarch64) │ │ │ │ │ +javatestOS=Linux 6.12.113+deb13-cloud-arm64 (aarch64) │ │ │ │ │ javatestVersion=6.0-ea+b26-2026-03-18-${BUILT_FROM_COMMIT} │ │ │ │ │ jtregVersion=jtreg 8.3 src 1 │ │ │ │ │ script=com.sun.javatest.regtest.exec.RegressionScript │ │ │ │ │ sections=script_messages build main │ │ │ │ │ -start=Thu Oct 22 12\:30\:13 UTC 2026 │ │ │ │ │ +start=Fri Oct 30 04\:03\:36 UTC 2026 │ │ │ │ │ test=java/net/MulticastSocket/B6427403.java │ │ │ │ │ testJDK=/build/reproducible-path/openjdk-21-21.0.13+9/build/bootcycle-build/images/jdk │ │ │ │ │ -testJDK_OS=[name\:Linux,arch\:aarch64,version\:6.12.113+deb13-arm64,family\:linux,simple_arch\:aarch64,simple_version\:6.12,processors\:8,maxMemory\:25155866624,maxSwap\:182536105984] │ │ │ │ │ +testJDK_OS=[name\:Linux,arch\:aarch64,version\:6.12.113+deb13-cloud-arm64,family\:linux,simple_arch\:aarch64,simple_version\:6.12,processors\:12,maxMemory\:33596653568,maxSwap\:137438949376] │ │ │ │ │ testJDK_os.arch=aarch64 │ │ │ │ │ testJDK_os.name=Linux │ │ │ │ │ -testJDK_os.version=6.12.113+deb13-arm64 │ │ │ │ │ -totalTime=701 │ │ │ │ │ +testJDK_os.version=6.12.113+deb13-cloud-arm64 │ │ │ │ │ +totalTime=733 │ │ │ │ │ user.name=sbuild │ │ │ │ │ work=/tmp/jdk/JTwork/java/net/MulticastSocket │ │ │ │ │ │ │ │ │ │ #section:script_messages │ │ │ │ │ ----------messages:(4/260)---------- │ │ │ │ │ JDK under test: /build/reproducible-path/openjdk-21-21.0.13+9/build/bootcycle-build/images/jdk │ │ │ │ │ openjdk version "21.0.13" 2026-10-20 │ │ │ │ │ OpenJDK Runtime Environment (build 21.0.13+9-1-Debian) │ │ │ │ │ OpenJDK 64-Bit Server VM (build 21.0.13+9-1-Debian, mixed mode, sharing) │ │ │ │ │ │ │ │ │ │ #section:build │ │ │ │ │ ----------messages:(5/178)---------- │ │ │ │ │ command: build B6427403 │ │ │ │ │ reason: Named class compiled on demand │ │ │ │ │ -started: Thu Oct 22 12:30:13.478 UTC 2026 │ │ │ │ │ -finished: Thu Oct 22 12:30:13.509 UTC 2026 │ │ │ │ │ -elapsed time (seconds): 0.031 │ │ │ │ │ +started: Fri Oct 30 04:03:37.133 UTC 2026 │ │ │ │ │ +finished: Fri Oct 30 04:03:37.165 UTC 2026 │ │ │ │ │ +elapsed time (seconds): 0.032 │ │ │ │ │ result: Passed. All files up to date │ │ │ │ │ │ │ │ │ │ #section:main │ │ │ │ │ ----------messages:(8/234)---------- │ │ │ │ │ command: main B6427403 │ │ │ │ │ reason: User specified action: run main B6427403 │ │ │ │ │ -started: Thu Oct 22 12:30:13.513 UTC 2026 │ │ │ │ │ +started: Fri Oct 30 04:03:37.169 UTC 2026 │ │ │ │ │ Mode: agentvm │ │ │ │ │ Agent id: 1 │ │ │ │ │ -Process id: 3099630 │ │ │ │ │ -finished: Thu Oct 22 12:30:14.015 UTC 2026 │ │ │ │ │ -elapsed time (seconds): 0.502 │ │ │ │ │ +Process id: 2850347 │ │ │ │ │ +finished: Fri Oct 30 04:03:37.711 UTC 2026 │ │ │ │ │ +elapsed time (seconds): 0.542 │ │ │ │ │ ----------configuration:(15/666)---------- │ │ │ │ │ Boot Layer │ │ │ │ │ class path: /usr/share/jtreg/lib/javatest.jar │ │ │ │ │ /usr/share/jtreg/lib/jtreg.jar │ │ │ │ │ /usr/share/jtreg/lib/junit-platform-console-standalone.jar │ │ │ │ │ /usr/share/jtreg/lib/testng.jar │ │ │ │ │ /usr/share/jtreg/lib/guice.jar │ │ │ │ ├── jtreg-test-output/jdk/JTwork/java/net/MulticastSocket/NoLoopbackPackets.jtr │ │ │ │ │ @@ -1,75 +1,75 @@ │ │ │ │ │ #Test Results (version 2) │ │ │ │ │ -#Thu Oct 22 12:30:14 UTC 2026 │ │ │ │ │ +#Fri Oct 30 04:03:37 UTC 2026 │ │ │ │ │ #-----testdescription----- │ │ │ │ │ $file=/build/reproducible-path/openjdk-21-21.0.13+9/test/jdk/java/net/MulticastSocket/NoLoopbackPackets.java │ │ │ │ │ $root=/build/reproducible-path/openjdk-21-21.0.13+9/test/jdk │ │ │ │ │ keywords=bug4742177 │ │ │ │ │ library=/test/lib │ │ │ │ │ requires=os.family \!\= "windows" │ │ │ │ │ run=ASSUMED_ACTION main NoLoopbackPackets\n │ │ │ │ │ source=NoLoopbackPackets.java │ │ │ │ │ title=Re-test IPv6 (and specifically MulticastSocket) with latest Linux & USAGI code │ │ │ │ │ │ │ │ │ │ #-----environment----- │ │ │ │ │ │ │ │ │ │ #-----testresult----- │ │ │ │ │ description=file\:/build/reproducible-path/openjdk-21-21.0.13+9/test/jdk/java/net/MulticastSocket/NoLoopbackPackets.java │ │ │ │ │ -elapsed=106 0\:00\:00.106 │ │ │ │ │ -end=Thu Oct 22 12\:30\:14 UTC 2026 │ │ │ │ │ +elapsed=107 0\:00\:00.107 │ │ │ │ │ +end=Fri Oct 30 04\:03\:37 UTC 2026 │ │ │ │ │ environment=regtest │ │ │ │ │ execStatus=Failed. Execution failed\: `main' threw exception\: java.net.SocketException\: No such device (setsockopt failed) │ │ │ │ │ harnessLoaderMode=Classpath Loader │ │ │ │ │ harnessVariety=Full Bundle │ │ │ │ │ hostname=sbuild │ │ │ │ │ -javatestOS=Linux 6.12.113+deb13-arm64 (aarch64) │ │ │ │ │ +javatestOS=Linux 6.12.113+deb13-cloud-arm64 (aarch64) │ │ │ │ │ javatestVersion=6.0-ea+b26-2026-03-18-${BUILT_FROM_COMMIT} │ │ │ │ │ jtregVersion=jtreg 8.3 src 1 │ │ │ │ │ script=com.sun.javatest.regtest.exec.RegressionScript │ │ │ │ │ sections=script_messages build main │ │ │ │ │ -start=Thu Oct 22 12\:30\:14 UTC 2026 │ │ │ │ │ +start=Fri Oct 30 04\:03\:37 UTC 2026 │ │ │ │ │ test=java/net/MulticastSocket/NoLoopbackPackets.java │ │ │ │ │ testJDK=/build/reproducible-path/openjdk-21-21.0.13+9/build/bootcycle-build/images/jdk │ │ │ │ │ -testJDK_OS=[name\:Linux,arch\:aarch64,version\:6.12.113+deb13-arm64,family\:linux,simple_arch\:aarch64,simple_version\:6.12,processors\:8,maxMemory\:25155866624,maxSwap\:182536105984] │ │ │ │ │ +testJDK_OS=[name\:Linux,arch\:aarch64,version\:6.12.113+deb13-cloud-arm64,family\:linux,simple_arch\:aarch64,simple_version\:6.12,processors\:12,maxMemory\:33596653568,maxSwap\:137438949376] │ │ │ │ │ testJDK_os.arch=aarch64 │ │ │ │ │ testJDK_os.name=Linux │ │ │ │ │ -testJDK_os.version=6.12.113+deb13-arm64 │ │ │ │ │ -totalTime=108 │ │ │ │ │ +testJDK_os.version=6.12.113+deb13-cloud-arm64 │ │ │ │ │ +totalTime=109 │ │ │ │ │ user.name=sbuild │ │ │ │ │ work=/tmp/jdk/JTwork/java/net/MulticastSocket │ │ │ │ │ │ │ │ │ │ #section:script_messages │ │ │ │ │ ----------messages:(7/468)---------- │ │ │ │ │ JDK under test: /build/reproducible-path/openjdk-21-21.0.13+9/build/bootcycle-build/images/jdk │ │ │ │ │ openjdk version "21.0.13" 2026-10-20 │ │ │ │ │ OpenJDK Runtime Environment (build 21.0.13+9-1-Debian) │ │ │ │ │ OpenJDK 64-Bit Server VM (build 21.0.13+9-1-Debian, mixed mode, sharing) │ │ │ │ │ Library /test/lib; kind: packages │ │ │ │ │ source directory: /build/reproducible-path/openjdk-21-21.0.13+9/test/lib │ │ │ │ │ class directory: /tmp/jdk/JTwork/classes/java/net/MulticastSocket/NoLoopbackPackets.d/test/lib │ │ │ │ │ │ │ │ │ │ #section:build │ │ │ │ │ -----------messages:(5/187)---------- │ │ │ │ │ +----------messages:(5/185)---------- │ │ │ │ │ command: build NoLoopbackPackets │ │ │ │ │ reason: Named class compiled on demand │ │ │ │ │ -started: Thu Oct 22 12:30:14.035 UTC 2026 │ │ │ │ │ -finished: Thu Oct 22 12:30:14.036 UTC 2026 │ │ │ │ │ -elapsed time (seconds): 0.001 │ │ │ │ │ +started: Fri Oct 30 04:03:37.726 UTC 2026 │ │ │ │ │ +finished: Fri Oct 30 04:03:37.726 UTC 2026 │ │ │ │ │ +elapsed time (seconds): 0.0 │ │ │ │ │ result: Passed. All files up to date │ │ │ │ │ │ │ │ │ │ #section:main │ │ │ │ │ ----------messages:(8/264)---------- │ │ │ │ │ command: main NoLoopbackPackets │ │ │ │ │ reason: Assumed action based on file name: run main NoLoopbackPackets │ │ │ │ │ -started: Thu Oct 22 12:30:14.037 UTC 2026 │ │ │ │ │ +started: Fri Oct 30 04:03:37.726 UTC 2026 │ │ │ │ │ Mode: agentvm │ │ │ │ │ Agent id: 1 │ │ │ │ │ -Process id: 3099630 │ │ │ │ │ -finished: Thu Oct 22 12:30:14.136 UTC 2026 │ │ │ │ │ -elapsed time (seconds): 0.099 │ │ │ │ │ +Process id: 2850347 │ │ │ │ │ +finished: Fri Oct 30 04:03:37.828 UTC 2026 │ │ │ │ │ +elapsed time (seconds): 0.102 │ │ │ │ │ ----------configuration:(17/836)---------- │ │ │ │ │ Boot Layer │ │ │ │ │ class path: /usr/share/jtreg/lib/javatest.jar │ │ │ │ │ /usr/share/jtreg/lib/jtreg.jar │ │ │ │ │ /usr/share/jtreg/lib/junit-platform-console-standalone.jar │ │ │ │ │ /usr/share/jtreg/lib/testng.jar │ │ │ │ │ /usr/share/jtreg/lib/guice.jar │ │ │ │ │ @@ -113,15 +113,15 @@ │ │ │ │ │ -Dtest.class.path=/tmp/jdk/JTwork/classes/java/net/MulticastSocket/NoLoopbackPackets.d:/tmp/jdk/JTwork/classes/java/net/MulticastSocket/NoLoopbackPackets.d/test/lib \\ │ │ │ │ │ -Dtest.class.path.prefix=/tmp/jdk/JTwork/classes/java/net/MulticastSocket/NoLoopbackPackets.d:/build/reproducible-path/openjdk-21-21.0.13+9/test/jdk/java/net/MulticastSocket:/tmp/jdk/JTwork/classes/java/net/MulticastSocket/NoLoopbackPackets.d/test/lib \\ │ │ │ │ │ -classpath /tmp/jdk/JTwork/classes/java/net/MulticastSocket/NoLoopbackPackets.d:/build/reproducible-path/openjdk-21-21.0.13+9/test/jdk/java/net/MulticastSocket:/tmp/jdk/JTwork/classes/java/net/MulticastSocket/NoLoopbackPackets.d/test/lib:/build/reproducible-path/openjdk-21-21.0.13+9/test/lib:/usr/share/jtreg/lib/javatest.jar:/usr/share/jtreg/lib/jtreg.jar \\ │ │ │ │ │ NoLoopbackPackets │ │ │ │ │ ----------stdout:(0/0)---------- │ │ │ │ │ ----------stderr:(0/0)---------- │ │ │ │ │ ----------System.out:(1/32)---------- │ │ │ │ │ -joining group: /224.1.1.1:50870 │ │ │ │ │ +joining group: /224.1.1.1:52163 │ │ │ │ │ ----------System.err:(17/1050)---------- │ │ │ │ │ java.net.SocketException: No such device (setsockopt failed) │ │ │ │ │ at java.base/sun.nio.ch.Net.joinOrDrop4(Native Method) │ │ │ │ │ at java.base/sun.nio.ch.Net.join4(Net.java:720) │ │ │ │ │ at java.base/sun.nio.ch.DatagramChannelImpl.innerJoin(DatagramChannelImpl.java:1676) │ │ │ │ │ at java.base/sun.nio.ch.DatagramChannelImpl.join(DatagramChannelImpl.java:1694) │ │ │ │ │ at java.base/sun.nio.ch.DatagramSocketAdaptor.joinGroup(DatagramSocketAdaptor.java:494) │ │ │ │ ├── jtreg-test-output/jdk/JTwork/java/net/MulticastSocket/Promiscuous.jtr │ │ │ │ │ @@ -1,74 +1,74 @@ │ │ │ │ │ #Test Results (version 2) │ │ │ │ │ -#Thu Oct 22 12:30:14 UTC 2026 │ │ │ │ │ +#Fri Oct 30 04:03:37 UTC 2026 │ │ │ │ │ #-----testdescription----- │ │ │ │ │ $file=/build/reproducible-path/openjdk-21-21.0.13+9/test/jdk/java/net/MulticastSocket/Promiscuous.java │ │ │ │ │ $root=/build/reproducible-path/openjdk-21-21.0.13+9/test/jdk │ │ │ │ │ keywords=bug8014499 bug8219804 othervm │ │ │ │ │ library=/test/lib │ │ │ │ │ run=USER_SPECIFIED main Promiscuous\nUSER_SPECIFIED main/othervm -Djava.net.preferIPv4Stack\=true Promiscuous\n │ │ │ │ │ source=Promiscuous.java │ │ │ │ │ title=Test for interference when two sockets are bound to the same port but joined to different multicast groups │ │ │ │ │ │ │ │ │ │ #-----environment----- │ │ │ │ │ │ │ │ │ │ #-----testresult----- │ │ │ │ │ description=file\:/build/reproducible-path/openjdk-21-21.0.13+9/test/jdk/java/net/MulticastSocket/Promiscuous.java │ │ │ │ │ -elapsed=94 0\:00\:00.094 │ │ │ │ │ -end=Thu Oct 22 12\:30\:14 UTC 2026 │ │ │ │ │ +elapsed=96 0\:00\:00.096 │ │ │ │ │ +end=Fri Oct 30 04\:03\:37 UTC 2026 │ │ │ │ │ environment=regtest │ │ │ │ │ execStatus=Failed. Execution failed\: `main' threw exception\: java.net.SocketException\: Network is unreachable │ │ │ │ │ harnessLoaderMode=Classpath Loader │ │ │ │ │ harnessVariety=Full Bundle │ │ │ │ │ hostname=sbuild │ │ │ │ │ -javatestOS=Linux 6.12.113+deb13-arm64 (aarch64) │ │ │ │ │ +javatestOS=Linux 6.12.113+deb13-cloud-arm64 (aarch64) │ │ │ │ │ javatestVersion=6.0-ea+b26-2026-03-18-${BUILT_FROM_COMMIT} │ │ │ │ │ jtregVersion=jtreg 8.3 src 1 │ │ │ │ │ script=com.sun.javatest.regtest.exec.RegressionScript │ │ │ │ │ sections=script_messages build main │ │ │ │ │ -start=Thu Oct 22 12\:30\:14 UTC 2026 │ │ │ │ │ +start=Fri Oct 30 04\:03\:37 UTC 2026 │ │ │ │ │ test=java/net/MulticastSocket/Promiscuous.java │ │ │ │ │ testJDK=/build/reproducible-path/openjdk-21-21.0.13+9/build/bootcycle-build/images/jdk │ │ │ │ │ -testJDK_OS=[name\:Linux,arch\:aarch64,version\:6.12.113+deb13-arm64,family\:linux,simple_arch\:aarch64,simple_version\:6.12,processors\:8,maxMemory\:25155866624,maxSwap\:182536105984] │ │ │ │ │ +testJDK_OS=[name\:Linux,arch\:aarch64,version\:6.12.113+deb13-cloud-arm64,family\:linux,simple_arch\:aarch64,simple_version\:6.12,processors\:12,maxMemory\:33596653568,maxSwap\:137438949376] │ │ │ │ │ testJDK_os.arch=aarch64 │ │ │ │ │ testJDK_os.name=Linux │ │ │ │ │ -testJDK_os.version=6.12.113+deb13-arm64 │ │ │ │ │ -totalTime=96 │ │ │ │ │ +testJDK_os.version=6.12.113+deb13-cloud-arm64 │ │ │ │ │ +totalTime=98 │ │ │ │ │ user.name=sbuild │ │ │ │ │ work=/tmp/jdk/JTwork/java/net/MulticastSocket │ │ │ │ │ │ │ │ │ │ #section:script_messages │ │ │ │ │ ----------messages:(7/462)---------- │ │ │ │ │ JDK under test: /build/reproducible-path/openjdk-21-21.0.13+9/build/bootcycle-build/images/jdk │ │ │ │ │ openjdk version "21.0.13" 2026-10-20 │ │ │ │ │ OpenJDK Runtime Environment (build 21.0.13+9-1-Debian) │ │ │ │ │ OpenJDK 64-Bit Server VM (build 21.0.13+9-1-Debian, mixed mode, sharing) │ │ │ │ │ Library /test/lib; kind: packages │ │ │ │ │ source directory: /build/reproducible-path/openjdk-21-21.0.13+9/test/lib │ │ │ │ │ class directory: /tmp/jdk/JTwork/classes/java/net/MulticastSocket/Promiscuous.d/test/lib │ │ │ │ │ │ │ │ │ │ #section:build │ │ │ │ │ -----------messages:(5/181)---------- │ │ │ │ │ +----------messages:(5/179)---------- │ │ │ │ │ command: build Promiscuous │ │ │ │ │ reason: Named class compiled on demand │ │ │ │ │ -started: Thu Oct 22 12:30:14.147 UTC 2026 │ │ │ │ │ -finished: Thu Oct 22 12:30:14.148 UTC 2026 │ │ │ │ │ -elapsed time (seconds): 0.001 │ │ │ │ │ +started: Fri Oct 30 04:03:37.841 UTC 2026 │ │ │ │ │ +finished: Fri Oct 30 04:03:37.841 UTC 2026 │ │ │ │ │ +elapsed time (seconds): 0.0 │ │ │ │ │ result: Passed. All files up to date │ │ │ │ │ │ │ │ │ │ #section:main │ │ │ │ │ ----------messages:(8/240)---------- │ │ │ │ │ command: main Promiscuous │ │ │ │ │ reason: User specified action: run main Promiscuous │ │ │ │ │ -started: Thu Oct 22 12:30:14.148 UTC 2026 │ │ │ │ │ +started: Fri Oct 30 04:03:37.842 UTC 2026 │ │ │ │ │ Mode: agentvm │ │ │ │ │ Agent id: 1 │ │ │ │ │ -Process id: 3099630 │ │ │ │ │ -finished: Thu Oct 22 12:30:14.236 UTC 2026 │ │ │ │ │ -elapsed time (seconds): 0.088 │ │ │ │ │ +Process id: 2850347 │ │ │ │ │ +finished: Fri Oct 30 04:03:37.933 UTC 2026 │ │ │ │ │ +elapsed time (seconds): 0.091 │ │ │ │ │ ----------configuration:(17/824)---------- │ │ │ │ │ Boot Layer │ │ │ │ │ class path: /usr/share/jtreg/lib/javatest.jar │ │ │ │ │ /usr/share/jtreg/lib/jtreg.jar │ │ │ │ │ /usr/share/jtreg/lib/junit-platform-console-standalone.jar │ │ │ │ │ /usr/share/jtreg/lib/testng.jar │ │ │ │ │ /usr/share/jtreg/lib/guice.jar │ │ │ │ │ @@ -112,16 +112,16 @@ │ │ │ │ │ -Dtest.class.path=/tmp/jdk/JTwork/classes/java/net/MulticastSocket/Promiscuous.d:/tmp/jdk/JTwork/classes/java/net/MulticastSocket/Promiscuous.d/test/lib \\ │ │ │ │ │ -Dtest.class.path.prefix=/tmp/jdk/JTwork/classes/java/net/MulticastSocket/Promiscuous.d:/build/reproducible-path/openjdk-21-21.0.13+9/test/jdk/java/net/MulticastSocket:/tmp/jdk/JTwork/classes/java/net/MulticastSocket/Promiscuous.d/test/lib \\ │ │ │ │ │ -classpath /tmp/jdk/JTwork/classes/java/net/MulticastSocket/Promiscuous.d:/build/reproducible-path/openjdk-21-21.0.13+9/test/jdk/java/net/MulticastSocket:/tmp/jdk/JTwork/classes/java/net/MulticastSocket/Promiscuous.d/test/lib:/build/reproducible-path/openjdk-21-21.0.13+9/test/lib:/usr/share/jtreg/lib/javatest.jar:/usr/share/jtreg/lib/jtreg.jar \\ │ │ │ │ │ Promiscuous │ │ │ │ │ ----------stdout:(0/0)---------- │ │ │ │ │ ----------stderr:(0/0)---------- │ │ │ │ │ ----------System.out:(2/58)---------- │ │ │ │ │ -Using port: 50317 │ │ │ │ │ -Sending datagram to: /224.1.1.120/50317 │ │ │ │ │ +Using port: 53226 │ │ │ │ │ +Sending datagram to: /224.1.1.120/53226 │ │ │ │ │ ----------System.err:(18/1123)---------- │ │ │ │ │ java.net.SocketException: Network is unreachable │ │ │ │ │ at java.base/sun.nio.ch.DatagramChannelImpl.send0(Native Method) │ │ │ │ │ at java.base/sun.nio.ch.DatagramChannelImpl.sendFromNativeBuffer(DatagramChannelImpl.java:1005) │ │ │ │ │ at java.base/sun.nio.ch.DatagramChannelImpl.send(DatagramChannelImpl.java:966) │ │ │ │ │ at java.base/sun.nio.ch.DatagramChannelImpl.send(DatagramChannelImpl.java:889) │ │ │ │ │ at java.base/sun.nio.ch.DatagramChannelImpl.blockingSend(DatagramChannelImpl.java:952) │ │ │ │ ├── jtreg-test-output/jdk/JTwork/java/net/MulticastSocket/SetLoopbackMode.jtr │ │ │ │ │ @@ -1,44 +1,44 @@ │ │ │ │ │ #Test Results (version 2) │ │ │ │ │ -#Thu Oct 22 12:30:14 UTC 2026 │ │ │ │ │ +#Fri Oct 30 04:03:38 UTC 2026 │ │ │ │ │ #-----testdescription----- │ │ │ │ │ $file=/build/reproducible-path/openjdk-21-21.0.13+9/test/jdk/java/net/MulticastSocket/SetLoopbackMode.java │ │ │ │ │ $root=/build/reproducible-path/openjdk-21-21.0.13+9/test/jdk │ │ │ │ │ keywords=bug4686717 othervm │ │ │ │ │ library=/test/lib │ │ │ │ │ modules=java.base/java.net\:+open │ │ │ │ │ run=USER_SPECIFIED build jdk.test.lib.NetworkConfiguration jdk.test.lib.Platform\nUSER_SPECIFIED main/othervm SetLoopbackMode\n │ │ │ │ │ source=SetLoopbackMode.java │ │ │ │ │ title=Test MulticastSocket.setLoopbackMode │ │ │ │ │ │ │ │ │ │ #-----environment----- │ │ │ │ │ │ │ │ │ │ #-----testresult----- │ │ │ │ │ description=file\:/build/reproducible-path/openjdk-21-21.0.13+9/test/jdk/java/net/MulticastSocket/SetLoopbackMode.java │ │ │ │ │ -elapsed=246 0\:00\:00.246 │ │ │ │ │ -end=Thu Oct 22 12\:30\:14 UTC 2026 │ │ │ │ │ +elapsed=283 0\:00\:00.283 │ │ │ │ │ +end=Fri Oct 30 04\:03\:38 UTC 2026 │ │ │ │ │ environment=regtest │ │ │ │ │ execStatus=Failed. Execution failed\: `main' threw exception\: java.net.SocketException\: No such device (setsockopt failed) │ │ │ │ │ harnessLoaderMode=Classpath Loader │ │ │ │ │ harnessVariety=Full Bundle │ │ │ │ │ hostname=sbuild │ │ │ │ │ -javatestOS=Linux 6.12.113+deb13-arm64 (aarch64) │ │ │ │ │ +javatestOS=Linux 6.12.113+deb13-cloud-arm64 (aarch64) │ │ │ │ │ javatestVersion=6.0-ea+b26-2026-03-18-${BUILT_FROM_COMMIT} │ │ │ │ │ jtregVersion=jtreg 8.3 src 1 │ │ │ │ │ modules=java.base/java.net\:+open │ │ │ │ │ script=com.sun.javatest.regtest.exec.RegressionScript │ │ │ │ │ sections=script_messages build build main │ │ │ │ │ -start=Thu Oct 22 12\:30\:14 UTC 2026 │ │ │ │ │ +start=Fri Oct 30 04\:03\:37 UTC 2026 │ │ │ │ │ test=java/net/MulticastSocket/SetLoopbackMode.java │ │ │ │ │ testJDK=/build/reproducible-path/openjdk-21-21.0.13+9/build/bootcycle-build/images/jdk │ │ │ │ │ -testJDK_OS=[name\:Linux,arch\:aarch64,version\:6.12.113+deb13-arm64,family\:linux,simple_arch\:aarch64,simple_version\:6.12,processors\:8,maxMemory\:25155866624,maxSwap\:182536105984] │ │ │ │ │ +testJDK_OS=[name\:Linux,arch\:aarch64,version\:6.12.113+deb13-cloud-arm64,family\:linux,simple_arch\:aarch64,simple_version\:6.12,processors\:12,maxMemory\:33596653568,maxSwap\:137438949376] │ │ │ │ │ testJDK_os.arch=aarch64 │ │ │ │ │ testJDK_os.name=Linux │ │ │ │ │ -testJDK_os.version=6.12.113+deb13-arm64 │ │ │ │ │ -totalTime=248 │ │ │ │ │ +testJDK_os.version=6.12.113+deb13-cloud-arm64 │ │ │ │ │ +totalTime=285 │ │ │ │ │ user.name=sbuild │ │ │ │ │ work=/tmp/jdk/JTwork/java/net/MulticastSocket │ │ │ │ │ │ │ │ │ │ #section:script_messages │ │ │ │ │ ----------messages:(7/466)---------- │ │ │ │ │ JDK under test: /build/reproducible-path/openjdk-21-21.0.13+9/build/bootcycle-build/images/jdk │ │ │ │ │ openjdk version "21.0.13" 2026-10-20 │ │ │ │ │ @@ -48,38 +48,38 @@ │ │ │ │ │ source directory: /build/reproducible-path/openjdk-21-21.0.13+9/test/lib │ │ │ │ │ class directory: /tmp/jdk/JTwork/classes/java/net/MulticastSocket/SetLoopbackMode.d/test/lib │ │ │ │ │ │ │ │ │ │ #section:build │ │ │ │ │ ----------messages:(5/284)---------- │ │ │ │ │ command: build jdk.test.lib.NetworkConfiguration jdk.test.lib.Platform │ │ │ │ │ reason: User specified action: run build jdk.test.lib.NetworkConfiguration jdk.test.lib.Platform │ │ │ │ │ -started: Thu Oct 22 12:30:14.248 UTC 2026 │ │ │ │ │ -finished: Thu Oct 22 12:30:14.249 UTC 2026 │ │ │ │ │ +started: Fri Oct 30 04:03:37.945 UTC 2026 │ │ │ │ │ +finished: Fri Oct 30 04:03:37.946 UTC 2026 │ │ │ │ │ elapsed time (seconds): 0.001 │ │ │ │ │ result: Passed. All files up to date │ │ │ │ │ │ │ │ │ │ #section:build │ │ │ │ │ -----------messages:(5/185)---------- │ │ │ │ │ +----------messages:(5/183)---------- │ │ │ │ │ command: build SetLoopbackMode │ │ │ │ │ reason: Named class compiled on demand │ │ │ │ │ -started: Thu Oct 22 12:30:14.249 UTC 2026 │ │ │ │ │ -finished: Thu Oct 22 12:30:14.250 UTC 2026 │ │ │ │ │ -elapsed time (seconds): 0.001 │ │ │ │ │ +started: Fri Oct 30 04:03:37.947 UTC 2026 │ │ │ │ │ +finished: Fri Oct 30 04:03:37.947 UTC 2026 │ │ │ │ │ +elapsed time (seconds): 0.0 │ │ │ │ │ result: Passed. All files up to date │ │ │ │ │ │ │ │ │ │ #section:main │ │ │ │ │ ----------messages:(8/411)---------- │ │ │ │ │ command: main SetLoopbackMode │ │ │ │ │ reason: User specified action: run main/othervm SetLoopbackMode │ │ │ │ │ -started: Thu Oct 22 12:30:14.250 UTC 2026 │ │ │ │ │ +started: Fri Oct 30 04:03:37.947 UTC 2026 │ │ │ │ │ Mode: othervm [/othervm specified] │ │ │ │ │ Additional options from @modules: --add-modules java.base --add-exports java.base/java.net=ALL-UNNAMED --add-opens java.base/java.net=ALL-UNNAMED │ │ │ │ │ -Process id: 3099659 │ │ │ │ │ -finished: Thu Oct 22 12:30:14.488 UTC 2026 │ │ │ │ │ -elapsed time (seconds): 0.238 │ │ │ │ │ +Process id: 2850374 │ │ │ │ │ +finished: Fri Oct 30 04:03:38.222 UTC 2026 │ │ │ │ │ +elapsed time (seconds): 0.275 │ │ │ │ │ ----------configuration:(5/139)---------- │ │ │ │ │ Boot Layer │ │ │ │ │ add modules: java.base │ │ │ │ │ add exports: java.base/java.net ALL-UNNAMED │ │ │ │ │ add opens: java.base/java.net ALL-UNNAMED │ │ │ │ │ │ │ │ │ │ ----------System.out:(5/155)---------- │ │ │ │ ├── jtreg-test-output/jdk/JTwork/java/net/MulticastSocket/SetLoopbackModeIPv4.jtr │ │ │ │ │ @@ -1,44 +1,44 @@ │ │ │ │ │ #Test Results (version 2) │ │ │ │ │ -#Thu Oct 22 12:30:14 UTC 2026 │ │ │ │ │ +#Fri Oct 30 04:03:38 UTC 2026 │ │ │ │ │ #-----testdescription----- │ │ │ │ │ $file=/build/reproducible-path/openjdk-21-21.0.13+9/test/jdk/java/net/MulticastSocket/SetLoopbackModeIPv4.java │ │ │ │ │ $root=/build/reproducible-path/openjdk-21-21.0.13+9/test/jdk │ │ │ │ │ keywords=bug4686717 bug8241786 othervm │ │ │ │ │ library=/test/lib │ │ │ │ │ modules=java.base/java.net\:+open │ │ │ │ │ run=USER_SPECIFIED build jdk.test.lib.NetworkConfiguration jdk.test.lib.Platform SetLoopbackMode SetLoopbackModeIPv4\nUSER_SPECIFIED main/othervm -Djava.net.preferIPv4Stack\=true SetLoopbackModeIPv4\n │ │ │ │ │ source=SetLoopbackModeIPv4.java │ │ │ │ │ title=Test MulticastSocket.setLoopbackMode with IPv4 addresses │ │ │ │ │ │ │ │ │ │ #-----environment----- │ │ │ │ │ │ │ │ │ │ #-----testresult----- │ │ │ │ │ description=file\:/build/reproducible-path/openjdk-21-21.0.13+9/test/jdk/java/net/MulticastSocket/SetLoopbackModeIPv4.java │ │ │ │ │ -elapsed=247 0\:00\:00.247 │ │ │ │ │ -end=Thu Oct 22 12\:30\:14 UTC 2026 │ │ │ │ │ +elapsed=280 0\:00\:00.280 │ │ │ │ │ +end=Fri Oct 30 04\:03\:38 UTC 2026 │ │ │ │ │ environment=regtest │ │ │ │ │ execStatus=Failed. Execution failed\: `main' threw exception\: java.net.SocketException\: No such device (setsockopt failed) │ │ │ │ │ harnessLoaderMode=Classpath Loader │ │ │ │ │ harnessVariety=Full Bundle │ │ │ │ │ hostname=sbuild │ │ │ │ │ -javatestOS=Linux 6.12.113+deb13-arm64 (aarch64) │ │ │ │ │ +javatestOS=Linux 6.12.113+deb13-cloud-arm64 (aarch64) │ │ │ │ │ javatestVersion=6.0-ea+b26-2026-03-18-${BUILT_FROM_COMMIT} │ │ │ │ │ jtregVersion=jtreg 8.3 src 1 │ │ │ │ │ modules=java.base/java.net\:+open │ │ │ │ │ script=com.sun.javatest.regtest.exec.RegressionScript │ │ │ │ │ sections=script_messages build build main │ │ │ │ │ -start=Thu Oct 22 12\:30\:14 UTC 2026 │ │ │ │ │ +start=Fri Oct 30 04\:03\:38 UTC 2026 │ │ │ │ │ test=java/net/MulticastSocket/SetLoopbackModeIPv4.java │ │ │ │ │ testJDK=/build/reproducible-path/openjdk-21-21.0.13+9/build/bootcycle-build/images/jdk │ │ │ │ │ -testJDK_OS=[name\:Linux,arch\:aarch64,version\:6.12.113+deb13-arm64,family\:linux,simple_arch\:aarch64,simple_version\:6.12,processors\:8,maxMemory\:25155866624,maxSwap\:182536105984] │ │ │ │ │ +testJDK_OS=[name\:Linux,arch\:aarch64,version\:6.12.113+deb13-cloud-arm64,family\:linux,simple_arch\:aarch64,simple_version\:6.12,processors\:12,maxMemory\:33596653568,maxSwap\:137438949376] │ │ │ │ │ testJDK_os.arch=aarch64 │ │ │ │ │ testJDK_os.name=Linux │ │ │ │ │ -testJDK_os.version=6.12.113+deb13-arm64 │ │ │ │ │ -totalTime=248 │ │ │ │ │ +testJDK_os.version=6.12.113+deb13-cloud-arm64 │ │ │ │ │ +totalTime=282 │ │ │ │ │ user.name=sbuild │ │ │ │ │ work=/tmp/jdk/JTwork/java/net/MulticastSocket │ │ │ │ │ │ │ │ │ │ #section:script_messages │ │ │ │ │ ----------messages:(7/470)---------- │ │ │ │ │ JDK under test: /build/reproducible-path/openjdk-21-21.0.13+9/build/bootcycle-build/images/jdk │ │ │ │ │ openjdk version "21.0.13" 2026-10-20 │ │ │ │ │ @@ -48,38 +48,38 @@ │ │ │ │ │ source directory: /build/reproducible-path/openjdk-21-21.0.13+9/test/lib │ │ │ │ │ class directory: /tmp/jdk/JTwork/classes/java/net/MulticastSocket/SetLoopbackModeIPv4.d/test/lib │ │ │ │ │ │ │ │ │ │ #section:build │ │ │ │ │ ----------messages:(5/356)---------- │ │ │ │ │ command: build jdk.test.lib.NetworkConfiguration jdk.test.lib.Platform SetLoopbackMode SetLoopbackModeIPv4 │ │ │ │ │ reason: User specified action: run build jdk.test.lib.NetworkConfiguration jdk.test.lib.Platform SetLoopbackMode SetLoopbackModeIPv4 │ │ │ │ │ -started: Thu Oct 22 12:30:14.499 UTC 2026 │ │ │ │ │ -finished: Thu Oct 22 12:30:14.500 UTC 2026 │ │ │ │ │ +started: Fri Oct 30 04:03:38.234 UTC 2026 │ │ │ │ │ +finished: Fri Oct 30 04:03:38.235 UTC 2026 │ │ │ │ │ elapsed time (seconds): 0.001 │ │ │ │ │ result: Passed. All files up to date │ │ │ │ │ │ │ │ │ │ #section:build │ │ │ │ │ ----------messages:(5/187)---------- │ │ │ │ │ command: build SetLoopbackModeIPv4 │ │ │ │ │ reason: Named class compiled on demand │ │ │ │ │ -started: Thu Oct 22 12:30:14.501 UTC 2026 │ │ │ │ │ -finished: Thu Oct 22 12:30:14.501 UTC 2026 │ │ │ │ │ +started: Fri Oct 30 04:03:38.236 UTC 2026 │ │ │ │ │ +finished: Fri Oct 30 04:03:38.236 UTC 2026 │ │ │ │ │ elapsed time (seconds): 0.0 │ │ │ │ │ result: Passed. All files up to date │ │ │ │ │ │ │ │ │ │ #section:main │ │ │ │ │ -----------messages:(8/482)---------- │ │ │ │ │ +----------messages:(8/483)---------- │ │ │ │ │ command: main -Djava.net.preferIPv4Stack=true SetLoopbackModeIPv4 │ │ │ │ │ reason: User specified action: run main/othervm -Djava.net.preferIPv4Stack=true SetLoopbackModeIPv4 │ │ │ │ │ -started: Thu Oct 22 12:30:14.501 UTC 2026 │ │ │ │ │ +started: Fri Oct 30 04:03:38.236 UTC 2026 │ │ │ │ │ Mode: othervm [/othervm specified] │ │ │ │ │ Additional options from @modules: --add-modules java.base --add-exports java.base/java.net=ALL-UNNAMED --add-opens java.base/java.net=ALL-UNNAMED │ │ │ │ │ -Process id: 3099682 │ │ │ │ │ -finished: Thu Oct 22 12:30:14.741 UTC 2026 │ │ │ │ │ -elapsed time (seconds): 0.24 │ │ │ │ │ +Process id: 2850396 │ │ │ │ │ +finished: Fri Oct 30 04:03:38.510 UTC 2026 │ │ │ │ │ +elapsed time (seconds): 0.274 │ │ │ │ │ ----------configuration:(5/139)---------- │ │ │ │ │ Boot Layer │ │ │ │ │ add modules: java.base │ │ │ │ │ add exports: java.base/java.net ALL-UNNAMED │ │ │ │ │ add opens: java.base/java.net ALL-UNNAMED │ │ │ │ │ │ │ │ │ │ ----------System.out:(5/155)---------- │ │ │ │ ├── jtreg-test-output/jdk/JTwork/java/net/MulticastSocket/Test.jtr │ │ │ │ │ @@ -1,42 +1,42 @@ │ │ │ │ │ #Test Results (version 2) │ │ │ │ │ -#Thu Oct 22 12:30:14 UTC 2026 │ │ │ │ │ +#Fri Oct 30 04:03:38 UTC 2026 │ │ │ │ │ #-----testdescription----- │ │ │ │ │ $file=/build/reproducible-path/openjdk-21-21.0.13+9/test/jdk/java/net/MulticastSocket/Test.java │ │ │ │ │ $root=/build/reproducible-path/openjdk-21-21.0.13+9/test/jdk │ │ │ │ │ keywords=bug4488458 othervm │ │ │ │ │ library=/test/lib │ │ │ │ │ run=USER_SPECIFIED build jdk.test.lib.NetworkConfiguration jdk.test.lib.Platform\nUSER_SPECIFIED main Test\nUSER_SPECIFIED main/othervm -Djava.net.preferIPv4Stack\=true Test\n │ │ │ │ │ source=Test.java │ │ │ │ │ title=IPv4 and IPv6 multicasting broken on Linux │ │ │ │ │ │ │ │ │ │ #-----environment----- │ │ │ │ │ │ │ │ │ │ #-----testresult----- │ │ │ │ │ description=file\:/build/reproducible-path/openjdk-21-21.0.13+9/test/jdk/java/net/MulticastSocket/Test.java │ │ │ │ │ -elapsed=110 0\:00\:00.110 │ │ │ │ │ -end=Thu Oct 22 12\:30\:14 UTC 2026 │ │ │ │ │ +elapsed=109 0\:00\:00.109 │ │ │ │ │ +end=Fri Oct 30 04\:03\:38 UTC 2026 │ │ │ │ │ environment=regtest │ │ │ │ │ execStatus=Failed. Execution failed\: `main' threw exception\: java.lang.Exception\: Test failed - see log file for details │ │ │ │ │ harnessLoaderMode=Classpath Loader │ │ │ │ │ harnessVariety=Full Bundle │ │ │ │ │ hostname=sbuild │ │ │ │ │ -javatestOS=Linux 6.12.113+deb13-arm64 (aarch64) │ │ │ │ │ +javatestOS=Linux 6.12.113+deb13-cloud-arm64 (aarch64) │ │ │ │ │ javatestVersion=6.0-ea+b26-2026-03-18-${BUILT_FROM_COMMIT} │ │ │ │ │ jtregVersion=jtreg 8.3 src 1 │ │ │ │ │ script=com.sun.javatest.regtest.exec.RegressionScript │ │ │ │ │ sections=script_messages build build main │ │ │ │ │ -start=Thu Oct 22 12\:30\:14 UTC 2026 │ │ │ │ │ +start=Fri Oct 30 04\:03\:38 UTC 2026 │ │ │ │ │ test=java/net/MulticastSocket/Test.java │ │ │ │ │ testJDK=/build/reproducible-path/openjdk-21-21.0.13+9/build/bootcycle-build/images/jdk │ │ │ │ │ -testJDK_OS=[name\:Linux,arch\:aarch64,version\:6.12.113+deb13-arm64,family\:linux,simple_arch\:aarch64,simple_version\:6.12,processors\:8,maxMemory\:25155866624,maxSwap\:182536105984] │ │ │ │ │ +testJDK_OS=[name\:Linux,arch\:aarch64,version\:6.12.113+deb13-cloud-arm64,family\:linux,simple_arch\:aarch64,simple_version\:6.12,processors\:12,maxMemory\:33596653568,maxSwap\:137438949376] │ │ │ │ │ testJDK_os.arch=aarch64 │ │ │ │ │ testJDK_os.name=Linux │ │ │ │ │ -testJDK_os.version=6.12.113+deb13-arm64 │ │ │ │ │ -totalTime=112 │ │ │ │ │ +testJDK_os.version=6.12.113+deb13-cloud-arm64 │ │ │ │ │ +totalTime=110 │ │ │ │ │ user.name=sbuild │ │ │ │ │ work=/tmp/jdk/JTwork/java/net/MulticastSocket │ │ │ │ │ │ │ │ │ │ #section:script_messages │ │ │ │ │ ----------messages:(7/455)---------- │ │ │ │ │ JDK under test: /build/reproducible-path/openjdk-21-21.0.13+9/build/bootcycle-build/images/jdk │ │ │ │ │ openjdk version "21.0.13" 2026-10-20 │ │ │ │ │ @@ -46,38 +46,38 @@ │ │ │ │ │ source directory: /build/reproducible-path/openjdk-21-21.0.13+9/test/lib │ │ │ │ │ class directory: /tmp/jdk/JTwork/classes/java/net/MulticastSocket/Test.d/test/lib │ │ │ │ │ │ │ │ │ │ #section:build │ │ │ │ │ ----------messages:(5/284)---------- │ │ │ │ │ command: build jdk.test.lib.NetworkConfiguration jdk.test.lib.Platform │ │ │ │ │ reason: User specified action: run build jdk.test.lib.NetworkConfiguration jdk.test.lib.Platform │ │ │ │ │ -started: Thu Oct 22 12:30:14.752 UTC 2026 │ │ │ │ │ -finished: Thu Oct 22 12:30:14.753 UTC 2026 │ │ │ │ │ +started: Fri Oct 30 04:03:38.519 UTC 2026 │ │ │ │ │ +finished: Fri Oct 30 04:03:38.520 UTC 2026 │ │ │ │ │ elapsed time (seconds): 0.001 │ │ │ │ │ result: Passed. All files up to date │ │ │ │ │ │ │ │ │ │ #section:build │ │ │ │ │ -----------messages:(5/174)---------- │ │ │ │ │ +----------messages:(5/172)---------- │ │ │ │ │ command: build Test │ │ │ │ │ reason: Named class compiled on demand │ │ │ │ │ -started: Thu Oct 22 12:30:14.753 UTC 2026 │ │ │ │ │ -finished: Thu Oct 22 12:30:14.754 UTC 2026 │ │ │ │ │ -elapsed time (seconds): 0.001 │ │ │ │ │ +started: Fri Oct 30 04:03:38.521 UTC 2026 │ │ │ │ │ +finished: Fri Oct 30 04:03:38.521 UTC 2026 │ │ │ │ │ +elapsed time (seconds): 0.0 │ │ │ │ │ result: Passed. All files up to date │ │ │ │ │ │ │ │ │ │ #section:main │ │ │ │ │ ----------messages:(8/226)---------- │ │ │ │ │ command: main Test │ │ │ │ │ reason: User specified action: run main Test │ │ │ │ │ -started: Thu Oct 22 12:30:14.754 UTC 2026 │ │ │ │ │ +started: Fri Oct 30 04:03:38.521 UTC 2026 │ │ │ │ │ Mode: agentvm │ │ │ │ │ Agent id: 1 │ │ │ │ │ -Process id: 3099630 │ │ │ │ │ -finished: Thu Oct 22 12:30:14.858 UTC 2026 │ │ │ │ │ -elapsed time (seconds): 0.104 │ │ │ │ │ +Process id: 2850347 │ │ │ │ │ +finished: Fri Oct 30 04:03:38.623 UTC 2026 │ │ │ │ │ +elapsed time (seconds): 0.102 │ │ │ │ │ ----------configuration:(17/810)---------- │ │ │ │ │ Boot Layer │ │ │ │ │ class path: /usr/share/jtreg/lib/javatest.jar │ │ │ │ │ /usr/share/jtreg/lib/jtreg.jar │ │ │ │ │ /usr/share/jtreg/lib/junit-platform-console-standalone.jar │ │ │ │ │ /usr/share/jtreg/lib/testng.jar │ │ │ │ │ /usr/share/jtreg/lib/guice.jar │ │ │ │ ├── jtreg-test-output/jdk/JTwork/java/net/SocketOption/OptionsTest.jtr │ │ │ │ │ @@ -1,43 +1,43 @@ │ │ │ │ │ #Test Results (version 2) │ │ │ │ │ -#Thu Oct 22 12:30:15 UTC 2026 │ │ │ │ │ +#Fri Oct 30 04:03:38 UTC 2026 │ │ │ │ │ #-----testdescription----- │ │ │ │ │ $file=/build/reproducible-path/openjdk-21-21.0.13+9/test/jdk/java/net/SocketOption/OptionsTest.java │ │ │ │ │ $root=/build/reproducible-path/openjdk-21-21.0.13+9/test/jdk │ │ │ │ │ keywords=bug8036979 bug8072384 bug8044773 bug8225214 bug8233296 bug8234083 othervm │ │ │ │ │ library=/test/lib │ │ │ │ │ requires=\!vm.graal.enabled │ │ │ │ │ run=USER_SPECIFIED main/othervm -Xcheck\:jni OptionsTest\nUSER_SPECIFIED main/othervm -Xcheck\:jni -Djava.net.preferIPv4Stack\=true OptionsTest\nUSER_SPECIFIED main/othervm --limit-modules\=java.base OptionsTest\nUSER_SPECIFIED main/othervm/policy\=options.policy OptionsTest\n │ │ │ │ │ source=OptionsTest.java │ │ │ │ │ title=\ │ │ │ │ │ │ │ │ │ │ #-----environment----- │ │ │ │ │ │ │ │ │ │ #-----testresult----- │ │ │ │ │ description=file\:/build/reproducible-path/openjdk-21-21.0.13+9/test/jdk/java/net/SocketOption/OptionsTest.java │ │ │ │ │ -elapsed=243 0\:00\:00.243 │ │ │ │ │ -end=Thu Oct 22 12\:30\:15 UTC 2026 │ │ │ │ │ +elapsed=312 0\:00\:00.312 │ │ │ │ │ +end=Fri Oct 30 04\:03\:38 UTC 2026 │ │ │ │ │ environment=regtest │ │ │ │ │ execStatus=Failed. Execution failed\: `main' threw exception\: java.lang.IllegalArgumentException\: Invalid value 'null' │ │ │ │ │ harnessLoaderMode=Classpath Loader │ │ │ │ │ harnessVariety=Full Bundle │ │ │ │ │ hostname=sbuild │ │ │ │ │ -javatestOS=Linux 6.12.113+deb13-arm64 (aarch64) │ │ │ │ │ +javatestOS=Linux 6.12.113+deb13-cloud-arm64 (aarch64) │ │ │ │ │ javatestVersion=6.0-ea+b26-2026-03-18-${BUILT_FROM_COMMIT} │ │ │ │ │ jtregVersion=jtreg 8.3 src 1 │ │ │ │ │ script=com.sun.javatest.regtest.exec.RegressionScript │ │ │ │ │ sections=script_messages build main │ │ │ │ │ -start=Thu Oct 22 12\:30\:14 UTC 2026 │ │ │ │ │ +start=Fri Oct 30 04\:03\:38 UTC 2026 │ │ │ │ │ test=java/net/SocketOption/OptionsTest.java │ │ │ │ │ testJDK=/build/reproducible-path/openjdk-21-21.0.13+9/build/bootcycle-build/images/jdk │ │ │ │ │ -testJDK_OS=[name\:Linux,arch\:aarch64,version\:6.12.113+deb13-arm64,family\:linux,simple_arch\:aarch64,simple_version\:6.12,processors\:8,maxMemory\:25155866624,maxSwap\:182536105984] │ │ │ │ │ +testJDK_OS=[name\:Linux,arch\:aarch64,version\:6.12.113+deb13-cloud-arm64,family\:linux,simple_arch\:aarch64,simple_version\:6.12,processors\:12,maxMemory\:33596653568,maxSwap\:137438949376] │ │ │ │ │ testJDK_os.arch=aarch64 │ │ │ │ │ testJDK_os.name=Linux │ │ │ │ │ -testJDK_os.version=6.12.113+deb13-arm64 │ │ │ │ │ -totalTime=245 │ │ │ │ │ +testJDK_os.version=6.12.113+deb13-cloud-arm64 │ │ │ │ │ +totalTime=314 │ │ │ │ │ user.name=sbuild │ │ │ │ │ work=/tmp/jdk/JTwork/java/net/SocketOption │ │ │ │ │ │ │ │ │ │ #section:script_messages │ │ │ │ │ ----------messages:(7/459)---------- │ │ │ │ │ JDK under test: /build/reproducible-path/openjdk-21-21.0.13+9/build/bootcycle-build/images/jdk │ │ │ │ │ openjdk version "21.0.13" 2026-10-20 │ │ │ │ │ @@ -47,28 +47,28 @@ │ │ │ │ │ source directory: /build/reproducible-path/openjdk-21-21.0.13+9/test/lib │ │ │ │ │ class directory: /tmp/jdk/JTwork/classes/java/net/SocketOption/OptionsTest.d/test/lib │ │ │ │ │ │ │ │ │ │ #section:build │ │ │ │ │ ----------messages:(5/181)---------- │ │ │ │ │ command: build OptionsTest │ │ │ │ │ reason: Named class compiled on demand │ │ │ │ │ -started: Thu Oct 22 12:30:14.868 UTC 2026 │ │ │ │ │ -finished: Thu Oct 22 12:30:14.869 UTC 2026 │ │ │ │ │ +started: Fri Oct 30 04:03:38.635 UTC 2026 │ │ │ │ │ +finished: Fri Oct 30 04:03:38.636 UTC 2026 │ │ │ │ │ elapsed time (seconds): 0.001 │ │ │ │ │ result: Passed. All files up to date │ │ │ │ │ │ │ │ │ │ #section:main │ │ │ │ │ ----------messages:(7/281)---------- │ │ │ │ │ command: main -Xcheck:jni OptionsTest │ │ │ │ │ reason: User specified action: run main/othervm -Xcheck:jni OptionsTest │ │ │ │ │ -started: Thu Oct 22 12:30:14.869 UTC 2026 │ │ │ │ │ +started: Fri Oct 30 04:03:38.637 UTC 2026 │ │ │ │ │ Mode: othervm [/othervm specified] │ │ │ │ │ -Process id: 3099704 │ │ │ │ │ -finished: Thu Oct 22 12:30:15.107 UTC 2026 │ │ │ │ │ -elapsed time (seconds): 0.238 │ │ │ │ │ +Process id: 2850419 │ │ │ │ │ +finished: Fri Oct 30 04:03:38.943 UTC 2026 │ │ │ │ │ +elapsed time (seconds): 0.306 │ │ │ │ │ ----------configuration:(0/0)---------- │ │ │ │ │ ----------System.out:(7/201)---------- │ │ │ │ │ Testing SO_LINGER with:-1 │ │ │ │ │ Testing SO_LINGER with:-2 │ │ │ │ │ Testing SO_LINGER with:-100 │ │ │ │ │ Testing SO_LINGER with:-65534 │ │ │ │ │ Testing SO_LINGER with:-65535 │ │ │ │ ├── jtreg-test-output/jdk/JTwork/java/net/SocketPermission/SocketPermissionTest.jtr │ │ │ │ │ @@ -1,42 +1,42 @@ │ │ │ │ │ #Test Results (version 2) │ │ │ │ │ -#Thu Oct 22 12:30:16 UTC 2026 │ │ │ │ │ +#Fri Oct 30 04:03:39 UTC 2026 │ │ │ │ │ #-----testdescription----- │ │ │ │ │ $file=/build/reproducible-path/openjdk-21-21.0.13+9/test/jdk/java/net/SocketPermission/SocketPermissionTest.java │ │ │ │ │ $root=/build/reproducible-path/openjdk-21-21.0.13+9/test/jdk │ │ │ │ │ keywords=bug8047031 intermittent othervm testng │ │ │ │ │ library=/test/lib │ │ │ │ │ run=USER_SPECIFIED build jdk.test.lib.NetworkConfiguration jdk.test.lib.Platform\nUSER_SPECIFIED testng/othervm -Djava.security.manager\=allow SocketPermissionTest\n │ │ │ │ │ source=SocketPermissionTest.java │ │ │ │ │ title=SocketPermission tests for legacy socket types. │ │ │ │ │ │ │ │ │ │ #-----environment----- │ │ │ │ │ │ │ │ │ │ #-----testresult----- │ │ │ │ │ description=file\:/build/reproducible-path/openjdk-21-21.0.13+9/test/jdk/java/net/SocketPermission/SocketPermissionTest.java │ │ │ │ │ -elapsed=695 0\:00\:00.695 │ │ │ │ │ -end=Thu Oct 22 12\:30\:16 UTC 2026 │ │ │ │ │ +elapsed=735 0\:00\:00.735 │ │ │ │ │ +end=Fri Oct 30 04\:03\:39 UTC 2026 │ │ │ │ │ environment=regtest │ │ │ │ │ execStatus=Failed. Execution failed\: `main' threw exception\: java.lang.Exception\: config failures\: 0, test failures\: 2 │ │ │ │ │ harnessLoaderMode=Classpath Loader │ │ │ │ │ harnessVariety=Full Bundle │ │ │ │ │ hostname=sbuild │ │ │ │ │ -javatestOS=Linux 6.12.113+deb13-arm64 (aarch64) │ │ │ │ │ +javatestOS=Linux 6.12.113+deb13-cloud-arm64 (aarch64) │ │ │ │ │ javatestVersion=6.0-ea+b26-2026-03-18-${BUILT_FROM_COMMIT} │ │ │ │ │ jtregVersion=jtreg 8.3 src 1 │ │ │ │ │ script=com.sun.javatest.regtest.exec.RegressionScript │ │ │ │ │ sections=script_messages build build testng │ │ │ │ │ -start=Thu Oct 22 12\:30\:15 UTC 2026 │ │ │ │ │ +start=Fri Oct 30 04\:03\:39 UTC 2026 │ │ │ │ │ test=java/net/SocketPermission/SocketPermissionTest.java │ │ │ │ │ testJDK=/build/reproducible-path/openjdk-21-21.0.13+9/build/bootcycle-build/images/jdk │ │ │ │ │ -testJDK_OS=[name\:Linux,arch\:aarch64,version\:6.12.113+deb13-arm64,family\:linux,simple_arch\:aarch64,simple_version\:6.12,processors\:8,maxMemory\:25155866624,maxSwap\:182536105984] │ │ │ │ │ +testJDK_OS=[name\:Linux,arch\:aarch64,version\:6.12.113+deb13-cloud-arm64,family\:linux,simple_arch\:aarch64,simple_version\:6.12,processors\:12,maxMemory\:33596653568,maxSwap\:137438949376] │ │ │ │ │ testJDK_os.arch=aarch64 │ │ │ │ │ testJDK_os.name=Linux │ │ │ │ │ -testJDK_os.version=6.12.113+deb13-arm64 │ │ │ │ │ -totalTime=697 │ │ │ │ │ +testJDK_os.version=6.12.113+deb13-cloud-arm64 │ │ │ │ │ +totalTime=737 │ │ │ │ │ user.name=sbuild │ │ │ │ │ work=/tmp/jdk/JTwork/java/net/SocketPermission │ │ │ │ │ │ │ │ │ │ #section:script_messages │ │ │ │ │ ----------messages:(7/472)---------- │ │ │ │ │ JDK under test: /build/reproducible-path/openjdk-21-21.0.13+9/build/bootcycle-build/images/jdk │ │ │ │ │ openjdk version "21.0.13" 2026-10-20 │ │ │ │ │ @@ -46,47 +46,47 @@ │ │ │ │ │ source directory: /build/reproducible-path/openjdk-21-21.0.13+9/test/lib │ │ │ │ │ class directory: /tmp/jdk/JTwork/classes/java/net/SocketPermission/SocketPermissionTest.d/test/lib │ │ │ │ │ │ │ │ │ │ #section:build │ │ │ │ │ ----------messages:(5/284)---------- │ │ │ │ │ command: build jdk.test.lib.NetworkConfiguration jdk.test.lib.Platform │ │ │ │ │ reason: User specified action: run build jdk.test.lib.NetworkConfiguration jdk.test.lib.Platform │ │ │ │ │ -started: Thu Oct 22 12:30:15.452 UTC 2026 │ │ │ │ │ -finished: Thu Oct 22 12:30:15.453 UTC 2026 │ │ │ │ │ +started: Fri Oct 30 04:03:39.195 UTC 2026 │ │ │ │ │ +finished: Fri Oct 30 04:03:39.196 UTC 2026 │ │ │ │ │ elapsed time (seconds): 0.001 │ │ │ │ │ result: Passed. All files up to date │ │ │ │ │ │ │ │ │ │ #section:build │ │ │ │ │ ----------messages:(5/190)---------- │ │ │ │ │ command: build SocketPermissionTest │ │ │ │ │ reason: Named class compiled on demand │ │ │ │ │ -started: Thu Oct 22 12:30:15.453 UTC 2026 │ │ │ │ │ -finished: Thu Oct 22 12:30:15.454 UTC 2026 │ │ │ │ │ +started: Fri Oct 30 04:03:39.196 UTC 2026 │ │ │ │ │ +finished: Fri Oct 30 04:03:39.197 UTC 2026 │ │ │ │ │ elapsed time (seconds): 0.001 │ │ │ │ │ result: Passed. All files up to date │ │ │ │ │ │ │ │ │ │ #section:testng │ │ │ │ │ ----------messages:(7/339)---------- │ │ │ │ │ command: testng -Djava.security.manager=allow SocketPermissionTest │ │ │ │ │ reason: User specified action: run testng/othervm -Djava.security.manager=allow SocketPermissionTest │ │ │ │ │ -started: Thu Oct 22 12:30:15.454 UTC 2026 │ │ │ │ │ +started: Fri Oct 30 04:03:39.197 UTC 2026 │ │ │ │ │ Mode: othervm [/othervm specified] │ │ │ │ │ -Process id: 3099725 │ │ │ │ │ -finished: Thu Oct 22 12:30:16.137 UTC 2026 │ │ │ │ │ -elapsed time (seconds): 0.683 │ │ │ │ │ +Process id: 2850440 │ │ │ │ │ +finished: Fri Oct 30 04:03:39.918 UTC 2026 │ │ │ │ │ +elapsed time (seconds): 0.721 │ │ │ │ │ ----------configuration:(0/0)---------- │ │ │ │ │ -----------System.out:(97/6917)---------- │ │ │ │ │ -[12:30:15.938] config SocketPermissionTest.setupSecurityManager(): success [0ms] │ │ │ │ │ -[12:30:15.968] test SocketPermissionTest.acceptServerSocketTest(): success [23ms] │ │ │ │ │ -[12:30:15.969] config SocketPermissionTest.setupSecurityManager(): success [0ms] │ │ │ │ │ -[12:30:15.985] test SocketPermissionTest.connectDatagramSocketTest(): success [15ms] │ │ │ │ │ -[12:30:15.987] config SocketPermissionTest.setupSecurityManager(): success [0ms] │ │ │ │ │ -[12:30:15.990] test SocketPermissionTest.connectSocketTest(): success [2ms] │ │ │ │ │ -[12:30:15.992] config SocketPermissionTest.setupSecurityManager(): success [0ms] │ │ │ │ │ -[12:30:16.000] test SocketPermissionTest.joinGroupMulticastTest(): failure [9ms] │ │ │ │ │ +----------System.out:(97/6918)---------- │ │ │ │ │ +[04:03:39.743] config SocketPermissionTest.setupSecurityManager(): success [0ms] │ │ │ │ │ +[04:03:39.777] test SocketPermissionTest.acceptServerSocketTest(): success [27ms] │ │ │ │ │ +[04:03:39.779] config SocketPermissionTest.setupSecurityManager(): success [0ms] │ │ │ │ │ +[04:03:39.794] test SocketPermissionTest.connectDatagramSocketTest(): success [15ms] │ │ │ │ │ +[04:03:39.796] config SocketPermissionTest.setupSecurityManager(): success [0ms] │ │ │ │ │ +[04:03:39.799] test SocketPermissionTest.connectSocketTest(): success [2ms] │ │ │ │ │ +[04:03:39.800] config SocketPermissionTest.setupSecurityManager(): success [0ms] │ │ │ │ │ +[04:03:39.809] test SocketPermissionTest.joinGroupMulticastTest(): failure [10ms] │ │ │ │ │ java.util.NoSuchElementException: No value present │ │ │ │ │ at java.base/java.util.Optional.get(Optional.java:143) │ │ │ │ │ at SocketPermissionTest.joinGroupMulticastTest(SocketPermissionTest.java:227) │ │ │ │ │ at java.base/jdk.internal.reflect.DirectMethodHandleAccessor.invoke(DirectMethodHandleAccessor.java:103) │ │ │ │ │ at java.base/java.lang.reflect.Method.invoke(Method.java:580) │ │ │ │ │ at org.testng.internal.invokers.MethodInvocationHelper.invokeMethod(MethodInvocationHelper.java:136) │ │ │ │ │ at org.testng.internal.invokers.TestInvoker.invokeMethod(TestInvoker.java:658) │ │ │ │ │ @@ -111,22 +111,22 @@ │ │ │ │ │ at org.testng.TestNG.run(TestNG.java:1060) │ │ │ │ │ at com.sun.javatest.regtest.agent.TestNGRunner.main(TestNGRunner.java:109) │ │ │ │ │ at com.sun.javatest.regtest.agent.TestNGRunner.main(TestNGRunner.java:65) │ │ │ │ │ at java.base/jdk.internal.reflect.DirectMethodHandleAccessor.invoke(DirectMethodHandleAccessor.java:103) │ │ │ │ │ at java.base/java.lang.reflect.Method.invoke(Method.java:580) │ │ │ │ │ at com.sun.javatest.regtest.agent.MainWrapper$MainTask.run(MainWrapper.java:143) │ │ │ │ │ at java.base/java.lang.Thread.run(Thread.java:1583) │ │ │ │ │ -[12:30:16.002] config SocketPermissionTest.setupSecurityManager(): success [0ms] │ │ │ │ │ -[12:30:16.004] test SocketPermissionTest.listenDatagramSocketTest(): success [1ms] │ │ │ │ │ -[12:30:16.005] config SocketPermissionTest.setupSecurityManager(): success [0ms] │ │ │ │ │ -[12:30:16.007] test SocketPermissionTest.listenMulticastSocketTest(): success [1ms] │ │ │ │ │ -[12:30:16.008] config SocketPermissionTest.setupSecurityManager(): success [0ms] │ │ │ │ │ -[12:30:16.010] test SocketPermissionTest.listenServerSocketTest(): success [1ms] │ │ │ │ │ -[12:30:16.011] config SocketPermissionTest.setupSecurityManager(): success [0ms] │ │ │ │ │ -[12:30:16.012] test SocketPermissionTest.sendDatagramPacketTest(): failure [1ms] │ │ │ │ │ +[04:03:39.812] config SocketPermissionTest.setupSecurityManager(): success [0ms] │ │ │ │ │ +[04:03:39.814] test SocketPermissionTest.listenDatagramSocketTest(): success [2ms] │ │ │ │ │ +[04:03:39.815] config SocketPermissionTest.setupSecurityManager(): success [0ms] │ │ │ │ │ +[04:03:39.818] test SocketPermissionTest.listenMulticastSocketTest(): success [1ms] │ │ │ │ │ +[04:03:39.819] config SocketPermissionTest.setupSecurityManager(): success [0ms] │ │ │ │ │ +[04:03:39.821] test SocketPermissionTest.listenServerSocketTest(): success [1ms] │ │ │ │ │ +[04:03:39.822] config SocketPermissionTest.setupSecurityManager(): success [0ms] │ │ │ │ │ +[04:03:39.824] test SocketPermissionTest.sendDatagramPacketTest(): failure [2ms] │ │ │ │ │ java.security.PrivilegedActionException: java.net.SocketException: Network is unreachable │ │ │ │ │ at java.base/java.security.AccessController.doPrivileged(AccessController.java:718) │ │ │ │ │ at SocketPermissionTest.sendDatagramPacketTest(SocketPermissionTest.java:195) │ │ │ │ │ at java.base/jdk.internal.reflect.DirectMethodHandleAccessor.invoke(DirectMethodHandleAccessor.java:103) │ │ │ │ │ at java.base/java.lang.reflect.Method.invoke(Method.java:580) │ │ │ │ │ at org.testng.internal.invokers.MethodInvocationHelper.invokeMethod(MethodInvocationHelper.java:136) │ │ │ │ │ at org.testng.internal.invokers.TestInvoker.invokeMethod(TestInvoker.java:658) │ │ │ │ ├── jtreg-test-output/jdk/JTwork/sun/security/krb5/auto/Addresses.jtr │ │ │ │ │ @@ -1,44 +1,44 @@ │ │ │ │ │ #Test Results (version 2) │ │ │ │ │ -#Thu Oct 22 12:30:18 UTC 2026 │ │ │ │ │ +#Fri Oct 30 04:03:42 UTC 2026 │ │ │ │ │ #-----testdescription----- │ │ │ │ │ $file=/build/reproducible-path/openjdk-21-21.0.13+9/test/jdk/sun/security/krb5/auto/Addresses.java │ │ │ │ │ $root=/build/reproducible-path/openjdk-21-21.0.13+9/test/jdk │ │ │ │ │ keywords=bug8031111 bug8194486 othervm │ │ │ │ │ library=/test/lib │ │ │ │ │ modules=java.base/jdk.internal.misc java.base/sun.security.util java.security.jgss/sun.security.jgss java.security.jgss/sun.security.jgss.krb5 java.security.jgss/sun.security.krb5\:+open java.security.jgss/sun.security.krb5.internal\:+open java.security.jgss/sun.security.krb5.internal.ccache java.security.jgss/sun.security.krb5.internal.rcache java.security.jgss/sun.security.krb5.internal.crypto java.security.jgss/sun.security.krb5.internal.ktab jdk.security.auth jdk.security.jgss │ │ │ │ │ run=USER_SPECIFIED compile -XDignore.symbol.file Addresses.java\nUSER_SPECIFIED main jdk.test.lib.FileInstaller TestHosts TestHosts\nUSER_SPECIFIED main/othervm -Djdk.net.hosts.file\=TestHosts Addresses\n │ │ │ │ │ source=Addresses.java │ │ │ │ │ title=fix krb5 caddr │ │ │ │ │ │ │ │ │ │ #-----environment----- │ │ │ │ │ │ │ │ │ │ #-----testresult----- │ │ │ │ │ description=file\:/build/reproducible-path/openjdk-21-21.0.13+9/test/jdk/sun/security/krb5/auto/Addresses.java │ │ │ │ │ -elapsed=2701 0\:00\:02.701 │ │ │ │ │ -end=Thu Oct 22 12\:30\:18 UTC 2026 │ │ │ │ │ +elapsed=2871 0\:00\:02.871 │ │ │ │ │ +end=Fri Oct 30 04\:03\:42 UTC 2026 │ │ │ │ │ environment=regtest │ │ │ │ │ execStatus=Failed. Execution failed\: `main' threw exception\: java.lang.Exception │ │ │ │ │ harnessLoaderMode=Classpath Loader │ │ │ │ │ harnessVariety=Full Bundle │ │ │ │ │ hostname=sbuild │ │ │ │ │ -javatestOS=Linux 6.12.113+deb13-arm64 (aarch64) │ │ │ │ │ +javatestOS=Linux 6.12.113+deb13-cloud-arm64 (aarch64) │ │ │ │ │ javatestVersion=6.0-ea+b26-2026-03-18-${BUILT_FROM_COMMIT} │ │ │ │ │ jtregVersion=jtreg 8.3 src 1 │ │ │ │ │ modules=java.base/jdk.internal.misc java.base/sun.security.util java.security.jgss/sun.security.jgss java.security.jgss/sun.security.jgss.krb5 java.security.jgss/sun.security.krb5\:+open java.security.jgss/sun.security.krb5.internal\:+open java.security.jgss/sun.security.krb5.internal.ccache java.security.jgss/sun.security.krb5.internal.rcache java.security.jgss/sun.security.krb5.internal.crypto java.security.jgss/sun.security.krb5.internal.ktab jdk.security.auth jdk.security.jgss │ │ │ │ │ script=com.sun.javatest.regtest.exec.RegressionScript │ │ │ │ │ sections=script_messages compile build main build main │ │ │ │ │ -start=Thu Oct 22 12\:30\:16 UTC 2026 │ │ │ │ │ +start=Fri Oct 30 04\:03\:39 UTC 2026 │ │ │ │ │ test=sun/security/krb5/auto/Addresses.java │ │ │ │ │ testJDK=/build/reproducible-path/openjdk-21-21.0.13+9/build/bootcycle-build/images/jdk │ │ │ │ │ -testJDK_OS=[name\:Linux,arch\:aarch64,version\:6.12.113+deb13-arm64,family\:linux,simple_arch\:aarch64,simple_version\:6.12,processors\:8,maxMemory\:25155866624,maxSwap\:182536105984] │ │ │ │ │ +testJDK_OS=[name\:Linux,arch\:aarch64,version\:6.12.113+deb13-cloud-arm64,family\:linux,simple_arch\:aarch64,simple_version\:6.12,processors\:12,maxMemory\:33596653568,maxSwap\:137438949376] │ │ │ │ │ testJDK_os.arch=aarch64 │ │ │ │ │ testJDK_os.name=Linux │ │ │ │ │ -testJDK_os.version=6.12.113+deb13-arm64 │ │ │ │ │ -totalTime=2703 │ │ │ │ │ +testJDK_os.version=6.12.113+deb13-cloud-arm64 │ │ │ │ │ +totalTime=2873 │ │ │ │ │ user.name=sbuild │ │ │ │ │ work=/tmp/jdk/JTwork/sun/security/krb5/auto │ │ │ │ │ │ │ │ │ │ #section:script_messages │ │ │ │ │ ----------messages:(7/458)---------- │ │ │ │ │ JDK under test: /build/reproducible-path/openjdk-21-21.0.13+9/build/bootcycle-build/images/jdk │ │ │ │ │ openjdk version "21.0.13" 2026-10-20 │ │ │ │ │ @@ -48,21 +48,21 @@ │ │ │ │ │ source directory: /build/reproducible-path/openjdk-21-21.0.13+9/test/lib │ │ │ │ │ class directory: /tmp/jdk/JTwork/classes/sun/security/krb5/auto/Addresses.d/test/lib │ │ │ │ │ │ │ │ │ │ #section:compile │ │ │ │ │ ----------messages:(9/1175)---------- │ │ │ │ │ command: compile -XDignore.symbol.file /build/reproducible-path/openjdk-21-21.0.13+9/test/jdk/sun/security/krb5/auto/Addresses.java │ │ │ │ │ reason: User specified action: run compile -XDignore.symbol.file Addresses.java │ │ │ │ │ -started: Thu Oct 22 12:30:16.156 UTC 2026 │ │ │ │ │ +started: Fri Oct 30 04:03:39.940 UTC 2026 │ │ │ │ │ Additional options from @modules: --add-modules java.base,java.security.jgss,jdk.security.auth,jdk.security.jgss --add-exports java.base/jdk.internal.misc=ALL-UNNAMED --add-exports java.base/sun.security.util=ALL-UNNAMED --add-exports java.security.jgss/sun.security.jgss=ALL-UNNAMED --add-exports java.security.jgss/sun.security.jgss.krb5=ALL-UNNAMED --add-exports java.security.jgss/sun.security.krb5=ALL-UNNAMED --add-exports java.security.jgss/sun.security.krb5.internal=ALL-UNNAMED --add-exports java.security.jgss/sun.security.krb5.internal.ccache=ALL-UNNAMED --add-exports java.security.jgss/sun.security.krb5.internal.rcache=ALL-UNNAMED --add-exports java.security.jgss/sun.security.krb5.internal.crypto=ALL-UNNAMED --add-exports java.security.jgss/sun.security.krb5.internal.ktab=ALL-UNNAMED │ │ │ │ │ Mode: agentvm │ │ │ │ │ Agent id: 2 │ │ │ │ │ -Process id: 3099754 │ │ │ │ │ -finished: Thu Oct 22 12:30:17.151 UTC 2026 │ │ │ │ │ -elapsed time (seconds): 0.995 │ │ │ │ │ +Process id: 2850470 │ │ │ │ │ +finished: Fri Oct 30 04:03:41.038 UTC 2026 │ │ │ │ │ +elapsed time (seconds): 1.098 │ │ │ │ │ ----------configuration:(23/1523)---------- │ │ │ │ │ Boot Layer (javac runtime environment) │ │ │ │ │ class path: /usr/share/jtreg/lib/javatest.jar │ │ │ │ │ /usr/share/jtreg/lib/jtreg.jar │ │ │ │ │ patch: java.base /tmp/jdk/JTwork/patches/java.base │ │ │ │ │ │ │ │ │ │ javac compilation environment │ │ │ │ │ @@ -135,31 +135,31 @@ │ │ │ │ │ ----------stderr:(0/0)---------- │ │ │ │ │ result: Passed. Compilation successful │ │ │ │ │ │ │ │ │ │ #section:build │ │ │ │ │ ----------messages:(5/196)---------- │ │ │ │ │ command: build jdk.test.lib.FileInstaller │ │ │ │ │ reason: Named class compiled on demand │ │ │ │ │ -started: Thu Oct 22 12:30:17.151 UTC 2026 │ │ │ │ │ -finished: Thu Oct 22 12:30:17.152 UTC 2026 │ │ │ │ │ +started: Fri Oct 30 04:03:41.039 UTC 2026 │ │ │ │ │ +finished: Fri Oct 30 04:03:41.040 UTC 2026 │ │ │ │ │ elapsed time (seconds): 0.001 │ │ │ │ │ result: Passed. All files up to date │ │ │ │ │ │ │ │ │ │ #section:main │ │ │ │ │ ----------messages:(10/925)---------- │ │ │ │ │ command: main jdk.test.lib.FileInstaller TestHosts TestHosts │ │ │ │ │ reason: User specified action: run main jdk.test.lib.FileInstaller TestHosts TestHosts │ │ │ │ │ -started: Thu Oct 22 12:30:17.152 UTC 2026 │ │ │ │ │ +started: Fri Oct 30 04:03:41.040 UTC 2026 │ │ │ │ │ Mode: agentvm │ │ │ │ │ Agent id: 1 │ │ │ │ │ -Process id: 3099630 │ │ │ │ │ +Process id: 2850347 │ │ │ │ │ Additional exports to unnamed modules from @modules: java.base/jdk.internal.misc java.base/sun.security.util java.security.jgss/sun.security.jgss java.security.jgss/sun.security.jgss.krb5 java.security.jgss/sun.security.krb5 java.security.jgss/sun.security.krb5.internal java.security.jgss/sun.security.krb5.internal.ccache java.security.jgss/sun.security.krb5.internal.rcache java.security.jgss/sun.security.krb5.internal.crypto java.security.jgss/sun.security.krb5.internal.ktab │ │ │ │ │ Additional opens to unnamed modules from @modules: java.security.jgss/sun.security.krb5 java.security.jgss/sun.security.krb5.internal │ │ │ │ │ -finished: Thu Oct 22 12:30:17.225 UTC 2026 │ │ │ │ │ -elapsed time (seconds): 0.073 │ │ │ │ │ +finished: Fri Oct 30 04:03:41.128 UTC 2026 │ │ │ │ │ +elapsed time (seconds): 0.088 │ │ │ │ │ ----------configuration:(29/1782)---------- │ │ │ │ │ Boot Layer │ │ │ │ │ class path: /usr/share/jtreg/lib/javatest.jar │ │ │ │ │ /usr/share/jtreg/lib/jtreg.jar │ │ │ │ │ /usr/share/jtreg/lib/junit-platform-console-standalone.jar │ │ │ │ │ /usr/share/jtreg/lib/testng.jar │ │ │ │ │ /usr/share/jtreg/lib/guice.jar │ │ │ │ │ @@ -227,29 +227,29 @@ │ │ │ │ │ │ │ │ │ │ result: Passed. Execution successful │ │ │ │ │ │ │ │ │ │ #section:build │ │ │ │ │ ----------messages:(5/177)---------- │ │ │ │ │ command: build Addresses │ │ │ │ │ reason: Named class compiled on demand │ │ │ │ │ -started: Thu Oct 22 12:30:17.225 UTC 2026 │ │ │ │ │ -finished: Thu Oct 22 12:30:17.225 UTC 2026 │ │ │ │ │ +started: Fri Oct 30 04:03:41.129 UTC 2026 │ │ │ │ │ +finished: Fri Oct 30 04:03:41.129 UTC 2026 │ │ │ │ │ elapsed time (seconds): 0.0 │ │ │ │ │ result: Passed. All files up to date │ │ │ │ │ │ │ │ │ │ #section:main │ │ │ │ │ ----------messages:(8/1247)---------- │ │ │ │ │ command: main -Djdk.net.hosts.file=TestHosts Addresses │ │ │ │ │ reason: User specified action: run main/othervm -Djdk.net.hosts.file=TestHosts Addresses │ │ │ │ │ -started: Thu Oct 22 12:30:17.226 UTC 2026 │ │ │ │ │ +started: Fri Oct 30 04:03:41.130 UTC 2026 │ │ │ │ │ Mode: othervm [/othervm specified] │ │ │ │ │ Additional options from @modules: --add-modules java.base,java.security.jgss,jdk.security.auth,jdk.security.jgss --add-exports java.base/jdk.internal.misc=ALL-UNNAMED --add-exports java.base/sun.security.util=ALL-UNNAMED --add-exports java.security.jgss/sun.security.jgss=ALL-UNNAMED --add-exports java.security.jgss/sun.security.jgss.krb5=ALL-UNNAMED --add-exports java.security.jgss/sun.security.krb5=ALL-UNNAMED --add-opens java.security.jgss/sun.security.krb5=ALL-UNNAMED --add-exports java.security.jgss/sun.security.krb5.internal=ALL-UNNAMED --add-opens java.security.jgss/sun.security.krb5.internal=ALL-UNNAMED --add-exports java.security.jgss/sun.security.krb5.internal.ccache=ALL-UNNAMED --add-exports java.security.jgss/sun.security.krb5.internal.rcache=ALL-UNNAMED --add-exports java.security.jgss/sun.security.krb5.internal.crypto=ALL-UNNAMED --add-exports java.security.jgss/sun.security.krb5.internal.ktab=ALL-UNNAMED │ │ │ │ │ -Process id: 3099786 │ │ │ │ │ -finished: Thu Oct 22 12:30:18.851 UTC 2026 │ │ │ │ │ -elapsed time (seconds): 1.625 │ │ │ │ │ +Process id: 2850505 │ │ │ │ │ +finished: Fri Oct 30 04:03:42.803 UTC 2026 │ │ │ │ │ +elapsed time (seconds): 1.673 │ │ │ │ │ ----------configuration:(15/1053)---------- │ │ │ │ │ Boot Layer │ │ │ │ │ add modules: java.base java.security.jgss jdk.security.auth jdk.security.jgss │ │ │ │ │ add exports: java.base/jdk.internal.misc ALL-UNNAMED │ │ │ │ │ java.base/sun.security.util ALL-UNNAMED │ │ │ │ │ java.security.jgss/sun.security.jgss ALL-UNNAMED │ │ │ │ │ java.security.jgss/sun.security.jgss.krb5 ALL-UNNAMED │ │ │ │ │ @@ -259,27 +259,27 @@ │ │ │ │ │ java.security.jgss/sun.security.krb5.internal.crypto ALL-UNNAMED │ │ │ │ │ java.security.jgss/sun.security.krb5.internal.ktab ALL-UNNAMED │ │ │ │ │ java.security.jgss/sun.security.krb5.internal.rcache ALL-UNNAMED │ │ │ │ │ add opens: java.security.jgss/sun.security.krb5 ALL-UNNAMED │ │ │ │ │ java.security.jgss/sun.security.krb5.internal ALL-UNNAMED │ │ │ │ │ │ │ │ │ │ ----------System.out:(24/852)---------- │ │ │ │ │ -Start KDC on 15376 │ │ │ │ │ +Start KDC on 15836 │ │ │ │ │ ----------------------------------------------- │ │ │ │ │ >>>>> UDP packet received │ │ │ │ │ -RABBIT.HOLE:15376> dummy@RABBIT.HOLE sends AS-REQ for krbtgt/RABBIT.HOLE@RABBIT.HOLE, KDCOptions: │ │ │ │ │ +RABBIT.HOLE:15836> dummy@RABBIT.HOLE sends AS-REQ for krbtgt/RABBIT.HOLE@RABBIT.HOLE, KDCOptions: │ │ │ │ │ KrbException: Additional pre-authentication required (25) │ │ │ │ │ at KDC.processAsReq(KDC.java:1335) │ │ │ │ │ at KDC.processMessage(KDC.java:809) │ │ │ │ │ at KDC$1.run(KDC.java:1565) │ │ │ │ │ Error 25 Additional pre-authentication required │ │ │ │ │ >>>>> UDP request honored │ │ │ │ │ ----------------------------------------------- │ │ │ │ │ >>>>> UDP packet received │ │ │ │ │ -RABBIT.HOLE:15376> dummy@RABBIT.HOLE sends AS-REQ for krbtgt/RABBIT.HOLE@RABBIT.HOLE, KDCOptions: │ │ │ │ │ +RABBIT.HOLE:15836> dummy@RABBIT.HOLE sends AS-REQ for krbtgt/RABBIT.HOLE@RABBIT.HOLE, KDCOptions: │ │ │ │ │ Return dummy@RABBIT.HOLE ticket for krbtgt/RABBIT.HOLE@RABBIT.HOLE, flags INITIAL;PRE-AUTHENT │ │ │ │ │ >>>>> UDP request honored │ │ │ │ │ /10.0.0.10 │ │ │ │ │ extra1 found │ │ │ │ │ /10.0.0.11 │ │ │ │ │ extra2 found │ │ │ │ │ /10.0.0.12 │ │ ├── ./usr/share/doc/openjdk-21-jre-headless/test-arm64/jtreg_output-hotspot.log.gz │ │ │ ├── jtreg_output-hotspot.log │ │ │ │ @@ -3148,31 +3148,31 @@ │ │ │ │ Results written to /tmp/hotspot/JTwork │ │ │ │ [debian/tests/jtreg-autopkgtest.sh] nothing to cleanup │ │ │ │ grep: debian/tests/hotspot-archs: No such file or directory │ │ │ │ Unable to compare jtreg results: no build jtreport found for hotspot/arm64. │ │ │ │ Reason: '/usr/share/doc/openjdk-21-jre-headless//test-arm64/jtreport-hotspot.tar.gz' does not exist. │ │ │ │ Command exited with non-zero status 77 │ │ │ │ Command being timed: "debian/tests/hotspot" │ │ │ │ - User time (seconds): 13963.24 │ │ │ │ - System time (seconds): 1986.21 │ │ │ │ - Percent of CPU this job got: 142% │ │ │ │ - Elapsed (wall clock) time (h:mm:ss or m:ss): 3:06:05 │ │ │ │ + User time (seconds): 14242.55 │ │ │ │ + System time (seconds): 1974.24 │ │ │ │ + Percent of CPU this job got: 139% │ │ │ │ + Elapsed (wall clock) time (h:mm:ss or m:ss): 3:13:41 │ │ │ │ Average shared text size (kbytes): 0 │ │ │ │ Average unshared data size (kbytes): 0 │ │ │ │ Average stack size (kbytes): 0 │ │ │ │ Average total size (kbytes): 0 │ │ │ │ - Maximum resident set size (kbytes): 6219468 │ │ │ │ + Maximum resident set size (kbytes): 7694452 │ │ │ │ Average resident set size (kbytes): 0 │ │ │ │ - Major (requiring I/O) page faults: 4149 │ │ │ │ - Minor (reclaiming a frame) page faults: 102220230 │ │ │ │ - Voluntary context switches: 60426512 │ │ │ │ - Involuntary context switches: 4813687 │ │ │ │ + Major (requiring I/O) page faults: 1010 │ │ │ │ + Minor (reclaiming a frame) page faults: 131351410 │ │ │ │ + Voluntary context switches: 51265861 │ │ │ │ + Involuntary context switches: 1831299 │ │ │ │ Swaps: 0 │ │ │ │ - File system inputs: 1415304 │ │ │ │ - File system outputs: 0 │ │ │ │ + File system inputs: 2970832 │ │ │ │ + File system outputs: 26909432 │ │ │ │ Socket messages sent: 0 │ │ │ │ Socket messages received: 0 │ │ │ │ Signals delivered: 0 │ │ │ │ Page size (bytes): 4096 │ │ │ │ Exit status: 77 │ │ │ │ ===== END check-hotspot ===== │ │ │ │ ===== START check-langtools ===== │ │ │ │ @@ -7631,31 +7631,31 @@ │ │ │ │ Results written to /tmp/langtools/JTwork │ │ │ │ [debian/tests/jtreg-autopkgtest.sh] nothing to cleanup │ │ │ │ grep: debian/tests/hotspot-archs: No such file or directory │ │ │ │ Unable to compare jtreg results: no build jtreport found for hotspot/arm64. │ │ │ │ Reason: '/usr/share/doc/openjdk-21-jre-headless//test-arm64/jtreport-hotspot.tar.gz' does not exist. │ │ │ │ Command exited with non-zero status 77 │ │ │ │ Command being timed: "debian/tests/langtools" │ │ │ │ - User time (seconds): 4942.76 │ │ │ │ - System time (seconds): 356.55 │ │ │ │ - Percent of CPU this job got: 146% │ │ │ │ - Elapsed (wall clock) time (h:mm:ss or m:ss): 1:00:19 │ │ │ │ + User time (seconds): 4526.64 │ │ │ │ + System time (seconds): 342.72 │ │ │ │ + Percent of CPU this job got: 159% │ │ │ │ + Elapsed (wall clock) time (h:mm:ss or m:ss): 50:54.76 │ │ │ │ Average shared text size (kbytes): 0 │ │ │ │ Average unshared data size (kbytes): 0 │ │ │ │ Average stack size (kbytes): 0 │ │ │ │ Average total size (kbytes): 0 │ │ │ │ - Maximum resident set size (kbytes): 5541904 │ │ │ │ + Maximum resident set size (kbytes): 7687792 │ │ │ │ Average resident set size (kbytes): 0 │ │ │ │ - Major (requiring I/O) page faults: 109 │ │ │ │ - Minor (reclaiming a frame) page faults: 11174972 │ │ │ │ - Voluntary context switches: 3966221 │ │ │ │ - Involuntary context switches: 53348 │ │ │ │ + Major (requiring I/O) page faults: 149 │ │ │ │ + Minor (reclaiming a frame) page faults: 12174396 │ │ │ │ + Voluntary context switches: 3928222 │ │ │ │ + Involuntary context switches: 49179 │ │ │ │ Swaps: 0 │ │ │ │ - File system inputs: 159960 │ │ │ │ - File system outputs: 0 │ │ │ │ + File system inputs: 235584 │ │ │ │ + File system outputs: 3198944 │ │ │ │ Socket messages sent: 0 │ │ │ │ Socket messages received: 0 │ │ │ │ Signals delivered: 0 │ │ │ │ Page size (bytes): 4096 │ │ │ │ Exit status: 77 │ │ │ │ ===== END check-langtools ===== │ │ │ │ ===== START check-jaxp ===== │ │ │ │ @@ -8181,62 +8181,62 @@ │ │ │ │ Results written to /tmp/jaxp/JTwork │ │ │ │ [debian/tests/jtreg-autopkgtest.sh] nothing to cleanup │ │ │ │ grep: debian/tests/hotspot-archs: No such file or directory │ │ │ │ Unable to compare jtreg results: no build jtreport found for hotspot/arm64. │ │ │ │ Reason: '/usr/share/doc/openjdk-21-jre-headless//test-arm64/jtreport-hotspot.tar.gz' does not exist. │ │ │ │ Command exited with non-zero status 77 │ │ │ │ Command being timed: "debian/tests/jaxp" │ │ │ │ - User time (seconds): 3259.83 │ │ │ │ - System time (seconds): 199.54 │ │ │ │ - Percent of CPU this job got: 276% │ │ │ │ - Elapsed (wall clock) time (h:mm:ss or m:ss): 20:50.34 │ │ │ │ + User time (seconds): 3610.57 │ │ │ │ + System time (seconds): 203.86 │ │ │ │ + Percent of CPU this job got: 281% │ │ │ │ + Elapsed (wall clock) time (h:mm:ss or m:ss): 22:35.14 │ │ │ │ Average shared text size (kbytes): 0 │ │ │ │ Average unshared data size (kbytes): 0 │ │ │ │ Average stack size (kbytes): 0 │ │ │ │ Average total size (kbytes): 0 │ │ │ │ - Maximum resident set size (kbytes): 428316 │ │ │ │ + Maximum resident set size (kbytes): 516304 │ │ │ │ Average resident set size (kbytes): 0 │ │ │ │ - Major (requiring I/O) page faults: 38 │ │ │ │ - Minor (reclaiming a frame) page faults: 11686046 │ │ │ │ - Voluntary context switches: 2993588 │ │ │ │ - Involuntary context switches: 22271 │ │ │ │ + Major (requiring I/O) page faults: 4 │ │ │ │ + Minor (reclaiming a frame) page faults: 11450014 │ │ │ │ + Voluntary context switches: 2823712 │ │ │ │ + Involuntary context switches: 58313 │ │ │ │ Swaps: 0 │ │ │ │ - File system inputs: 155920 │ │ │ │ - File system outputs: 0 │ │ │ │ + File system inputs: 759152 │ │ │ │ + File system outputs: 2898072 │ │ │ │ Socket messages sent: 0 │ │ │ │ Socket messages received: 0 │ │ │ │ Signals delivered: 0 │ │ │ │ Page size (bytes): 4096 │ │ │ │ Exit status: 77 │ │ │ │ ===== END check-jaxp ===== │ │ │ │ ===== START check-jdk ===== │ │ │ │ mkdir -p jtreg-test-output/jdk │ │ │ │ BOOTJDK_HOME=/usr/lib/jvm/java-21-openjdk-arm64 JTREG_OPTIONS= VMNAME=hotspot JDK_TO_TEST=build/bootcycle-build/images/jdk \ │ │ │ │ AUTOPKGTEST_TMP=/tmp/ AUTOPKGTEST_ARTIFACTS=jtreg-test-output/ \ │ │ │ │ /usr/bin/time -v debian/tests/jdk | tee jtreg-test-output/check-jdk.log │ │ │ │ │ │ │ │ -(xfwm4:2613947): atspi-WARNING **: 08:14:23.168: AT-SPI: Error retrieving accessibility bus address: org.freedesktop.DBus.Error.ServiceUnknown: The name org.a11y.Bus was not provided by any .service files │ │ │ │ -dbus-daemon[2613936]: [session uid=999 pid=2613936 pidfd=5] Activating service name='org.xfce.Xfconf' requested by ':1.1' (uid=999 pid=2613947 comm="xfwm4") │ │ │ │ -dbus-daemon[2613936]: [session uid=999 pid=2613936 pidfd=5] Successfully activated service 'org.xfce.Xfconf' │ │ │ │ +(xfwm4:2357401): atspi-WARNING **: 23:33:24.294: AT-SPI: Error retrieving accessibility bus address: org.freedesktop.DBus.Error.ServiceUnknown: The name org.a11y.Bus was not provided by any .service files │ │ │ │ +dbus-daemon[2357390]: [session uid=999 pid=2357390 pidfd=5] Activating service name='org.xfce.Xfconf' requested by ':1.1' (uid=999 pid=2357401 comm="xfwm4") │ │ │ │ +dbus-daemon[2357390]: [session uid=999 pid=2357390 pidfd=5] Successfully activated service 'org.xfce.Xfconf' │ │ │ │ WARNING: Glycin running without sandbox. Bubblewrap (bwrap) doesn't work in the environment. │ │ │ │ dpkg: error: --compare-versions takes three arguments: │ │ │ │ │ │ │ │ Type dpkg --help for help about installing and deinstalling packages [*]; │ │ │ │ Use 'apt' or 'aptitude' for user-friendly package management; │ │ │ │ Type dpkg -Dhelp for a list of dpkg debug flag values; │ │ │ │ Type dpkg --force-help for a list of forcing options; │ │ │ │ Type dpkg-deb --help for help about manipulating *.deb files; │ │ │ │ │ │ │ │ Options marked [*] produce a lot of output - pipe it through 'less' or 'more' ! │ │ │ │ - │ │ │ │ -(xfwm4:2613947): xfwm4-WARNING **: 08:14:26.075: Another compositing manager is running on screen 0 │ │ │ │ - │ │ │ │ -(xfwm4:2613947): xfwm4-WARNING **: 08:14:26.079: Failed to connect to session manager: Failed to connect to the session manager: SESSION_MANAGER environment variable not defined │ │ │ │ Directory "/tmp/jdk/JTwork" not found: creating │ │ │ │ Directory "jtreg-test-output/jdk/0/JTreport" not found: creating │ │ │ │ + │ │ │ │ +(xfwm4:2357401): xfwm4-WARNING **: 23:33:27.818: Another compositing manager is running on screen 0 │ │ │ │ + │ │ │ │ +(xfwm4:2357401): xfwm4-WARNING **: 23:33:27.822: Failed to connect to session manager: Failed to connect to the session manager: SESSION_MANAGER environment variable not defined │ │ │ │ Passed: com/sun/jdi/AcceptTimeout.java │ │ │ │ Passed: com/sun/jdi/AccessSpecifierTest.java │ │ │ │ Passed: com/sun/jdi/AfterThreadDeathTest.java │ │ │ │ Passed: com/sun/jdi/ArrayRangeTest.java │ │ │ │ Passed: com/sun/jdi/ConstantPoolInfo.java │ │ │ │ Passed: com/sun/jdi/CountFilterTest.java │ │ │ │ Passed: com/sun/jdi/EarlyReturnNegativeTest.java │ │ │ │ @@ -14772,38 +14772,38 @@ │ │ │ │ FAILED: java/net/MulticastSocket/SetLoopbackMode.java │ │ │ │ FAILED: java/net/MulticastSocket/SetLoopbackModeIPv4.java │ │ │ │ FAILED: java/net/MulticastSocket/Test.java │ │ │ │ FAILED: java/net/SocketOption/OptionsTest.java │ │ │ │ FAILED: java/net/SocketPermission/SocketPermissionTest.java │ │ │ │ FAILED: sun/security/krb5/auto/Addresses.java │ │ │ │ Test results: failed: 9; excluded: 38; did not match keywords: 37; did not match prior status: 6,605 │ │ │ │ +Error: Some tests failed or other problems occurred. │ │ │ │ Framework-based tests: 8 = 8 TestNG + 0 JUnit │ │ │ │ Report written to /build/reproducible-path/openjdk-21-21.0.13+9/jtreg-test-output/jdk/2/JTreport/html/report.html │ │ │ │ Results written to /tmp/jdk/JTwork │ │ │ │ -Error: Some tests failed or other problems occurred. │ │ │ │ [debian/tests/jtreg-autopkgtest.sh] nothing to cleanup │ │ │ │ Command exited with non-zero status 2 │ │ │ │ Command being timed: "debian/tests/jdk" │ │ │ │ - User time (seconds): 22228.73 │ │ │ │ - System time (seconds): 1868.59 │ │ │ │ - Percent of CPU this job got: 156% │ │ │ │ - Elapsed (wall clock) time (h:mm:ss or m:ss): 4:16:25 │ │ │ │ + User time (seconds): 23726.34 │ │ │ │ + System time (seconds): 1891.90 │ │ │ │ + Percent of CPU this job got: 157% │ │ │ │ + Elapsed (wall clock) time (h:mm:ss or m:ss): 4:30:48 │ │ │ │ Average shared text size (kbytes): 0 │ │ │ │ Average unshared data size (kbytes): 0 │ │ │ │ Average stack size (kbytes): 0 │ │ │ │ Average total size (kbytes): 0 │ │ │ │ - Maximum resident set size (kbytes): 15232128 │ │ │ │ + Maximum resident set size (kbytes): 15137956 │ │ │ │ Average resident set size (kbytes): 0 │ │ │ │ - Major (requiring I/O) page faults: 1791 │ │ │ │ - Minor (reclaiming a frame) page faults: 73053746 │ │ │ │ - Voluntary context switches: 39755571 │ │ │ │ - Involuntary context switches: 1788511 │ │ │ │ + Major (requiring I/O) page faults: 230 │ │ │ │ + Minor (reclaiming a frame) page faults: 82624123 │ │ │ │ + Voluntary context switches: 42363550 │ │ │ │ + Involuntary context switches: 2635433 │ │ │ │ Swaps: 0 │ │ │ │ - File system inputs: 1840424 │ │ │ │ - File system outputs: 0 │ │ │ │ + File system inputs: 1580008 │ │ │ │ + File system outputs: 87354240 │ │ │ │ Socket messages sent: 0 │ │ │ │ Socket messages received: 0 │ │ │ │ Signals delivered: 0 │ │ │ │ Page size (bytes): 4096 │ │ │ │ Exit status: 2 │ │ │ │ Killed │ │ │ │ ===== END check-jdk ===== │ │ │ │ @@ -14862,29 +14862,29 @@ │ │ │ │ FAILED: java/net/SocketPermission/SocketPermissionTest.java │ │ │ │ FAILED: sun/security/krb5/auto/Addresses.java │ │ │ │ Test results: failed: 9; excluded: 38; did not match keywords: 37; did not match prior status: 6,605 │ │ │ │ Framework-based tests: 8 = 8 TestNG + 0 JUnit │ │ │ │ [debian/tests/jtreg-autopkgtest.sh] nothing to cleanup │ │ │ │ make[2]: Leaving directory '/build/reproducible-path/openjdk-21-21.0.13+9' │ │ │ │ Command being timed: "/usr/bin/make -f debian/rules -k jtregcheck TEST_SUITES=hotspot langtools jaxp jdk JTREG_OPTIONS=" │ │ │ │ - User time (seconds): 44395.73 │ │ │ │ - System time (seconds): 4412.01 │ │ │ │ - Percent of CPU this job got: 155% │ │ │ │ - Elapsed (wall clock) time (h:mm:ss or m:ss): 8:43:42 │ │ │ │ + User time (seconds): 46107.42 │ │ │ │ + System time (seconds): 4413.94 │ │ │ │ + Percent of CPU this job got: 156% │ │ │ │ + Elapsed (wall clock) time (h:mm:ss or m:ss): 8:58:01 │ │ │ │ Average shared text size (kbytes): 0 │ │ │ │ Average unshared data size (kbytes): 0 │ │ │ │ Average stack size (kbytes): 0 │ │ │ │ Average total size (kbytes): 0 │ │ │ │ - Maximum resident set size (kbytes): 15232128 │ │ │ │ + Maximum resident set size (kbytes): 15137956 │ │ │ │ Average resident set size (kbytes): 0 │ │ │ │ - Major (requiring I/O) page faults: 6092 │ │ │ │ - Minor (reclaiming a frame) page faults: 198153119 │ │ │ │ - Voluntary context switches: 107156840 │ │ │ │ - Involuntary context switches: 6677867 │ │ │ │ + Major (requiring I/O) page faults: 1396 │ │ │ │ + Minor (reclaiming a frame) page faults: 237617549 │ │ │ │ + Voluntary context switches: 100396298 │ │ │ │ + Involuntary context switches: 4574436 │ │ │ │ Swaps: 0 │ │ │ │ - File system inputs: 3571760 │ │ │ │ - File system outputs: 0 │ │ │ │ + File system inputs: 5546896 │ │ │ │ + File system outputs: 120381568 │ │ │ │ Socket messages sent: 0 │ │ │ │ Socket messages received: 0 │ │ │ │ Signals delivered: 0 │ │ │ │ Page size (bytes): 4096 │ │ │ │ Exit status: 0 │ │ ├── ./usr/share/doc/openjdk-21-jre-headless/test-arm64/jtreport-hotspot.tar.gz │ │ │ ├── jtreport-hotspot.tar │ │ │ │ ├── file list │ │ │ │ │ @@ -1,230 +1,230 @@ │ │ │ │ │ -lrwxrwxrwx 0 sbuild (999) sbuild (999) 0 2026-10-22 12:30:47.000000 jtreg-test-output/jdk/JTreport -> 2/JTreport │ │ │ │ │ -drwxr-xr-x 0 sbuild (999) sbuild (999) 0 2026-10-22 12:30:22.000000 jtreg-test-output/jdk/2/JTreport/ │ │ │ │ │ --rw-r--r-- 0 sbuild (999) sbuild (999) 708 2026-10-22 12:30:22.000000 jtreg-test-output/jdk/2/JTreport/index.html │ │ │ │ │ --rw-r--r-- 0 sbuild (999) sbuild (999) 0 2026-10-22 12:30:22.000000 jtreg-test-output/jdk/2/JTreport/reportdir.dat │ │ │ │ │ -drwxr-xr-x 0 sbuild (999) sbuild (999) 0 2026-10-22 12:30:22.000000 jtreg-test-output/jdk/2/JTreport/html/ │ │ │ │ │ --rw-r--r-- 0 sbuild (999) sbuild (999) 762781 2026-10-22 12:30:22.000000 jtreg-test-output/jdk/2/JTreport/html/notRun_gr.html │ │ │ │ │ --rw-r--r-- 0 sbuild (999) sbuild (999) 762508 2026-10-22 12:30:22.000000 jtreg-test-output/jdk/2/JTreport/html/notRun.html │ │ │ │ │ --rw-r--r-- 0 sbuild (999) sbuild (999) 522 2026-10-22 12:30:22.000000 jtreg-test-output/jdk/2/JTreport/html/error_gr.html │ │ │ │ │ --rw-r--r-- 0 sbuild (999) sbuild (999) 474 2026-10-22 12:30:22.000000 jtreg-test-output/jdk/2/JTreport/html/error.html │ │ │ │ │ --rw-r--r-- 0 sbuild (999) sbuild (999) 2751 2026-10-22 12:30:22.000000 jtreg-test-output/jdk/2/JTreport/html/failed_gr.html │ │ │ │ │ --rw-r--r-- 0 sbuild (999) sbuild (999) 2021 2026-10-22 12:30:22.000000 jtreg-test-output/jdk/2/JTreport/html/failed.html │ │ │ │ │ --rw-r--r-- 0 sbuild (999) sbuild (999) 1251629 2026-10-22 12:30:22.000000 jtreg-test-output/jdk/2/JTreport/html/passed_gr.html │ │ │ │ │ --rw-r--r-- 0 sbuild (999) sbuild (999) 1250432 2026-10-22 12:30:22.000000 jtreg-test-output/jdk/2/JTreport/html/passed.html │ │ │ │ │ --rw-r--r-- 0 sbuild (999) sbuild (999) 83175 2026-10-22 12:30:22.000000 jtreg-test-output/jdk/2/JTreport/html/excluded.html │ │ │ │ │ --rw-r--r-- 0 sbuild (999) sbuild (999) 4220 2026-10-22 12:30:22.000000 jtreg-test-output/jdk/2/JTreport/html/env.html │ │ │ │ │ --rw-r--r-- 0 sbuild (999) sbuild (999) 24356 2026-10-22 12:30:22.000000 jtreg-test-output/jdk/2/JTreport/html/config.html │ │ │ │ │ --rw-r--r-- 0 sbuild (999) sbuild (999) 307 2026-10-22 12:30:22.000000 jtreg-test-output/jdk/2/JTreport/html/report.css │ │ │ │ │ --rw-r--r-- 0 sbuild (999) sbuild (999) 1101105 2026-10-22 12:30:22.000000 jtreg-test-output/jdk/2/JTreport/html/index.html │ │ │ │ │ --rw-r--r-- 0 sbuild (999) sbuild (999) 1101105 2026-10-22 12:30:22.000000 jtreg-test-output/jdk/2/JTreport/html/report.html │ │ │ │ │ -drwxr-xr-x 0 sbuild (999) sbuild (999) 0 2026-10-22 12:30:22.000000 jtreg-test-output/jdk/2/JTreport/text/ │ │ │ │ │ --rw-r--r-- 0 sbuild (999) sbuild (999) 132 2026-10-22 12:30:22.000000 jtreg-test-output/jdk/2/JTreport/text/testng.txt │ │ │ │ │ --rw-r--r-- 0 sbuild (999) sbuild (999) 1023561 2026-10-22 12:30:22.000000 jtreg-test-output/jdk/2/JTreport/text/notRun.txt │ │ │ │ │ --rw-r--r-- 0 sbuild (999) sbuild (999) 101 2026-10-22 12:30:22.000000 jtreg-test-output/jdk/2/JTreport/text/stats.txt │ │ │ │ │ --rw-r--r-- 0 sbuild (999) sbuild (999) 116 2026-10-22 12:30:22.000000 jtreg-test-output/jdk/2/JTreport/text/timeStats.txt │ │ │ │ │ --rw-r--r-- 0 sbuild (999) sbuild (999) 21 2026-10-22 12:30:22.000000 jtreg-test-output/jdk/2/JTreport/text/tc_newfailures.txt │ │ │ │ │ --rw-r--r-- 0 sbuild (999) sbuild (999) 21 2026-10-22 12:30:22.000000 jtreg-test-output/jdk/2/JTreport/text/tc_fail2notrun.txt │ │ │ │ │ --rw-r--r-- 0 sbuild (999) sbuild (999) 20 2026-10-22 12:30:22.000000 jtreg-test-output/jdk/2/JTreport/text/tc_fail2error.txt │ │ │ │ │ --rw-r--r-- 0 sbuild (999) sbuild (999) 19 2026-10-22 12:30:22.000000 jtreg-test-output/jdk/2/JTreport/text/tc_fail2pass.txt │ │ │ │ │ --rw-r--r-- 0 sbuild (999) sbuild (999) 22 2026-10-22 12:30:22.000000 jtreg-test-output/jdk/2/JTreport/text/tc_fail2missing.txt │ │ │ │ │ --rw-r--r-- 0 sbuild (999) sbuild (999) 19 2026-10-22 12:30:22.000000 jtreg-test-output/jdk/2/JTreport/text/other_errors.txt │ │ │ │ │ --rw-r--r-- 0 sbuild (999) sbuild (999) 416 2026-10-22 12:30:22.000000 jtreg-test-output/jdk/2/JTreport/text/newfailures.txt │ │ │ │ │ --rw-r--r-- 0 sbuild (999) sbuild (999) 16 2026-10-22 12:30:22.000000 jtreg-test-output/jdk/2/JTreport/text/fail2fail.txt │ │ │ │ │ --rw-r--r-- 0 sbuild (999) sbuild (999) 18 2026-10-22 12:30:22.000000 jtreg-test-output/jdk/2/JTreport/text/fail2notrun.txt │ │ │ │ │ --rw-r--r-- 0 sbuild (999) sbuild (999) 17 2026-10-22 12:30:22.000000 jtreg-test-output/jdk/2/JTreport/text/faiL2error.txt │ │ │ │ │ --rw-r--r-- 0 sbuild (999) sbuild (999) 16 2026-10-22 12:30:22.000000 jtreg-test-output/jdk/2/JTreport/text/fail2pass.txt │ │ │ │ │ --rw-r--r-- 0 sbuild (999) sbuild (999) 19 2026-10-22 12:30:22.000000 jtreg-test-output/jdk/2/JTreport/text/fail2missing.txt │ │ │ │ │ --rw-r--r-- 0 sbuild (999) sbuild (999) 890230 2026-10-22 12:30:22.000000 jtreg-test-output/jdk/2/JTreport/text/summary.txt │ │ │ │ │ --rw-r--r-- 0 sbuild (999) sbuild (999) 548 2026-10-22 12:30:09.000000 jtreg-test-output/jdk/2/JTreport/text/cmdArgs.txt │ │ │ │ │ -drwxr-xr-x 0 sbuild (999) sbuild (999) 0 2026-10-22 12:29:44.000000 jtreg-test-output/jdk/1/JTreport/ │ │ │ │ │ --rw-r--r-- 0 sbuild (999) sbuild (999) 708 2026-10-22 12:29:44.000000 jtreg-test-output/jdk/1/JTreport/index.html │ │ │ │ │ --rw-r--r-- 0 sbuild (999) sbuild (999) 0 2026-10-22 12:29:44.000000 jtreg-test-output/jdk/1/JTreport/reportdir.dat │ │ │ │ │ -drwxr-xr-x 0 sbuild (999) sbuild (999) 0 2026-10-22 12:29:44.000000 jtreg-test-output/jdk/1/JTreport/html/ │ │ │ │ │ --rw-r--r-- 0 sbuild (999) sbuild (999) 762781 2026-10-22 12:29:44.000000 jtreg-test-output/jdk/1/JTreport/html/notRun_gr.html │ │ │ │ │ --rw-r--r-- 0 sbuild (999) sbuild (999) 762508 2026-10-22 12:29:44.000000 jtreg-test-output/jdk/1/JTreport/html/notRun.html │ │ │ │ │ --rw-r--r-- 0 sbuild (999) sbuild (999) 522 2026-10-22 12:29:44.000000 jtreg-test-output/jdk/1/JTreport/html/error_gr.html │ │ │ │ │ --rw-r--r-- 0 sbuild (999) sbuild (999) 474 2026-10-22 12:29:44.000000 jtreg-test-output/jdk/1/JTreport/html/error.html │ │ │ │ │ --rw-r--r-- 0 sbuild (999) sbuild (999) 2751 2026-10-22 12:29:44.000000 jtreg-test-output/jdk/1/JTreport/html/failed_gr.html │ │ │ │ │ --rw-r--r-- 0 sbuild (999) sbuild (999) 2021 2026-10-22 12:29:44.000000 jtreg-test-output/jdk/1/JTreport/html/failed.html │ │ │ │ │ --rw-r--r-- 0 sbuild (999) sbuild (999) 1251629 2026-10-22 12:29:44.000000 jtreg-test-output/jdk/1/JTreport/html/passed_gr.html │ │ │ │ │ --rw-r--r-- 0 sbuild (999) sbuild (999) 1250432 2026-10-22 12:29:44.000000 jtreg-test-output/jdk/1/JTreport/html/passed.html │ │ │ │ │ --rw-r--r-- 0 sbuild (999) sbuild (999) 83175 2026-10-22 12:29:44.000000 jtreg-test-output/jdk/1/JTreport/html/excluded.html │ │ │ │ │ --rw-r--r-- 0 sbuild (999) sbuild (999) 4220 2026-10-22 12:29:44.000000 jtreg-test-output/jdk/1/JTreport/html/env.html │ │ │ │ │ --rw-r--r-- 0 sbuild (999) sbuild (999) 24356 2026-10-22 12:29:44.000000 jtreg-test-output/jdk/1/JTreport/html/config.html │ │ │ │ │ --rw-r--r-- 0 sbuild (999) sbuild (999) 307 2026-10-22 12:29:43.000000 jtreg-test-output/jdk/1/JTreport/html/report.css │ │ │ │ │ --rw-r--r-- 0 sbuild (999) sbuild (999) 1101105 2026-10-22 12:29:44.000000 jtreg-test-output/jdk/1/JTreport/html/index.html │ │ │ │ │ --rw-r--r-- 0 sbuild (999) sbuild (999) 1101105 2026-10-22 12:29:44.000000 jtreg-test-output/jdk/1/JTreport/html/report.html │ │ │ │ │ -drwxr-xr-x 0 sbuild (999) sbuild (999) 0 2026-10-22 12:29:44.000000 jtreg-test-output/jdk/1/JTreport/text/ │ │ │ │ │ --rw-r--r-- 0 sbuild (999) sbuild (999) 132 2026-10-22 12:29:44.000000 jtreg-test-output/jdk/1/JTreport/text/testng.txt │ │ │ │ │ --rw-r--r-- 0 sbuild (999) sbuild (999) 1023561 2026-10-22 12:29:44.000000 jtreg-test-output/jdk/1/JTreport/text/notRun.txt │ │ │ │ │ --rw-r--r-- 0 sbuild (999) sbuild (999) 101 2026-10-22 12:29:44.000000 jtreg-test-output/jdk/1/JTreport/text/stats.txt │ │ │ │ │ --rw-r--r-- 0 sbuild (999) sbuild (999) 116 2026-10-22 12:29:44.000000 jtreg-test-output/jdk/1/JTreport/text/timeStats.txt │ │ │ │ │ --rw-r--r-- 0 sbuild (999) sbuild (999) 21 2026-10-22 12:29:44.000000 jtreg-test-output/jdk/1/JTreport/text/tc_newfailures.txt │ │ │ │ │ --rw-r--r-- 0 sbuild (999) sbuild (999) 21 2026-10-22 12:29:44.000000 jtreg-test-output/jdk/1/JTreport/text/tc_fail2notrun.txt │ │ │ │ │ --rw-r--r-- 0 sbuild (999) sbuild (999) 20 2026-10-22 12:29:44.000000 jtreg-test-output/jdk/1/JTreport/text/tc_fail2error.txt │ │ │ │ │ --rw-r--r-- 0 sbuild (999) sbuild (999) 19 2026-10-22 12:29:44.000000 jtreg-test-output/jdk/1/JTreport/text/tc_fail2pass.txt │ │ │ │ │ --rw-r--r-- 0 sbuild (999) sbuild (999) 22 2026-10-22 12:29:44.000000 jtreg-test-output/jdk/1/JTreport/text/tc_fail2missing.txt │ │ │ │ │ --rw-r--r-- 0 sbuild (999) sbuild (999) 19 2026-10-22 12:29:44.000000 jtreg-test-output/jdk/1/JTreport/text/other_errors.txt │ │ │ │ │ --rw-r--r-- 0 sbuild (999) sbuild (999) 416 2026-10-22 12:29:44.000000 jtreg-test-output/jdk/1/JTreport/text/newfailures.txt │ │ │ │ │ --rw-r--r-- 0 sbuild (999) sbuild (999) 16 2026-10-22 12:29:44.000000 jtreg-test-output/jdk/1/JTreport/text/fail2fail.txt │ │ │ │ │ --rw-r--r-- 0 sbuild (999) sbuild (999) 18 2026-10-22 12:29:44.000000 jtreg-test-output/jdk/1/JTreport/text/fail2notrun.txt │ │ │ │ │ --rw-r--r-- 0 sbuild (999) sbuild (999) 17 2026-10-22 12:29:44.000000 jtreg-test-output/jdk/1/JTreport/text/faiL2error.txt │ │ │ │ │ --rw-r--r-- 0 sbuild (999) sbuild (999) 16 2026-10-22 12:29:44.000000 jtreg-test-output/jdk/1/JTreport/text/fail2pass.txt │ │ │ │ │ --rw-r--r-- 0 sbuild (999) sbuild (999) 19 2026-10-22 12:29:44.000000 jtreg-test-output/jdk/1/JTreport/text/fail2missing.txt │ │ │ │ │ --rw-r--r-- 0 sbuild (999) sbuild (999) 890230 2026-10-22 12:29:44.000000 jtreg-test-output/jdk/1/JTreport/text/summary.txt │ │ │ │ │ --rw-r--r-- 0 sbuild (999) sbuild (999) 548 2026-10-22 12:29:31.000000 jtreg-test-output/jdk/1/JTreport/text/cmdArgs.txt │ │ │ │ │ -drwxr-xr-x 0 sbuild (999) sbuild (999) 0 2026-10-22 12:29:06.000000 jtreg-test-output/jdk/0/JTreport/ │ │ │ │ │ --rw-r--r-- 0 sbuild (999) sbuild (999) 708 2026-10-22 12:29:06.000000 jtreg-test-output/jdk/0/JTreport/index.html │ │ │ │ │ --rw-r--r-- 0 sbuild (999) sbuild (999) 0 2026-10-22 12:29:06.000000 jtreg-test-output/jdk/0/JTreport/reportdir.dat │ │ │ │ │ -drwxr-xr-x 0 sbuild (999) sbuild (999) 0 2026-10-22 12:29:06.000000 jtreg-test-output/jdk/0/JTreport/html/ │ │ │ │ │ --rw-r--r-- 0 sbuild (999) sbuild (999) 20685 2026-10-22 12:29:06.000000 jtreg-test-output/jdk/0/JTreport/html/notRun_gr.html │ │ │ │ │ --rw-r--r-- 0 sbuild (999) sbuild (999) 20340 2026-10-22 12:29:06.000000 jtreg-test-output/jdk/0/JTreport/html/notRun.html │ │ │ │ │ --rw-r--r-- 0 sbuild (999) sbuild (999) 522 2026-10-22 12:29:06.000000 jtreg-test-output/jdk/0/JTreport/html/error_gr.html │ │ │ │ │ --rw-r--r-- 0 sbuild (999) sbuild (999) 474 2026-10-22 12:29:06.000000 jtreg-test-output/jdk/0/JTreport/html/error.html │ │ │ │ │ --rw-r--r-- 0 sbuild (999) sbuild (999) 2751 2026-10-22 12:29:06.000000 jtreg-test-output/jdk/0/JTreport/html/failed_gr.html │ │ │ │ │ --rw-r--r-- 0 sbuild (999) sbuild (999) 2021 2026-10-22 12:29:06.000000 jtreg-test-output/jdk/0/JTreport/html/failed.html │ │ │ │ │ --rw-r--r-- 0 sbuild (999) sbuild (999) 1251629 2026-10-22 12:29:06.000000 jtreg-test-output/jdk/0/JTreport/html/passed_gr.html │ │ │ │ │ --rw-r--r-- 0 sbuild (999) sbuild (999) 1250432 2026-10-22 12:29:06.000000 jtreg-test-output/jdk/0/JTreport/html/passed.html │ │ │ │ │ --rw-r--r-- 0 sbuild (999) sbuild (999) 83175 2026-10-22 12:29:06.000000 jtreg-test-output/jdk/0/JTreport/html/excluded.html │ │ │ │ │ --rw-r--r-- 0 sbuild (999) sbuild (999) 4201 2026-10-22 12:29:06.000000 jtreg-test-output/jdk/0/JTreport/html/env.html │ │ │ │ │ --rw-r--r-- 0 sbuild (999) sbuild (999) 23924 2026-10-22 12:29:06.000000 jtreg-test-output/jdk/0/JTreport/html/config.html │ │ │ │ │ --rw-r--r-- 0 sbuild (999) sbuild (999) 307 2026-10-22 12:29:05.000000 jtreg-test-output/jdk/0/JTreport/html/report.css │ │ │ │ │ --rw-r--r-- 0 sbuild (999) sbuild (999) 1123763 2026-10-22 12:29:06.000000 jtreg-test-output/jdk/0/JTreport/html/index.html │ │ │ │ │ --rw-r--r-- 0 sbuild (999) sbuild (999) 1123763 2026-10-22 12:29:06.000000 jtreg-test-output/jdk/0/JTreport/html/report.html │ │ │ │ │ -drwxr-xr-x 0 sbuild (999) sbuild (999) 0 2026-10-22 12:29:06.000000 jtreg-test-output/jdk/0/JTreport/text/ │ │ │ │ │ --rw-r--r-- 0 sbuild (999) sbuild (999) 86012 2026-10-22 12:29:06.000000 jtreg-test-output/jdk/0/JTreport/text/junit.txt │ │ │ │ │ --rw-r--r-- 0 sbuild (999) sbuild (999) 131917 2026-10-22 12:29:06.000000 jtreg-test-output/jdk/0/JTreport/text/testng.txt │ │ │ │ │ --rw-r--r-- 0 sbuild (999) sbuild (999) 26283 2026-10-22 12:29:06.000000 jtreg-test-output/jdk/0/JTreport/text/notRun.txt │ │ │ │ │ --rw-r--r-- 0 sbuild (999) sbuild (999) 172 2026-10-22 12:29:06.000000 jtreg-test-output/jdk/0/JTreport/text/stats.txt │ │ │ │ │ --rw-r--r-- 0 sbuild (999) sbuild (999) 983 2026-10-22 12:29:06.000000 jtreg-test-output/jdk/0/JTreport/text/timeStats.txt │ │ │ │ │ --rw-r--r-- 0 sbuild (999) sbuild (999) 21 2026-10-22 12:29:06.000000 jtreg-test-output/jdk/0/JTreport/text/tc_newfailures.txt │ │ │ │ │ --rw-r--r-- 0 sbuild (999) sbuild (999) 21 2026-10-22 12:29:06.000000 jtreg-test-output/jdk/0/JTreport/text/tc_fail2notrun.txt │ │ │ │ │ --rw-r--r-- 0 sbuild (999) sbuild (999) 20 2026-10-22 12:29:06.000000 jtreg-test-output/jdk/0/JTreport/text/tc_fail2error.txt │ │ │ │ │ --rw-r--r-- 0 sbuild (999) sbuild (999) 19 2026-10-22 12:29:06.000000 jtreg-test-output/jdk/0/JTreport/text/tc_fail2pass.txt │ │ │ │ │ --rw-r--r-- 0 sbuild (999) sbuild (999) 22 2026-10-22 12:29:06.000000 jtreg-test-output/jdk/0/JTreport/text/tc_fail2missing.txt │ │ │ │ │ --rw-r--r-- 0 sbuild (999) sbuild (999) 19 2026-10-22 12:29:06.000000 jtreg-test-output/jdk/0/JTreport/text/other_errors.txt │ │ │ │ │ --rw-r--r-- 0 sbuild (999) sbuild (999) 416 2026-10-22 12:29:06.000000 jtreg-test-output/jdk/0/JTreport/text/newfailures.txt │ │ │ │ │ --rw-r--r-- 0 sbuild (999) sbuild (999) 16 2026-10-22 12:29:06.000000 jtreg-test-output/jdk/0/JTreport/text/fail2fail.txt │ │ │ │ │ --rw-r--r-- 0 sbuild (999) sbuild (999) 18 2026-10-22 12:29:06.000000 jtreg-test-output/jdk/0/JTreport/text/fail2notrun.txt │ │ │ │ │ --rw-r--r-- 0 sbuild (999) sbuild (999) 17 2026-10-22 12:29:06.000000 jtreg-test-output/jdk/0/JTreport/text/faiL2error.txt │ │ │ │ │ --rw-r--r-- 0 sbuild (999) sbuild (999) 16 2026-10-22 12:29:06.000000 jtreg-test-output/jdk/0/JTreport/text/fail2pass.txt │ │ │ │ │ --rw-r--r-- 0 sbuild (999) sbuild (999) 19 2026-10-22 12:29:06.000000 jtreg-test-output/jdk/0/JTreport/text/fail2missing.txt │ │ │ │ │ --rw-r--r-- 0 sbuild (999) sbuild (999) 890230 2026-10-22 12:29:06.000000 jtreg-test-output/jdk/0/JTreport/text/summary.txt │ │ │ │ │ --rw-r--r-- 0 sbuild (999) sbuild (999) 529 2026-10-22 08:14:26.000000 jtreg-test-output/jdk/0/JTreport/text/cmdArgs.txt │ │ │ │ │ -lrwxrwxrwx 0 sbuild (999) sbuild (999) 0 2026-10-22 08:14:22.000000 jtreg-test-output/jaxp/JTreport -> 0/JTreport │ │ │ │ │ -drwxr-xr-x 0 sbuild (999) sbuild (999) 0 2026-10-22 08:14:20.000000 jtreg-test-output/jaxp/0/JTreport/ │ │ │ │ │ --rw-r--r-- 0 sbuild (999) sbuild (999) 710 2026-10-22 08:14:20.000000 jtreg-test-output/jaxp/0/JTreport/index.html │ │ │ │ │ --rw-r--r-- 0 sbuild (999) sbuild (999) 0 2026-10-22 08:14:20.000000 jtreg-test-output/jaxp/0/JTreport/reportdir.dat │ │ │ │ │ -drwxr-xr-x 0 sbuild (999) sbuild (999) 0 2026-10-22 08:14:20.000000 jtreg-test-output/jaxp/0/JTreport/html/ │ │ │ │ │ --rw-r--r-- 0 sbuild (999) sbuild (999) 695 2026-10-22 08:14:20.000000 jtreg-test-output/jaxp/0/JTreport/html/notRun_gr.html │ │ │ │ │ --rw-r--r-- 0 sbuild (999) sbuild (999) 573 2026-10-22 08:14:20.000000 jtreg-test-output/jaxp/0/JTreport/html/notRun.html │ │ │ │ │ --rw-r--r-- 0 sbuild (999) sbuild (999) 521 2026-10-22 08:14:20.000000 jtreg-test-output/jaxp/0/JTreport/html/error_gr.html │ │ │ │ │ --rw-r--r-- 0 sbuild (999) sbuild (999) 473 2026-10-22 08:14:20.000000 jtreg-test-output/jaxp/0/JTreport/html/error.html │ │ │ │ │ --rw-r--r-- 0 sbuild (999) sbuild (999) 513 2026-10-22 08:14:20.000000 jtreg-test-output/jaxp/0/JTreport/html/failed_gr.html │ │ │ │ │ --rw-r--r-- 0 sbuild (999) sbuild (999) 465 2026-10-22 08:14:20.000000 jtreg-test-output/jaxp/0/JTreport/html/failed.html │ │ │ │ │ --rw-r--r-- 0 sbuild (999) sbuild (999) 110062 2026-10-22 08:14:20.000000 jtreg-test-output/jaxp/0/JTreport/html/passed_gr.html │ │ │ │ │ --rw-r--r-- 0 sbuild (999) sbuild (999) 109973 2026-10-22 08:14:20.000000 jtreg-test-output/jaxp/0/JTreport/html/passed.html │ │ │ │ │ --rw-r--r-- 0 sbuild (999) sbuild (999) 3642 2026-10-22 08:14:20.000000 jtreg-test-output/jaxp/0/JTreport/html/excluded.html │ │ │ │ │ --rw-r--r-- 0 sbuild (999) sbuild (999) 4110 2026-10-22 08:14:20.000000 jtreg-test-output/jaxp/0/JTreport/html/env.html │ │ │ │ │ --rw-r--r-- 0 sbuild (999) sbuild (999) 4423 2026-10-22 08:14:20.000000 jtreg-test-output/jaxp/0/JTreport/html/config.html │ │ │ │ │ --rw-r--r-- 0 sbuild (999) sbuild (999) 307 2026-10-22 08:14:20.000000 jtreg-test-output/jaxp/0/JTreport/html/report.css │ │ │ │ │ --rw-r--r-- 0 sbuild (999) sbuild (999) 58492 2026-10-22 08:14:20.000000 jtreg-test-output/jaxp/0/JTreport/html/index.html │ │ │ │ │ --rw-r--r-- 0 sbuild (999) sbuild (999) 58492 2026-10-22 08:14:20.000000 jtreg-test-output/jaxp/0/JTreport/html/report.html │ │ │ │ │ -drwxr-xr-x 0 sbuild (999) sbuild (999) 0 2026-10-22 08:14:20.000000 jtreg-test-output/jaxp/0/JTreport/text/ │ │ │ │ │ --rw-r--r-- 0 sbuild (999) sbuild (999) 200 2026-10-22 08:14:20.000000 jtreg-test-output/jaxp/0/JTreport/text/junit.txt │ │ │ │ │ --rw-r--r-- 0 sbuild (999) sbuild (999) 69461 2026-10-22 08:14:20.000000 jtreg-test-output/jaxp/0/JTreport/text/testng.txt │ │ │ │ │ --rw-r--r-- 0 sbuild (999) sbuild (999) 116 2026-10-22 08:14:20.000000 jtreg-test-output/jaxp/0/JTreport/text/notRun.txt │ │ │ │ │ --rw-r--r-- 0 sbuild (999) sbuild (999) 65 2026-10-22 08:14:20.000000 jtreg-test-output/jaxp/0/JTreport/text/stats.txt │ │ │ │ │ --rw-r--r-- 0 sbuild (999) sbuild (999) 154 2026-10-22 08:14:20.000000 jtreg-test-output/jaxp/0/JTreport/text/timeStats.txt │ │ │ │ │ --rw-r--r-- 0 sbuild (999) sbuild (999) 21 2026-10-22 08:14:20.000000 jtreg-test-output/jaxp/0/JTreport/text/tc_newfailures.txt │ │ │ │ │ --rw-r--r-- 0 sbuild (999) sbuild (999) 21 2026-10-22 08:14:20.000000 jtreg-test-output/jaxp/0/JTreport/text/tc_fail2notrun.txt │ │ │ │ │ --rw-r--r-- 0 sbuild (999) sbuild (999) 20 2026-10-22 08:14:20.000000 jtreg-test-output/jaxp/0/JTreport/text/tc_fail2error.txt │ │ │ │ │ --rw-r--r-- 0 sbuild (999) sbuild (999) 19 2026-10-22 08:14:20.000000 jtreg-test-output/jaxp/0/JTreport/text/tc_fail2pass.txt │ │ │ │ │ --rw-r--r-- 0 sbuild (999) sbuild (999) 22 2026-10-22 08:14:20.000000 jtreg-test-output/jaxp/0/JTreport/text/tc_fail2missing.txt │ │ │ │ │ --rw-r--r-- 0 sbuild (999) sbuild (999) 19 2026-10-22 08:14:20.000000 jtreg-test-output/jaxp/0/JTreport/text/other_errors.txt │ │ │ │ │ --rw-r--r-- 0 sbuild (999) sbuild (999) 18 2026-10-22 08:14:20.000000 jtreg-test-output/jaxp/0/JTreport/text/newfailures.txt │ │ │ │ │ --rw-r--r-- 0 sbuild (999) sbuild (999) 16 2026-10-22 08:14:20.000000 jtreg-test-output/jaxp/0/JTreport/text/fail2fail.txt │ │ │ │ │ --rw-r--r-- 0 sbuild (999) sbuild (999) 18 2026-10-22 08:14:20.000000 jtreg-test-output/jaxp/0/JTreport/text/fail2notrun.txt │ │ │ │ │ --rw-r--r-- 0 sbuild (999) sbuild (999) 17 2026-10-22 08:14:20.000000 jtreg-test-output/jaxp/0/JTreport/text/faiL2error.txt │ │ │ │ │ --rw-r--r-- 0 sbuild (999) sbuild (999) 16 2026-10-22 08:14:20.000000 jtreg-test-output/jaxp/0/JTreport/text/fail2pass.txt │ │ │ │ │ --rw-r--r-- 0 sbuild (999) sbuild (999) 19 2026-10-22 08:14:20.000000 jtreg-test-output/jaxp/0/JTreport/text/fail2missing.txt │ │ │ │ │ --rw-r--r-- 0 sbuild (999) sbuild (999) 59118 2026-10-22 08:14:20.000000 jtreg-test-output/jaxp/0/JTreport/text/summary.txt │ │ │ │ │ --rw-r--r-- 0 sbuild (999) sbuild (999) 439 2026-10-22 07:53:32.000000 jtreg-test-output/jaxp/0/JTreport/text/cmdArgs.txt │ │ │ │ │ -lrwxrwxrwx 0 sbuild (999) sbuild (999) 0 2026-10-22 07:53:32.000000 jtreg-test-output/langtools/JTreport -> 0/JTreport │ │ │ │ │ -drwxr-xr-x 0 sbuild (999) sbuild (999) 0 2026-10-22 07:53:15.000000 jtreg-test-output/langtools/0/JTreport/ │ │ │ │ │ --rw-r--r-- 0 sbuild (999) sbuild (999) 720 2026-10-22 07:53:15.000000 jtreg-test-output/langtools/0/JTreport/index.html │ │ │ │ │ --rw-r--r-- 0 sbuild (999) sbuild (999) 0 2026-10-22 07:53:15.000000 jtreg-test-output/langtools/0/JTreport/reportdir.dat │ │ │ │ │ -drwxr-xr-x 0 sbuild (999) sbuild (999) 0 2026-10-22 07:53:15.000000 jtreg-test-output/langtools/0/JTreport/html/ │ │ │ │ │ --rw-r--r-- 0 sbuild (999) sbuild (999) 2463 2026-10-22 07:53:15.000000 jtreg-test-output/langtools/0/JTreport/html/notRun_gr.html │ │ │ │ │ --rw-r--r-- 0 sbuild (999) sbuild (999) 2174 2026-10-22 07:53:15.000000 jtreg-test-output/langtools/0/JTreport/html/notRun.html │ │ │ │ │ --rw-r--r-- 0 sbuild (999) sbuild (999) 521 2026-10-22 07:53:15.000000 jtreg-test-output/langtools/0/JTreport/html/error_gr.html │ │ │ │ │ --rw-r--r-- 0 sbuild (999) sbuild (999) 473 2026-10-22 07:53:15.000000 jtreg-test-output/langtools/0/JTreport/html/error.html │ │ │ │ │ --rw-r--r-- 0 sbuild (999) sbuild (999) 513 2026-10-22 07:53:15.000000 jtreg-test-output/langtools/0/JTreport/html/failed_gr.html │ │ │ │ │ --rw-r--r-- 0 sbuild (999) sbuild (999) 465 2026-10-22 07:53:15.000000 jtreg-test-output/langtools/0/JTreport/html/failed.html │ │ │ │ │ --rw-r--r-- 0 sbuild (999) sbuild (999) 885672 2026-10-22 07:53:15.000000 jtreg-test-output/langtools/0/JTreport/html/passed_gr.html │ │ │ │ │ --rw-r--r-- 0 sbuild (999) sbuild (999) 885347 2026-10-22 07:53:15.000000 jtreg-test-output/langtools/0/JTreport/html/passed.html │ │ │ │ │ --rw-r--r-- 0 sbuild (999) sbuild (999) 6195 2026-10-22 07:53:15.000000 jtreg-test-output/langtools/0/JTreport/html/excluded.html │ │ │ │ │ --rw-r--r-- 0 sbuild (999) sbuild (999) 4125 2026-10-22 07:53:15.000000 jtreg-test-output/langtools/0/JTreport/html/env.html │ │ │ │ │ --rw-r--r-- 0 sbuild (999) sbuild (999) 10783 2026-10-22 07:53:15.000000 jtreg-test-output/langtools/0/JTreport/html/config.html │ │ │ │ │ --rw-r--r-- 0 sbuild (999) sbuild (999) 307 2026-10-22 07:53:15.000000 jtreg-test-output/langtools/0/JTreport/html/report.css │ │ │ │ │ --rw-r--r-- 0 sbuild (999) sbuild (999) 541887 2026-10-22 07:53:15.000000 jtreg-test-output/langtools/0/JTreport/html/index.html │ │ │ │ │ --rw-r--r-- 0 sbuild (999) sbuild (999) 541887 2026-10-22 07:53:15.000000 jtreg-test-output/langtools/0/JTreport/html/report.html │ │ │ │ │ -drwxr-xr-x 0 sbuild (999) sbuild (999) 0 2026-10-22 07:53:15.000000 jtreg-test-output/langtools/0/JTreport/text/ │ │ │ │ │ --rw-r--r-- 0 sbuild (999) sbuild (999) 18737 2026-10-22 07:53:15.000000 jtreg-test-output/langtools/0/JTreport/text/junit.txt │ │ │ │ │ --rw-r--r-- 0 sbuild (999) sbuild (999) 9538 2026-10-22 07:53:15.000000 jtreg-test-output/langtools/0/JTreport/text/testng.txt │ │ │ │ │ --rw-r--r-- 0 sbuild (999) sbuild (999) 1921 2026-10-22 07:53:15.000000 jtreg-test-output/langtools/0/JTreport/text/notRun.txt │ │ │ │ │ --rw-r--r-- 0 sbuild (999) sbuild (999) 120 2026-10-22 07:53:15.000000 jtreg-test-output/langtools/0/JTreport/text/stats.txt │ │ │ │ │ --rw-r--r-- 0 sbuild (999) sbuild (999) 478 2026-10-22 07:53:15.000000 jtreg-test-output/langtools/0/JTreport/text/timeStats.txt │ │ │ │ │ --rw-r--r-- 0 sbuild (999) sbuild (999) 21 2026-10-22 07:53:15.000000 jtreg-test-output/langtools/0/JTreport/text/tc_newfailures.txt │ │ │ │ │ --rw-r--r-- 0 sbuild (999) sbuild (999) 21 2026-10-22 07:53:15.000000 jtreg-test-output/langtools/0/JTreport/text/tc_fail2notrun.txt │ │ │ │ │ --rw-r--r-- 0 sbuild (999) sbuild (999) 20 2026-10-22 07:53:15.000000 jtreg-test-output/langtools/0/JTreport/text/tc_fail2error.txt │ │ │ │ │ --rw-r--r-- 0 sbuild (999) sbuild (999) 19 2026-10-22 07:53:15.000000 jtreg-test-output/langtools/0/JTreport/text/tc_fail2pass.txt │ │ │ │ │ --rw-r--r-- 0 sbuild (999) sbuild (999) 22 2026-10-22 07:53:15.000000 jtreg-test-output/langtools/0/JTreport/text/tc_fail2missing.txt │ │ │ │ │ --rw-r--r-- 0 sbuild (999) sbuild (999) 19 2026-10-22 07:53:15.000000 jtreg-test-output/langtools/0/JTreport/text/other_errors.txt │ │ │ │ │ --rw-r--r-- 0 sbuild (999) sbuild (999) 18 2026-10-22 07:53:15.000000 jtreg-test-output/langtools/0/JTreport/text/newfailures.txt │ │ │ │ │ --rw-r--r-- 0 sbuild (999) sbuild (999) 16 2026-10-22 07:53:15.000000 jtreg-test-output/langtools/0/JTreport/text/fail2fail.txt │ │ │ │ │ --rw-r--r-- 0 sbuild (999) sbuild (999) 18 2026-10-22 07:53:15.000000 jtreg-test-output/langtools/0/JTreport/text/fail2notrun.txt │ │ │ │ │ --rw-r--r-- 0 sbuild (999) sbuild (999) 17 2026-10-22 07:53:15.000000 jtreg-test-output/langtools/0/JTreport/text/faiL2error.txt │ │ │ │ │ --rw-r--r-- 0 sbuild (999) sbuild (999) 16 2026-10-22 07:53:15.000000 jtreg-test-output/langtools/0/JTreport/text/fail2pass.txt │ │ │ │ │ --rw-r--r-- 0 sbuild (999) sbuild (999) 19 2026-10-22 07:53:15.000000 jtreg-test-output/langtools/0/JTreport/text/fail2missing.txt │ │ │ │ │ --rw-r--r-- 0 sbuild (999) sbuild (999) 643764 2026-10-22 07:53:15.000000 jtreg-test-output/langtools/0/JTreport/text/summary.txt │ │ │ │ │ --rw-r--r-- 0 sbuild (999) sbuild (999) 454 2026-10-22 06:53:12.000000 jtreg-test-output/langtools/0/JTreport/text/cmdArgs.txt │ │ │ │ │ -lrwxrwxrwx 0 sbuild (999) sbuild (999) 0 2026-10-22 06:53:12.000000 jtreg-test-output/hotspot/JTreport -> 0/JTreport │ │ │ │ │ -drwxr-xr-x 0 sbuild (999) sbuild (999) 0 2026-10-22 06:53:00.000000 jtreg-test-output/hotspot/0/JTreport/ │ │ │ │ │ --rw-r--r-- 0 sbuild (999) sbuild (999) 722 2026-10-22 06:53:00.000000 jtreg-test-output/hotspot/0/JTreport/index.html │ │ │ │ │ --rw-r--r-- 0 sbuild (999) sbuild (999) 0 2026-10-22 06:53:00.000000 jtreg-test-output/hotspot/0/JTreport/reportdir.dat │ │ │ │ │ -drwxr-xr-x 0 sbuild (999) sbuild (999) 0 2026-10-22 06:53:00.000000 jtreg-test-output/hotspot/0/JTreport/html/ │ │ │ │ │ --rw-r--r-- 0 sbuild (999) sbuild (999) 38204 2026-10-22 06:53:00.000000 jtreg-test-output/hotspot/0/JTreport/html/notRun_gr.html │ │ │ │ │ --rw-r--r-- 0 sbuild (999) sbuild (999) 37915 2026-10-22 06:53:00.000000 jtreg-test-output/hotspot/0/JTreport/html/notRun.html │ │ │ │ │ --rw-r--r-- 0 sbuild (999) sbuild (999) 521 2026-10-22 06:53:00.000000 jtreg-test-output/hotspot/0/JTreport/html/error_gr.html │ │ │ │ │ --rw-r--r-- 0 sbuild (999) sbuild (999) 473 2026-10-22 06:53:00.000000 jtreg-test-output/hotspot/0/JTreport/html/error.html │ │ │ │ │ --rw-r--r-- 0 sbuild (999) sbuild (999) 513 2026-10-22 06:53:00.000000 jtreg-test-output/hotspot/0/JTreport/html/failed_gr.html │ │ │ │ │ --rw-r--r-- 0 sbuild (999) sbuild (999) 465 2026-10-22 06:53:00.000000 jtreg-test-output/hotspot/0/JTreport/html/failed.html │ │ │ │ │ --rw-r--r-- 0 sbuild (999) sbuild (999) 631562 2026-10-22 06:53:00.000000 jtreg-test-output/hotspot/0/JTreport/html/passed_gr.html │ │ │ │ │ --rw-r--r-- 0 sbuild (999) sbuild (999) 631133 2026-10-22 06:53:00.000000 jtreg-test-output/hotspot/0/JTreport/html/passed.html │ │ │ │ │ --rw-r--r-- 0 sbuild (999) sbuild (999) 18324 2026-10-22 06:53:00.000000 jtreg-test-output/hotspot/0/JTreport/html/excluded.html │ │ │ │ │ --rw-r--r-- 0 sbuild (999) sbuild (999) 4222 2026-10-22 06:53:00.000000 jtreg-test-output/hotspot/0/JTreport/html/env.html │ │ │ │ │ --rw-r--r-- 0 sbuild (999) sbuild (999) 78257 2026-10-22 06:53:00.000000 jtreg-test-output/hotspot/0/JTreport/html/config.html │ │ │ │ │ --rw-r--r-- 0 sbuild (999) sbuild (999) 307 2026-10-22 06:53:00.000000 jtreg-test-output/hotspot/0/JTreport/html/report.css │ │ │ │ │ --rw-r--r-- 0 sbuild (999) sbuild (999) 526912 2026-10-22 06:53:00.000000 jtreg-test-output/hotspot/0/JTreport/html/index.html │ │ │ │ │ --rw-r--r-- 0 sbuild (999) sbuild (999) 526912 2026-10-22 06:53:00.000000 jtreg-test-output/hotspot/0/JTreport/html/report.html │ │ │ │ │ -drwxr-xr-x 0 sbuild (999) sbuild (999) 0 2026-10-22 06:53:00.000000 jtreg-test-output/hotspot/0/JTreport/text/ │ │ │ │ │ --rw-r--r-- 0 sbuild (999) sbuild (999) 9713 2026-10-22 06:53:00.000000 jtreg-test-output/hotspot/0/JTreport/text/junit.txt │ │ │ │ │ --rw-r--r-- 0 sbuild (999) sbuild (999) 9190 2026-10-22 06:53:00.000000 jtreg-test-output/hotspot/0/JTreport/text/testng.txt │ │ │ │ │ --rw-r--r-- 0 sbuild (999) sbuild (999) 50907 2026-10-22 06:53:00.000000 jtreg-test-output/hotspot/0/JTreport/text/notRun.txt │ │ │ │ │ --rw-r--r-- 0 sbuild (999) sbuild (999) 123 2026-10-22 06:53:00.000000 jtreg-test-output/hotspot/0/JTreport/text/stats.txt │ │ │ │ │ --rw-r--r-- 0 sbuild (999) sbuild (999) 887 2026-10-22 06:53:00.000000 jtreg-test-output/hotspot/0/JTreport/text/timeStats.txt │ │ │ │ │ --rw-r--r-- 0 sbuild (999) sbuild (999) 21 2026-10-22 06:53:00.000000 jtreg-test-output/hotspot/0/JTreport/text/tc_newfailures.txt │ │ │ │ │ --rw-r--r-- 0 sbuild (999) sbuild (999) 21 2026-10-22 06:53:00.000000 jtreg-test-output/hotspot/0/JTreport/text/tc_fail2notrun.txt │ │ │ │ │ --rw-r--r-- 0 sbuild (999) sbuild (999) 20 2026-10-22 06:53:00.000000 jtreg-test-output/hotspot/0/JTreport/text/tc_fail2error.txt │ │ │ │ │ --rw-r--r-- 0 sbuild (999) sbuild (999) 19 2026-10-22 06:53:00.000000 jtreg-test-output/hotspot/0/JTreport/text/tc_fail2pass.txt │ │ │ │ │ --rw-r--r-- 0 sbuild (999) sbuild (999) 22 2026-10-22 06:53:00.000000 jtreg-test-output/hotspot/0/JTreport/text/tc_fail2missing.txt │ │ │ │ │ --rw-r--r-- 0 sbuild (999) sbuild (999) 19 2026-10-22 06:53:00.000000 jtreg-test-output/hotspot/0/JTreport/text/other_errors.txt │ │ │ │ │ --rw-r--r-- 0 sbuild (999) sbuild (999) 18 2026-10-22 06:53:00.000000 jtreg-test-output/hotspot/0/JTreport/text/newfailures.txt │ │ │ │ │ --rw-r--r-- 0 sbuild (999) sbuild (999) 16 2026-10-22 06:53:00.000000 jtreg-test-output/hotspot/0/JTreport/text/fail2fail.txt │ │ │ │ │ --rw-r--r-- 0 sbuild (999) sbuild (999) 18 2026-10-22 06:53:00.000000 jtreg-test-output/hotspot/0/JTreport/text/fail2notrun.txt │ │ │ │ │ --rw-r--r-- 0 sbuild (999) sbuild (999) 17 2026-10-22 06:53:00.000000 jtreg-test-output/hotspot/0/JTreport/text/faiL2error.txt │ │ │ │ │ --rw-r--r-- 0 sbuild (999) sbuild (999) 16 2026-10-22 06:53:00.000000 jtreg-test-output/hotspot/0/JTreport/text/fail2pass.txt │ │ │ │ │ --rw-r--r-- 0 sbuild (999) sbuild (999) 19 2026-10-22 06:53:00.000000 jtreg-test-output/hotspot/0/JTreport/text/fail2missing.txt │ │ │ │ │ --rw-r--r-- 0 sbuild (999) sbuild (999) 475555 2026-10-22 06:53:00.000000 jtreg-test-output/hotspot/0/JTreport/text/summary.txt │ │ │ │ │ --rw-r--r-- 0 sbuild (999) sbuild (999) 551 2026-10-22 03:47:07.000000 jtreg-test-output/hotspot/0/JTreport/text/cmdArgs.txt │ │ │ │ │ +drwxr-xr-x 0 sbuild (999) sbuild (999) 0 2026-10-30 04:03:07.000000 jtreg-test-output/jdk/1/JTreport/ │ │ │ │ │ +-rw-r--r-- 0 sbuild (999) sbuild (999) 708 2026-10-30 04:03:07.000000 jtreg-test-output/jdk/1/JTreport/index.html │ │ │ │ │ +drwxr-xr-x 0 sbuild (999) sbuild (999) 0 2026-10-30 04:03:07.000000 jtreg-test-output/jdk/1/JTreport/html/ │ │ │ │ │ +-rw-r--r-- 0 sbuild (999) sbuild (999) 762507 2026-10-30 04:03:07.000000 jtreg-test-output/jdk/1/JTreport/html/notRun.html │ │ │ │ │ +-rw-r--r-- 0 sbuild (999) sbuild (999) 1101104 2026-10-30 04:03:07.000000 jtreg-test-output/jdk/1/JTreport/html/report.html │ │ │ │ │ +-rw-r--r-- 0 sbuild (999) sbuild (999) 83174 2026-10-30 04:03:07.000000 jtreg-test-output/jdk/1/JTreport/html/excluded.html │ │ │ │ │ +-rw-r--r-- 0 sbuild (999) sbuild (999) 473 2026-10-30 04:03:07.000000 jtreg-test-output/jdk/1/JTreport/html/error.html │ │ │ │ │ +-rw-r--r-- 0 sbuild (999) sbuild (999) 521 2026-10-30 04:03:07.000000 jtreg-test-output/jdk/1/JTreport/html/error_gr.html │ │ │ │ │ +-rw-r--r-- 0 sbuild (999) sbuild (999) 1101104 2026-10-30 04:03:07.000000 jtreg-test-output/jdk/1/JTreport/html/index.html │ │ │ │ │ +-rw-r--r-- 0 sbuild (999) sbuild (999) 1251765 2026-10-30 04:03:07.000000 jtreg-test-output/jdk/1/JTreport/html/passed_gr.html │ │ │ │ │ +-rw-r--r-- 0 sbuild (999) sbuild (999) 2750 2026-10-30 04:03:07.000000 jtreg-test-output/jdk/1/JTreport/html/failed_gr.html │ │ │ │ │ +-rw-r--r-- 0 sbuild (999) sbuild (999) 2020 2026-10-30 04:03:07.000000 jtreg-test-output/jdk/1/JTreport/html/failed.html │ │ │ │ │ +-rw-r--r-- 0 sbuild (999) sbuild (999) 4225 2026-10-30 04:03:07.000000 jtreg-test-output/jdk/1/JTreport/html/env.html │ │ │ │ │ +-rw-r--r-- 0 sbuild (999) sbuild (999) 762780 2026-10-30 04:03:07.000000 jtreg-test-output/jdk/1/JTreport/html/notRun_gr.html │ │ │ │ │ +-rw-r--r-- 0 sbuild (999) sbuild (999) 307 2026-10-30 04:03:06.000000 jtreg-test-output/jdk/1/JTreport/html/report.css │ │ │ │ │ +-rw-r--r-- 0 sbuild (999) sbuild (999) 24356 2026-10-30 04:03:07.000000 jtreg-test-output/jdk/1/JTreport/html/config.html │ │ │ │ │ +-rw-r--r-- 0 sbuild (999) sbuild (999) 1250431 2026-10-30 04:03:07.000000 jtreg-test-output/jdk/1/JTreport/html/passed.html │ │ │ │ │ +drwxr-xr-x 0 sbuild (999) sbuild (999) 0 2026-10-30 04:03:07.000000 jtreg-test-output/jdk/1/JTreport/text/ │ │ │ │ │ +-rw-r--r-- 0 sbuild (999) sbuild (999) 890325 2026-10-30 04:03:07.000000 jtreg-test-output/jdk/1/JTreport/text/summary.txt │ │ │ │ │ +-rw-r--r-- 0 sbuild (999) sbuild (999) 20 2026-10-30 04:03:07.000000 jtreg-test-output/jdk/1/JTreport/text/tc_fail2error.txt │ │ │ │ │ +-rw-r--r-- 0 sbuild (999) sbuild (999) 19 2026-10-30 04:03:07.000000 jtreg-test-output/jdk/1/JTreport/text/tc_fail2pass.txt │ │ │ │ │ +-rw-r--r-- 0 sbuild (999) sbuild (999) 116 2026-10-30 04:03:07.000000 jtreg-test-output/jdk/1/JTreport/text/timeStats.txt │ │ │ │ │ +-rw-r--r-- 0 sbuild (999) sbuild (999) 21 2026-10-30 04:03:07.000000 jtreg-test-output/jdk/1/JTreport/text/tc_fail2notrun.txt │ │ │ │ │ +-rw-r--r-- 0 sbuild (999) sbuild (999) 19 2026-10-30 04:03:07.000000 jtreg-test-output/jdk/1/JTreport/text/fail2missing.txt │ │ │ │ │ +-rw-r--r-- 0 sbuild (999) sbuild (999) 16 2026-10-30 04:03:07.000000 jtreg-test-output/jdk/1/JTreport/text/fail2fail.txt │ │ │ │ │ +-rw-r--r-- 0 sbuild (999) sbuild (999) 22 2026-10-30 04:03:07.000000 jtreg-test-output/jdk/1/JTreport/text/tc_fail2missing.txt │ │ │ │ │ +-rw-r--r-- 0 sbuild (999) sbuild (999) 16 2026-10-30 04:03:07.000000 jtreg-test-output/jdk/1/JTreport/text/fail2pass.txt │ │ │ │ │ +-rw-r--r-- 0 sbuild (999) sbuild (999) 19 2026-10-30 04:03:07.000000 jtreg-test-output/jdk/1/JTreport/text/other_errors.txt │ │ │ │ │ +-rw-r--r-- 0 sbuild (999) sbuild (999) 17 2026-10-30 04:03:07.000000 jtreg-test-output/jdk/1/JTreport/text/faiL2error.txt │ │ │ │ │ +-rw-r--r-- 0 sbuild (999) sbuild (999) 21 2026-10-30 04:03:07.000000 jtreg-test-output/jdk/1/JTreport/text/tc_newfailures.txt │ │ │ │ │ +-rw-r--r-- 0 sbuild (999) sbuild (999) 101 2026-10-30 04:03:07.000000 jtreg-test-output/jdk/1/JTreport/text/stats.txt │ │ │ │ │ +-rw-r--r-- 0 sbuild (999) sbuild (999) 548 2026-10-30 04:02:52.000000 jtreg-test-output/jdk/1/JTreport/text/cmdArgs.txt │ │ │ │ │ +-rw-r--r-- 0 sbuild (999) sbuild (999) 416 2026-10-30 04:03:07.000000 jtreg-test-output/jdk/1/JTreport/text/newfailures.txt │ │ │ │ │ +-rw-r--r-- 0 sbuild (999) sbuild (999) 132 2026-10-30 04:03:07.000000 jtreg-test-output/jdk/1/JTreport/text/testng.txt │ │ │ │ │ +-rw-r--r-- 0 sbuild (999) sbuild (999) 1023561 2026-10-30 04:03:07.000000 jtreg-test-output/jdk/1/JTreport/text/notRun.txt │ │ │ │ │ +-rw-r--r-- 0 sbuild (999) sbuild (999) 18 2026-10-30 04:03:07.000000 jtreg-test-output/jdk/1/JTreport/text/fail2notrun.txt │ │ │ │ │ +-rw-r--r-- 0 sbuild (999) sbuild (999) 0 2026-10-30 04:03:07.000000 jtreg-test-output/jdk/1/JTreport/reportdir.dat │ │ │ │ │ +drwxr-xr-x 0 sbuild (999) sbuild (999) 0 2026-10-30 04:02:25.000000 jtreg-test-output/jdk/0/JTreport/ │ │ │ │ │ +-rw-r--r-- 0 sbuild (999) sbuild (999) 708 2026-10-30 04:02:25.000000 jtreg-test-output/jdk/0/JTreport/index.html │ │ │ │ │ +drwxr-xr-x 0 sbuild (999) sbuild (999) 0 2026-10-30 04:02:25.000000 jtreg-test-output/jdk/0/JTreport/html/ │ │ │ │ │ +-rw-r--r-- 0 sbuild (999) sbuild (999) 20339 2026-10-30 04:02:25.000000 jtreg-test-output/jdk/0/JTreport/html/notRun.html │ │ │ │ │ +-rw-r--r-- 0 sbuild (999) sbuild (999) 1123762 2026-10-30 04:02:25.000000 jtreg-test-output/jdk/0/JTreport/html/report.html │ │ │ │ │ +-rw-r--r-- 0 sbuild (999) sbuild (999) 83174 2026-10-30 04:02:25.000000 jtreg-test-output/jdk/0/JTreport/html/excluded.html │ │ │ │ │ +-rw-r--r-- 0 sbuild (999) sbuild (999) 473 2026-10-30 04:02:25.000000 jtreg-test-output/jdk/0/JTreport/html/error.html │ │ │ │ │ +-rw-r--r-- 0 sbuild (999) sbuild (999) 521 2026-10-30 04:02:25.000000 jtreg-test-output/jdk/0/JTreport/html/error_gr.html │ │ │ │ │ +-rw-r--r-- 0 sbuild (999) sbuild (999) 1123762 2026-10-30 04:02:25.000000 jtreg-test-output/jdk/0/JTreport/html/index.html │ │ │ │ │ +-rw-r--r-- 0 sbuild (999) sbuild (999) 1251765 2026-10-30 04:02:25.000000 jtreg-test-output/jdk/0/JTreport/html/passed_gr.html │ │ │ │ │ +-rw-r--r-- 0 sbuild (999) sbuild (999) 2750 2026-10-30 04:02:25.000000 jtreg-test-output/jdk/0/JTreport/html/failed_gr.html │ │ │ │ │ +-rw-r--r-- 0 sbuild (999) sbuild (999) 2020 2026-10-30 04:02:25.000000 jtreg-test-output/jdk/0/JTreport/html/failed.html │ │ │ │ │ +-rw-r--r-- 0 sbuild (999) sbuild (999) 4206 2026-10-30 04:02:25.000000 jtreg-test-output/jdk/0/JTreport/html/env.html │ │ │ │ │ +-rw-r--r-- 0 sbuild (999) sbuild (999) 20684 2026-10-30 04:02:25.000000 jtreg-test-output/jdk/0/JTreport/html/notRun_gr.html │ │ │ │ │ +-rw-r--r-- 0 sbuild (999) sbuild (999) 307 2026-10-30 04:02:25.000000 jtreg-test-output/jdk/0/JTreport/html/report.css │ │ │ │ │ +-rw-r--r-- 0 sbuild (999) sbuild (999) 23924 2026-10-30 04:02:25.000000 jtreg-test-output/jdk/0/JTreport/html/config.html │ │ │ │ │ +-rw-r--r-- 0 sbuild (999) sbuild (999) 1250431 2026-10-30 04:02:25.000000 jtreg-test-output/jdk/0/JTreport/html/passed.html │ │ │ │ │ +drwxr-xr-x 0 sbuild (999) sbuild (999) 0 2026-10-30 04:02:25.000000 jtreg-test-output/jdk/0/JTreport/text/ │ │ │ │ │ +-rw-r--r-- 0 sbuild (999) sbuild (999) 890325 2026-10-30 04:02:25.000000 jtreg-test-output/jdk/0/JTreport/text/summary.txt │ │ │ │ │ +-rw-r--r-- 0 sbuild (999) sbuild (999) 20 2026-10-30 04:02:25.000000 jtreg-test-output/jdk/0/JTreport/text/tc_fail2error.txt │ │ │ │ │ +-rw-r--r-- 0 sbuild (999) sbuild (999) 19 2026-10-30 04:02:25.000000 jtreg-test-output/jdk/0/JTreport/text/tc_fail2pass.txt │ │ │ │ │ +-rw-r--r-- 0 sbuild (999) sbuild (999) 995 2026-10-30 04:02:25.000000 jtreg-test-output/jdk/0/JTreport/text/timeStats.txt │ │ │ │ │ +-rw-r--r-- 0 sbuild (999) sbuild (999) 21 2026-10-30 04:02:25.000000 jtreg-test-output/jdk/0/JTreport/text/tc_fail2notrun.txt │ │ │ │ │ +-rw-r--r-- 0 sbuild (999) sbuild (999) 19 2026-10-30 04:02:25.000000 jtreg-test-output/jdk/0/JTreport/text/fail2missing.txt │ │ │ │ │ +-rw-r--r-- 0 sbuild (999) sbuild (999) 16 2026-10-30 04:02:25.000000 jtreg-test-output/jdk/0/JTreport/text/fail2fail.txt │ │ │ │ │ +-rw-r--r-- 0 sbuild (999) sbuild (999) 22 2026-10-30 04:02:25.000000 jtreg-test-output/jdk/0/JTreport/text/tc_fail2missing.txt │ │ │ │ │ +-rw-r--r-- 0 sbuild (999) sbuild (999) 16 2026-10-30 04:02:25.000000 jtreg-test-output/jdk/0/JTreport/text/fail2pass.txt │ │ │ │ │ +-rw-r--r-- 0 sbuild (999) sbuild (999) 19 2026-10-30 04:02:25.000000 jtreg-test-output/jdk/0/JTreport/text/other_errors.txt │ │ │ │ │ +-rw-r--r-- 0 sbuild (999) sbuild (999) 17 2026-10-30 04:02:25.000000 jtreg-test-output/jdk/0/JTreport/text/faiL2error.txt │ │ │ │ │ +-rw-r--r-- 0 sbuild (999) sbuild (999) 21 2026-10-30 04:02:25.000000 jtreg-test-output/jdk/0/JTreport/text/tc_newfailures.txt │ │ │ │ │ +-rw-r--r-- 0 sbuild (999) sbuild (999) 172 2026-10-30 04:02:25.000000 jtreg-test-output/jdk/0/JTreport/text/stats.txt │ │ │ │ │ +-rw-r--r-- 0 sbuild (999) sbuild (999) 529 2026-10-29 23:33:27.000000 jtreg-test-output/jdk/0/JTreport/text/cmdArgs.txt │ │ │ │ │ +-rw-r--r-- 0 sbuild (999) sbuild (999) 416 2026-10-30 04:02:25.000000 jtreg-test-output/jdk/0/JTreport/text/newfailures.txt │ │ │ │ │ +-rw-r--r-- 0 sbuild (999) sbuild (999) 131917 2026-10-30 04:02:25.000000 jtreg-test-output/jdk/0/JTreport/text/testng.txt │ │ │ │ │ +-rw-r--r-- 0 sbuild (999) sbuild (999) 26283 2026-10-30 04:02:25.000000 jtreg-test-output/jdk/0/JTreport/text/notRun.txt │ │ │ │ │ +-rw-r--r-- 0 sbuild (999) sbuild (999) 86012 2026-10-30 04:02:25.000000 jtreg-test-output/jdk/0/JTreport/text/junit.txt │ │ │ │ │ +-rw-r--r-- 0 sbuild (999) sbuild (999) 18 2026-10-30 04:02:25.000000 jtreg-test-output/jdk/0/JTreport/text/fail2notrun.txt │ │ │ │ │ +-rw-r--r-- 0 sbuild (999) sbuild (999) 0 2026-10-30 04:02:25.000000 jtreg-test-output/jdk/0/JTreport/reportdir.dat │ │ │ │ │ +drwxr-xr-x 0 sbuild (999) sbuild (999) 0 2026-10-30 04:03:47.000000 jtreg-test-output/jdk/2/JTreport/ │ │ │ │ │ +-rw-r--r-- 0 sbuild (999) sbuild (999) 708 2026-10-30 04:03:47.000000 jtreg-test-output/jdk/2/JTreport/index.html │ │ │ │ │ +drwxr-xr-x 0 sbuild (999) sbuild (999) 0 2026-10-30 04:03:46.000000 jtreg-test-output/jdk/2/JTreport/html/ │ │ │ │ │ +-rw-r--r-- 0 sbuild (999) sbuild (999) 762507 2026-10-30 04:03:46.000000 jtreg-test-output/jdk/2/JTreport/html/notRun.html │ │ │ │ │ +-rw-r--r-- 0 sbuild (999) sbuild (999) 1101104 2026-10-30 04:03:46.000000 jtreg-test-output/jdk/2/JTreport/html/report.html │ │ │ │ │ +-rw-r--r-- 0 sbuild (999) sbuild (999) 83174 2026-10-30 04:03:46.000000 jtreg-test-output/jdk/2/JTreport/html/excluded.html │ │ │ │ │ +-rw-r--r-- 0 sbuild (999) sbuild (999) 473 2026-10-30 04:03:46.000000 jtreg-test-output/jdk/2/JTreport/html/error.html │ │ │ │ │ +-rw-r--r-- 0 sbuild (999) sbuild (999) 521 2026-10-30 04:03:46.000000 jtreg-test-output/jdk/2/JTreport/html/error_gr.html │ │ │ │ │ +-rw-r--r-- 0 sbuild (999) sbuild (999) 1101104 2026-10-30 04:03:46.000000 jtreg-test-output/jdk/2/JTreport/html/index.html │ │ │ │ │ +-rw-r--r-- 0 sbuild (999) sbuild (999) 1251765 2026-10-30 04:03:46.000000 jtreg-test-output/jdk/2/JTreport/html/passed_gr.html │ │ │ │ │ +-rw-r--r-- 0 sbuild (999) sbuild (999) 2750 2026-10-30 04:03:46.000000 jtreg-test-output/jdk/2/JTreport/html/failed_gr.html │ │ │ │ │ +-rw-r--r-- 0 sbuild (999) sbuild (999) 2020 2026-10-30 04:03:46.000000 jtreg-test-output/jdk/2/JTreport/html/failed.html │ │ │ │ │ +-rw-r--r-- 0 sbuild (999) sbuild (999) 4225 2026-10-30 04:03:46.000000 jtreg-test-output/jdk/2/JTreport/html/env.html │ │ │ │ │ +-rw-r--r-- 0 sbuild (999) sbuild (999) 762780 2026-10-30 04:03:46.000000 jtreg-test-output/jdk/2/JTreport/html/notRun_gr.html │ │ │ │ │ +-rw-r--r-- 0 sbuild (999) sbuild (999) 307 2026-10-30 04:03:46.000000 jtreg-test-output/jdk/2/JTreport/html/report.css │ │ │ │ │ +-rw-r--r-- 0 sbuild (999) sbuild (999) 24356 2026-10-30 04:03:46.000000 jtreg-test-output/jdk/2/JTreport/html/config.html │ │ │ │ │ +-rw-r--r-- 0 sbuild (999) sbuild (999) 1250431 2026-10-30 04:03:46.000000 jtreg-test-output/jdk/2/JTreport/html/passed.html │ │ │ │ │ +drwxr-xr-x 0 sbuild (999) sbuild (999) 0 2026-10-30 04:03:47.000000 jtreg-test-output/jdk/2/JTreport/text/ │ │ │ │ │ +-rw-r--r-- 0 sbuild (999) sbuild (999) 890325 2026-10-30 04:03:47.000000 jtreg-test-output/jdk/2/JTreport/text/summary.txt │ │ │ │ │ +-rw-r--r-- 0 sbuild (999) sbuild (999) 20 2026-10-30 04:03:47.000000 jtreg-test-output/jdk/2/JTreport/text/tc_fail2error.txt │ │ │ │ │ +-rw-r--r-- 0 sbuild (999) sbuild (999) 19 2026-10-30 04:03:47.000000 jtreg-test-output/jdk/2/JTreport/text/tc_fail2pass.txt │ │ │ │ │ +-rw-r--r-- 0 sbuild (999) sbuild (999) 116 2026-10-30 04:03:47.000000 jtreg-test-output/jdk/2/JTreport/text/timeStats.txt │ │ │ │ │ +-rw-r--r-- 0 sbuild (999) sbuild (999) 21 2026-10-30 04:03:47.000000 jtreg-test-output/jdk/2/JTreport/text/tc_fail2notrun.txt │ │ │ │ │ +-rw-r--r-- 0 sbuild (999) sbuild (999) 19 2026-10-30 04:03:47.000000 jtreg-test-output/jdk/2/JTreport/text/fail2missing.txt │ │ │ │ │ +-rw-r--r-- 0 sbuild (999) sbuild (999) 16 2026-10-30 04:03:47.000000 jtreg-test-output/jdk/2/JTreport/text/fail2fail.txt │ │ │ │ │ +-rw-r--r-- 0 sbuild (999) sbuild (999) 22 2026-10-30 04:03:47.000000 jtreg-test-output/jdk/2/JTreport/text/tc_fail2missing.txt │ │ │ │ │ +-rw-r--r-- 0 sbuild (999) sbuild (999) 16 2026-10-30 04:03:47.000000 jtreg-test-output/jdk/2/JTreport/text/fail2pass.txt │ │ │ │ │ +-rw-r--r-- 0 sbuild (999) sbuild (999) 19 2026-10-30 04:03:47.000000 jtreg-test-output/jdk/2/JTreport/text/other_errors.txt │ │ │ │ │ +-rw-r--r-- 0 sbuild (999) sbuild (999) 17 2026-10-30 04:03:47.000000 jtreg-test-output/jdk/2/JTreport/text/faiL2error.txt │ │ │ │ │ +-rw-r--r-- 0 sbuild (999) sbuild (999) 21 2026-10-30 04:03:47.000000 jtreg-test-output/jdk/2/JTreport/text/tc_newfailures.txt │ │ │ │ │ +-rw-r--r-- 0 sbuild (999) sbuild (999) 101 2026-10-30 04:03:47.000000 jtreg-test-output/jdk/2/JTreport/text/stats.txt │ │ │ │ │ +-rw-r--r-- 0 sbuild (999) sbuild (999) 548 2026-10-30 04:03:33.000000 jtreg-test-output/jdk/2/JTreport/text/cmdArgs.txt │ │ │ │ │ +-rw-r--r-- 0 sbuild (999) sbuild (999) 416 2026-10-30 04:03:47.000000 jtreg-test-output/jdk/2/JTreport/text/newfailures.txt │ │ │ │ │ +-rw-r--r-- 0 sbuild (999) sbuild (999) 132 2026-10-30 04:03:47.000000 jtreg-test-output/jdk/2/JTreport/text/testng.txt │ │ │ │ │ +-rw-r--r-- 0 sbuild (999) sbuild (999) 1023561 2026-10-30 04:03:47.000000 jtreg-test-output/jdk/2/JTreport/text/notRun.txt │ │ │ │ │ +-rw-r--r-- 0 sbuild (999) sbuild (999) 18 2026-10-30 04:03:47.000000 jtreg-test-output/jdk/2/JTreport/text/fail2notrun.txt │ │ │ │ │ +-rw-r--r-- 0 sbuild (999) sbuild (999) 0 2026-10-30 04:03:47.000000 jtreg-test-output/jdk/2/JTreport/reportdir.dat │ │ │ │ │ +lrwxrwxrwx 0 sbuild (999) sbuild (999) 0 2026-10-30 04:04:11.000000 jtreg-test-output/jdk/JTreport -> 2/JTreport │ │ │ │ │ +drwxr-xr-x 0 sbuild (999) sbuild (999) 0 2026-10-29 23:10:32.000000 jtreg-test-output/langtools/0/JTreport/ │ │ │ │ │ +-rw-r--r-- 0 sbuild (999) sbuild (999) 720 2026-10-29 23:10:32.000000 jtreg-test-output/langtools/0/JTreport/index.html │ │ │ │ │ +drwxr-xr-x 0 sbuild (999) sbuild (999) 0 2026-10-29 23:10:32.000000 jtreg-test-output/langtools/0/JTreport/html/ │ │ │ │ │ +-rw-r--r-- 0 sbuild (999) sbuild (999) 2175 2026-10-29 23:10:32.000000 jtreg-test-output/langtools/0/JTreport/html/notRun.html │ │ │ │ │ +-rw-r--r-- 0 sbuild (999) sbuild (999) 541888 2026-10-29 23:10:32.000000 jtreg-test-output/langtools/0/JTreport/html/report.html │ │ │ │ │ +-rw-r--r-- 0 sbuild (999) sbuild (999) 6196 2026-10-29 23:10:32.000000 jtreg-test-output/langtools/0/JTreport/html/excluded.html │ │ │ │ │ +-rw-r--r-- 0 sbuild (999) sbuild (999) 474 2026-10-29 23:10:32.000000 jtreg-test-output/langtools/0/JTreport/html/error.html │ │ │ │ │ +-rw-r--r-- 0 sbuild (999) sbuild (999) 522 2026-10-29 23:10:32.000000 jtreg-test-output/langtools/0/JTreport/html/error_gr.html │ │ │ │ │ +-rw-r--r-- 0 sbuild (999) sbuild (999) 541888 2026-10-29 23:10:32.000000 jtreg-test-output/langtools/0/JTreport/html/index.html │ │ │ │ │ +-rw-r--r-- 0 sbuild (999) sbuild (999) 885673 2026-10-29 23:10:32.000000 jtreg-test-output/langtools/0/JTreport/html/passed_gr.html │ │ │ │ │ +-rw-r--r-- 0 sbuild (999) sbuild (999) 514 2026-10-29 23:10:32.000000 jtreg-test-output/langtools/0/JTreport/html/failed_gr.html │ │ │ │ │ +-rw-r--r-- 0 sbuild (999) sbuild (999) 466 2026-10-29 23:10:32.000000 jtreg-test-output/langtools/0/JTreport/html/failed.html │ │ │ │ │ +-rw-r--r-- 0 sbuild (999) sbuild (999) 4132 2026-10-29 23:10:32.000000 jtreg-test-output/langtools/0/JTreport/html/env.html │ │ │ │ │ +-rw-r--r-- 0 sbuild (999) sbuild (999) 2464 2026-10-29 23:10:32.000000 jtreg-test-output/langtools/0/JTreport/html/notRun_gr.html │ │ │ │ │ +-rw-r--r-- 0 sbuild (999) sbuild (999) 307 2026-10-29 23:10:32.000000 jtreg-test-output/langtools/0/JTreport/html/report.css │ │ │ │ │ +-rw-r--r-- 0 sbuild (999) sbuild (999) 10783 2026-10-29 23:10:32.000000 jtreg-test-output/langtools/0/JTreport/html/config.html │ │ │ │ │ +-rw-r--r-- 0 sbuild (999) sbuild (999) 885348 2026-10-29 23:10:32.000000 jtreg-test-output/langtools/0/JTreport/html/passed.html │ │ │ │ │ +drwxr-xr-x 0 sbuild (999) sbuild (999) 0 2026-10-29 23:10:32.000000 jtreg-test-output/langtools/0/JTreport/text/ │ │ │ │ │ +-rw-r--r-- 0 sbuild (999) sbuild (999) 643764 2026-10-29 23:10:32.000000 jtreg-test-output/langtools/0/JTreport/text/summary.txt │ │ │ │ │ +-rw-r--r-- 0 sbuild (999) sbuild (999) 20 2026-10-29 23:10:32.000000 jtreg-test-output/langtools/0/JTreport/text/tc_fail2error.txt │ │ │ │ │ +-rw-r--r-- 0 sbuild (999) sbuild (999) 19 2026-10-29 23:10:32.000000 jtreg-test-output/langtools/0/JTreport/text/tc_fail2pass.txt │ │ │ │ │ +-rw-r--r-- 0 sbuild (999) sbuild (999) 466 2026-10-29 23:10:32.000000 jtreg-test-output/langtools/0/JTreport/text/timeStats.txt │ │ │ │ │ +-rw-r--r-- 0 sbuild (999) sbuild (999) 21 2026-10-29 23:10:32.000000 jtreg-test-output/langtools/0/JTreport/text/tc_fail2notrun.txt │ │ │ │ │ +-rw-r--r-- 0 sbuild (999) sbuild (999) 19 2026-10-29 23:10:32.000000 jtreg-test-output/langtools/0/JTreport/text/fail2missing.txt │ │ │ │ │ +-rw-r--r-- 0 sbuild (999) sbuild (999) 16 2026-10-29 23:10:32.000000 jtreg-test-output/langtools/0/JTreport/text/fail2fail.txt │ │ │ │ │ +-rw-r--r-- 0 sbuild (999) sbuild (999) 22 2026-10-29 23:10:32.000000 jtreg-test-output/langtools/0/JTreport/text/tc_fail2missing.txt │ │ │ │ │ +-rw-r--r-- 0 sbuild (999) sbuild (999) 16 2026-10-29 23:10:32.000000 jtreg-test-output/langtools/0/JTreport/text/fail2pass.txt │ │ │ │ │ +-rw-r--r-- 0 sbuild (999) sbuild (999) 19 2026-10-29 23:10:32.000000 jtreg-test-output/langtools/0/JTreport/text/other_errors.txt │ │ │ │ │ +-rw-r--r-- 0 sbuild (999) sbuild (999) 17 2026-10-29 23:10:32.000000 jtreg-test-output/langtools/0/JTreport/text/faiL2error.txt │ │ │ │ │ +-rw-r--r-- 0 sbuild (999) sbuild (999) 21 2026-10-29 23:10:32.000000 jtreg-test-output/langtools/0/JTreport/text/tc_newfailures.txt │ │ │ │ │ +-rw-r--r-- 0 sbuild (999) sbuild (999) 120 2026-10-29 23:10:32.000000 jtreg-test-output/langtools/0/JTreport/text/stats.txt │ │ │ │ │ +-rw-r--r-- 0 sbuild (999) sbuild (999) 454 2026-10-29 22:19:54.000000 jtreg-test-output/langtools/0/JTreport/text/cmdArgs.txt │ │ │ │ │ +-rw-r--r-- 0 sbuild (999) sbuild (999) 18 2026-10-29 23:10:32.000000 jtreg-test-output/langtools/0/JTreport/text/newfailures.txt │ │ │ │ │ +-rw-r--r-- 0 sbuild (999) sbuild (999) 9538 2026-10-29 23:10:32.000000 jtreg-test-output/langtools/0/JTreport/text/testng.txt │ │ │ │ │ +-rw-r--r-- 0 sbuild (999) sbuild (999) 1921 2026-10-29 23:10:32.000000 jtreg-test-output/langtools/0/JTreport/text/notRun.txt │ │ │ │ │ +-rw-r--r-- 0 sbuild (999) sbuild (999) 18737 2026-10-29 23:10:32.000000 jtreg-test-output/langtools/0/JTreport/text/junit.txt │ │ │ │ │ +-rw-r--r-- 0 sbuild (999) sbuild (999) 18 2026-10-29 23:10:32.000000 jtreg-test-output/langtools/0/JTreport/text/fail2notrun.txt │ │ │ │ │ +-rw-r--r-- 0 sbuild (999) sbuild (999) 0 2026-10-29 23:10:32.000000 jtreg-test-output/langtools/0/JTreport/reportdir.dat │ │ │ │ │ +lrwxrwxrwx 0 sbuild (999) sbuild (999) 0 2026-10-29 23:10:48.000000 jtreg-test-output/langtools/JTreport -> 0/JTreport │ │ │ │ │ +drwxr-xr-x 0 sbuild (999) sbuild (999) 0 2026-10-29 23:33:21.000000 jtreg-test-output/jaxp/0/JTreport/ │ │ │ │ │ +-rw-r--r-- 0 sbuild (999) sbuild (999) 710 2026-10-29 23:33:21.000000 jtreg-test-output/jaxp/0/JTreport/index.html │ │ │ │ │ +drwxr-xr-x 0 sbuild (999) sbuild (999) 0 2026-10-29 23:33:21.000000 jtreg-test-output/jaxp/0/JTreport/html/ │ │ │ │ │ +-rw-r--r-- 0 sbuild (999) sbuild (999) 574 2026-10-29 23:33:21.000000 jtreg-test-output/jaxp/0/JTreport/html/notRun.html │ │ │ │ │ +-rw-r--r-- 0 sbuild (999) sbuild (999) 58493 2026-10-29 23:33:21.000000 jtreg-test-output/jaxp/0/JTreport/html/report.html │ │ │ │ │ +-rw-r--r-- 0 sbuild (999) sbuild (999) 3643 2026-10-29 23:33:21.000000 jtreg-test-output/jaxp/0/JTreport/html/excluded.html │ │ │ │ │ +-rw-r--r-- 0 sbuild (999) sbuild (999) 474 2026-10-29 23:33:21.000000 jtreg-test-output/jaxp/0/JTreport/html/error.html │ │ │ │ │ +-rw-r--r-- 0 sbuild (999) sbuild (999) 522 2026-10-29 23:33:21.000000 jtreg-test-output/jaxp/0/JTreport/html/error_gr.html │ │ │ │ │ +-rw-r--r-- 0 sbuild (999) sbuild (999) 58493 2026-10-29 23:33:21.000000 jtreg-test-output/jaxp/0/JTreport/html/index.html │ │ │ │ │ +-rw-r--r-- 0 sbuild (999) sbuild (999) 110063 2026-10-29 23:33:21.000000 jtreg-test-output/jaxp/0/JTreport/html/passed_gr.html │ │ │ │ │ +-rw-r--r-- 0 sbuild (999) sbuild (999) 514 2026-10-29 23:33:21.000000 jtreg-test-output/jaxp/0/JTreport/html/failed_gr.html │ │ │ │ │ +-rw-r--r-- 0 sbuild (999) sbuild (999) 466 2026-10-29 23:33:21.000000 jtreg-test-output/jaxp/0/JTreport/html/failed.html │ │ │ │ │ +-rw-r--r-- 0 sbuild (999) sbuild (999) 4117 2026-10-29 23:33:21.000000 jtreg-test-output/jaxp/0/JTreport/html/env.html │ │ │ │ │ +-rw-r--r-- 0 sbuild (999) sbuild (999) 696 2026-10-29 23:33:21.000000 jtreg-test-output/jaxp/0/JTreport/html/notRun_gr.html │ │ │ │ │ +-rw-r--r-- 0 sbuild (999) sbuild (999) 307 2026-10-29 23:33:21.000000 jtreg-test-output/jaxp/0/JTreport/html/report.css │ │ │ │ │ +-rw-r--r-- 0 sbuild (999) sbuild (999) 4423 2026-10-29 23:33:21.000000 jtreg-test-output/jaxp/0/JTreport/html/config.html │ │ │ │ │ +-rw-r--r-- 0 sbuild (999) sbuild (999) 109974 2026-10-29 23:33:21.000000 jtreg-test-output/jaxp/0/JTreport/html/passed.html │ │ │ │ │ +drwxr-xr-x 0 sbuild (999) sbuild (999) 0 2026-10-29 23:33:21.000000 jtreg-test-output/jaxp/0/JTreport/text/ │ │ │ │ │ +-rw-r--r-- 0 sbuild (999) sbuild (999) 59118 2026-10-29 23:33:21.000000 jtreg-test-output/jaxp/0/JTreport/text/summary.txt │ │ │ │ │ +-rw-r--r-- 0 sbuild (999) sbuild (999) 20 2026-10-29 23:33:21.000000 jtreg-test-output/jaxp/0/JTreport/text/tc_fail2error.txt │ │ │ │ │ +-rw-r--r-- 0 sbuild (999) sbuild (999) 19 2026-10-29 23:33:21.000000 jtreg-test-output/jaxp/0/JTreport/text/tc_fail2pass.txt │ │ │ │ │ +-rw-r--r-- 0 sbuild (999) sbuild (999) 166 2026-10-29 23:33:21.000000 jtreg-test-output/jaxp/0/JTreport/text/timeStats.txt │ │ │ │ │ +-rw-r--r-- 0 sbuild (999) sbuild (999) 21 2026-10-29 23:33:21.000000 jtreg-test-output/jaxp/0/JTreport/text/tc_fail2notrun.txt │ │ │ │ │ +-rw-r--r-- 0 sbuild (999) sbuild (999) 19 2026-10-29 23:33:21.000000 jtreg-test-output/jaxp/0/JTreport/text/fail2missing.txt │ │ │ │ │ +-rw-r--r-- 0 sbuild (999) sbuild (999) 16 2026-10-29 23:33:21.000000 jtreg-test-output/jaxp/0/JTreport/text/fail2fail.txt │ │ │ │ │ +-rw-r--r-- 0 sbuild (999) sbuild (999) 22 2026-10-29 23:33:21.000000 jtreg-test-output/jaxp/0/JTreport/text/tc_fail2missing.txt │ │ │ │ │ +-rw-r--r-- 0 sbuild (999) sbuild (999) 16 2026-10-29 23:33:21.000000 jtreg-test-output/jaxp/0/JTreport/text/fail2pass.txt │ │ │ │ │ +-rw-r--r-- 0 sbuild (999) sbuild (999) 19 2026-10-29 23:33:21.000000 jtreg-test-output/jaxp/0/JTreport/text/other_errors.txt │ │ │ │ │ +-rw-r--r-- 0 sbuild (999) sbuild (999) 17 2026-10-29 23:33:21.000000 jtreg-test-output/jaxp/0/JTreport/text/faiL2error.txt │ │ │ │ │ +-rw-r--r-- 0 sbuild (999) sbuild (999) 21 2026-10-29 23:33:21.000000 jtreg-test-output/jaxp/0/JTreport/text/tc_newfailures.txt │ │ │ │ │ +-rw-r--r-- 0 sbuild (999) sbuild (999) 65 2026-10-29 23:33:21.000000 jtreg-test-output/jaxp/0/JTreport/text/stats.txt │ │ │ │ │ +-rw-r--r-- 0 sbuild (999) sbuild (999) 439 2026-10-29 23:10:49.000000 jtreg-test-output/jaxp/0/JTreport/text/cmdArgs.txt │ │ │ │ │ +-rw-r--r-- 0 sbuild (999) sbuild (999) 18 2026-10-29 23:33:21.000000 jtreg-test-output/jaxp/0/JTreport/text/newfailures.txt │ │ │ │ │ +-rw-r--r-- 0 sbuild (999) sbuild (999) 69461 2026-10-29 23:33:21.000000 jtreg-test-output/jaxp/0/JTreport/text/testng.txt │ │ │ │ │ +-rw-r--r-- 0 sbuild (999) sbuild (999) 116 2026-10-29 23:33:21.000000 jtreg-test-output/jaxp/0/JTreport/text/notRun.txt │ │ │ │ │ +-rw-r--r-- 0 sbuild (999) sbuild (999) 200 2026-10-29 23:33:21.000000 jtreg-test-output/jaxp/0/JTreport/text/junit.txt │ │ │ │ │ +-rw-r--r-- 0 sbuild (999) sbuild (999) 18 2026-10-29 23:33:21.000000 jtreg-test-output/jaxp/0/JTreport/text/fail2notrun.txt │ │ │ │ │ +-rw-r--r-- 0 sbuild (999) sbuild (999) 0 2026-10-29 23:33:21.000000 jtreg-test-output/jaxp/0/JTreport/reportdir.dat │ │ │ │ │ +lrwxrwxrwx 0 sbuild (999) sbuild (999) 0 2026-10-29 23:33:23.000000 jtreg-test-output/jaxp/JTreport -> 0/JTreport │ │ │ │ │ +drwxr-xr-x 0 sbuild (999) sbuild (999) 0 2026-10-29 22:19:38.000000 jtreg-test-output/hotspot/0/JTreport/ │ │ │ │ │ +-rw-r--r-- 0 sbuild (999) sbuild (999) 722 2026-10-29 22:19:38.000000 jtreg-test-output/hotspot/0/JTreport/index.html │ │ │ │ │ +drwxr-xr-x 0 sbuild (999) sbuild (999) 0 2026-10-29 22:19:38.000000 jtreg-test-output/hotspot/0/JTreport/html/ │ │ │ │ │ +-rw-r--r-- 0 sbuild (999) sbuild (999) 37916 2026-10-29 22:19:38.000000 jtreg-test-output/hotspot/0/JTreport/html/notRun.html │ │ │ │ │ +-rw-r--r-- 0 sbuild (999) sbuild (999) 526913 2026-10-29 22:19:38.000000 jtreg-test-output/hotspot/0/JTreport/html/report.html │ │ │ │ │ +-rw-r--r-- 0 sbuild (999) sbuild (999) 18325 2026-10-29 22:19:38.000000 jtreg-test-output/hotspot/0/JTreport/html/excluded.html │ │ │ │ │ +-rw-r--r-- 0 sbuild (999) sbuild (999) 474 2026-10-29 22:19:38.000000 jtreg-test-output/hotspot/0/JTreport/html/error.html │ │ │ │ │ +-rw-r--r-- 0 sbuild (999) sbuild (999) 522 2026-10-29 22:19:38.000000 jtreg-test-output/hotspot/0/JTreport/html/error_gr.html │ │ │ │ │ +-rw-r--r-- 0 sbuild (999) sbuild (999) 526913 2026-10-29 22:19:38.000000 jtreg-test-output/hotspot/0/JTreport/html/index.html │ │ │ │ │ +-rw-r--r-- 0 sbuild (999) sbuild (999) 631563 2026-10-29 22:19:38.000000 jtreg-test-output/hotspot/0/JTreport/html/passed_gr.html │ │ │ │ │ +-rw-r--r-- 0 sbuild (999) sbuild (999) 514 2026-10-29 22:19:38.000000 jtreg-test-output/hotspot/0/JTreport/html/failed_gr.html │ │ │ │ │ +-rw-r--r-- 0 sbuild (999) sbuild (999) 466 2026-10-29 22:19:38.000000 jtreg-test-output/hotspot/0/JTreport/html/failed.html │ │ │ │ │ +-rw-r--r-- 0 sbuild (999) sbuild (999) 4229 2026-10-29 22:19:38.000000 jtreg-test-output/hotspot/0/JTreport/html/env.html │ │ │ │ │ +-rw-r--r-- 0 sbuild (999) sbuild (999) 38205 2026-10-29 22:19:38.000000 jtreg-test-output/hotspot/0/JTreport/html/notRun_gr.html │ │ │ │ │ +-rw-r--r-- 0 sbuild (999) sbuild (999) 307 2026-10-29 22:19:38.000000 jtreg-test-output/hotspot/0/JTreport/html/report.css │ │ │ │ │ +-rw-r--r-- 0 sbuild (999) sbuild (999) 78257 2026-10-29 22:19:38.000000 jtreg-test-output/hotspot/0/JTreport/html/config.html │ │ │ │ │ +-rw-r--r-- 0 sbuild (999) sbuild (999) 631134 2026-10-29 22:19:38.000000 jtreg-test-output/hotspot/0/JTreport/html/passed.html │ │ │ │ │ +drwxr-xr-x 0 sbuild (999) sbuild (999) 0 2026-10-29 22:19:38.000000 jtreg-test-output/hotspot/0/JTreport/text/ │ │ │ │ │ +-rw-r--r-- 0 sbuild (999) sbuild (999) 475555 2026-10-29 22:19:38.000000 jtreg-test-output/hotspot/0/JTreport/text/summary.txt │ │ │ │ │ +-rw-r--r-- 0 sbuild (999) sbuild (999) 20 2026-10-29 22:19:38.000000 jtreg-test-output/hotspot/0/JTreport/text/tc_fail2error.txt │ │ │ │ │ +-rw-r--r-- 0 sbuild (999) sbuild (999) 19 2026-10-29 22:19:38.000000 jtreg-test-output/hotspot/0/JTreport/text/tc_fail2pass.txt │ │ │ │ │ +-rw-r--r-- 0 sbuild (999) sbuild (999) 887 2026-10-29 22:19:38.000000 jtreg-test-output/hotspot/0/JTreport/text/timeStats.txt │ │ │ │ │ +-rw-r--r-- 0 sbuild (999) sbuild (999) 21 2026-10-29 22:19:38.000000 jtreg-test-output/hotspot/0/JTreport/text/tc_fail2notrun.txt │ │ │ │ │ +-rw-r--r-- 0 sbuild (999) sbuild (999) 19 2026-10-29 22:19:38.000000 jtreg-test-output/hotspot/0/JTreport/text/fail2missing.txt │ │ │ │ │ +-rw-r--r-- 0 sbuild (999) sbuild (999) 16 2026-10-29 22:19:38.000000 jtreg-test-output/hotspot/0/JTreport/text/fail2fail.txt │ │ │ │ │ +-rw-r--r-- 0 sbuild (999) sbuild (999) 22 2026-10-29 22:19:38.000000 jtreg-test-output/hotspot/0/JTreport/text/tc_fail2missing.txt │ │ │ │ │ +-rw-r--r-- 0 sbuild (999) sbuild (999) 16 2026-10-29 22:19:38.000000 jtreg-test-output/hotspot/0/JTreport/text/fail2pass.txt │ │ │ │ │ +-rw-r--r-- 0 sbuild (999) sbuild (999) 19 2026-10-29 22:19:38.000000 jtreg-test-output/hotspot/0/JTreport/text/other_errors.txt │ │ │ │ │ +-rw-r--r-- 0 sbuild (999) sbuild (999) 17 2026-10-29 22:19:38.000000 jtreg-test-output/hotspot/0/JTreport/text/faiL2error.txt │ │ │ │ │ +-rw-r--r-- 0 sbuild (999) sbuild (999) 21 2026-10-29 22:19:38.000000 jtreg-test-output/hotspot/0/JTreport/text/tc_newfailures.txt │ │ │ │ │ +-rw-r--r-- 0 sbuild (999) sbuild (999) 123 2026-10-29 22:19:38.000000 jtreg-test-output/hotspot/0/JTreport/text/stats.txt │ │ │ │ │ +-rw-r--r-- 0 sbuild (999) sbuild (999) 551 2026-10-29 19:06:12.000000 jtreg-test-output/hotspot/0/JTreport/text/cmdArgs.txt │ │ │ │ │ +-rw-r--r-- 0 sbuild (999) sbuild (999) 18 2026-10-29 22:19:38.000000 jtreg-test-output/hotspot/0/JTreport/text/newfailures.txt │ │ │ │ │ +-rw-r--r-- 0 sbuild (999) sbuild (999) 9190 2026-10-29 22:19:38.000000 jtreg-test-output/hotspot/0/JTreport/text/testng.txt │ │ │ │ │ +-rw-r--r-- 0 sbuild (999) sbuild (999) 50907 2026-10-29 22:19:38.000000 jtreg-test-output/hotspot/0/JTreport/text/notRun.txt │ │ │ │ │ +-rw-r--r-- 0 sbuild (999) sbuild (999) 9713 2026-10-29 22:19:38.000000 jtreg-test-output/hotspot/0/JTreport/text/junit.txt │ │ │ │ │ +-rw-r--r-- 0 sbuild (999) sbuild (999) 18 2026-10-29 22:19:38.000000 jtreg-test-output/hotspot/0/JTreport/text/fail2notrun.txt │ │ │ │ │ +-rw-r--r-- 0 sbuild (999) sbuild (999) 0 2026-10-29 22:19:38.000000 jtreg-test-output/hotspot/0/JTreport/reportdir.dat │ │ │ │ │ +lrwxrwxrwx 0 sbuild (999) sbuild (999) 0 2026-10-29 22:19:53.000000 jtreg-test-output/hotspot/JTreport -> 0/JTreport │ │ │ │ ├── jtreg-test-output/jdk/2/JTreport/index.html │ │ │ │ │ @@ -3,15 +3,15 @@ │ │ │ │ │ │ │ │ │ │ │ │ │ │ │ │ │ │ │ │ │ │ │ │ │ Report Index │ │ │ │ │ │ │ │ │ │

/build/reproducible-path/openjdk-21-21.0.13+9/test/jdk

│ │ │ │ │ -Date of report : 22 October 2026 12:30:22 │ │ │ │ │ +Date of report : 30 October 2026 04:03:47 │ │ │ │ │ │ │ │ │ │

│ │ │ │ │ HTML Report │ │ │ │ │
Standard JT Harness HTML report. Can show a summary of the results, configuration information, and environment values.

│ │ │ │ │

│ │ │ │ │ Plain Text Report │ │ │ │ │
Standard JT Harness text report showing only test names and their result status string. Suitable for parsing by external program.

│ │ │ │ │ ├── html2text {} │ │ │ │ │ │ @@ -1,8 +1,8 @@ │ │ │ │ │ │ ************ //bbuuiilldd//rreepprroodduucciibbllee--ppaatthh//ooppeennjjddkk--2211--2211..00..1133++99//tteesstt//jjddkk ************ │ │ │ │ │ │ -Date of report : 22 October 2026 12:30:22 │ │ │ │ │ │ +Date of report : 30 October 2026 04:03:47 │ │ │ │ │ │ _H_T_M_L_ _R_e_p_o_r_t │ │ │ │ │ │ Standard JT Harness HTML report. Can show a summary of the results, │ │ │ │ │ │ configuration information, and environment values. │ │ │ │ │ │ _P_l_a_i_n_ _T_e_x_t_ _R_e_p_o_r_t │ │ │ │ │ │ Standard JT Harness text report showing only test names and their result status │ │ │ │ │ │ string. Suitable for parsing by external program. │ │ │ │ ├── jtreg-test-output/jdk/2/JTreport/html/notRun_gr.html │ │ │ │ │ @@ -47657,18 +47657,18 @@ │ │ │ │ │ 000ba280: 2063 6f72 7265 6374 6c79 0a0a 3c6c 693e correctly..
  • │ │ │ │ │ 000ba290: 7375 6e2f 7365 6375 7269 7479 2f73 6d61 sun/security/sma │ │ │ │ │ 000ba2a0: 7274 6361 7264 696f 2f54 6573 7454 7261 rtcardio/TestTra │ │ │ │ │ 000ba2b0: 6e73 6d69 742e 6a61 7661 3a20 7465 7374 nsmit.java: test │ │ │ │ │ 000ba2c0: 2074 7261 6e73 6d69 7428 2920 776f 726b transmit() work │ │ │ │ │ 000ba2d0: 730a 3c2f 756c 3e0a 3c68 723e 0a3c 736d s..
    .Report gener │ │ │ │ │ -000ba2f0: 6174 6564 206f 6e20 4f63 7420 3232 2c20 ated on Oct 22, │ │ │ │ │ -000ba300: 3230 3236 2031 323a 3330 3a32 32e2 80af 2026 12:30:22... │ │ │ │ │ -000ba310: 504d 0a3c 6272 3e55 7369 6e67 204a 5420 PM.
    Using JT │ │ │ │ │ -000ba320: 4861 726e 6573 7320 362e 3020 6232 363b Harness 6.0 b26; │ │ │ │ │ -000ba330: 2062 7569 6c74 206f 6e20 4d61 7263 6820 built on March │ │ │ │ │ -000ba340: 3138 2c20 3230 3236 2c20 3132 3a30 303a 18, 2026, 12:00: │ │ │ │ │ -000ba350: 3030 e280 af41 4d20 5554 4320 7769 7468 00...AM UTC with │ │ │ │ │ -000ba360: 206f 7065 6e6a 646b 2076 6572 7369 6f6e openjdk version │ │ │ │ │ -000ba370: 2022 3235 2e30 2e33 2d65 6122 2032 3032 "25.0.3-ea" 202 │ │ │ │ │ -000ba380: 362d 3034 2d32 313c 2f73 6d61 6c6c 3e3c 6-04-21< │ │ │ │ │ -000ba390: 2f62 6f64 793e 3c2f 6874 6d6c 3e /body> │ │ │ │ │ +000ba2f0: 6174 6564 206f 6e20 4f63 7420 3330 2c20 ated on Oct 30, │ │ │ │ │ +000ba300: 3230 3236 2034 3a30 333a 3436 e280 af41 2026 4:03:46...A │ │ │ │ │ +000ba310: 4d0a 3c62 723e 5573 696e 6720 4a54 2048 M.
    Using JT H │ │ │ │ │ +000ba320: 6172 6e65 7373 2036 2e30 2062 3236 3b20 arness 6.0 b26; │ │ │ │ │ +000ba330: 6275 696c 7420 6f6e 204d 6172 6368 2031 built on March 1 │ │ │ │ │ +000ba340: 382c 2032 3032 362c 2031 323a 3030 3a30 8, 2026, 12:00:0 │ │ │ │ │ +000ba350: 30e2 80af 414d 2055 5443 2077 6974 6820 0...AM UTC with │ │ │ │ │ +000ba360: 6f70 656e 6a64 6b20 7665 7273 696f 6e20 openjdk version │ │ │ │ │ +000ba370: 2232 352e 302e 332d 6561 2220 3230 3236 "25.0.3-ea" 2026 │ │ │ │ │ +000ba380: 2d30 342d 3231 3c2f 736d 616c 6c3e 3c2f -04-21 │ │ │ │ │ ├── html2text {} │ │ │ │ │ │ @@ -13395,10 +13395,10 @@ │ │ │ │ │ │ ()/endExclusive() works │ │ │ │ │ │ * sun/security/smartcardio/TestMultiplePresent.java: test that │ │ │ │ │ │ CardTerminals.waitForCard() works │ │ │ │ │ │ * sun/security/smartcardio/TestPresent.java: test that the isCardPresent()/ │ │ │ │ │ │ waitForX() APIs work correctly │ │ │ │ │ │ * sun/security/smartcardio/TestTransmit.java: test transmit() works │ │ │ │ │ │ =============================================================================== │ │ │ │ │ │ -Report generated on Oct 22, 2026 12:30:22 PM │ │ │ │ │ │ +Report generated on Oct 30, 2026 4:03:46 AM │ │ │ │ │ │ Using JT Harness 6.0 b26; built on March 18, 2026, 12:00:00 AM UTC with openjdk │ │ │ │ │ │ version "25.0.3-ea" 2026-04-21 │ │ │ │ ├── jtreg-test-output/jdk/2/JTreport/html/notRun.html │ │ │ │ │ @@ -47640,18 +47640,18 @@ │ │ │ │ │ 000ba170: 6f64 756c 6573 2f76 616c 6964 6174 652f odules/validate/ │ │ │ │ │ 000ba180: 5661 6c69 6461 7465 4d6f 6475 6c65 7354 ValidateModulesT │ │ │ │ │ 000ba190: 6573 742e 6a61 7661 3a20 4261 7369 6320 est.java: Basic │ │ │ │ │ 000ba1a0: 7465 7374 2066 6f72 206a 6176 6120 2d2d test for java -- │ │ │ │ │ 000ba1b0: 7661 6c69 6461 7465 2d6d 6f64 756c 6573 validate-modules │ │ │ │ │ 000ba1c0: 0a3c 6272 0a3e 0a3c 6872 3e0a 3c73 6d61 ..
    .Report genera │ │ │ │ │ -000ba1e0: 7465 6420 6f6e 204f 6374 2032 322c 2032 ted on Oct 22, 2 │ │ │ │ │ -000ba1f0: 3032 3620 3132 3a33 303a 3232 e280 af50 026 12:30:22...P │ │ │ │ │ -000ba200: 4d0a 3c62 723e 5573 696e 6720 4a54 2048 M.
    Using JT H │ │ │ │ │ -000ba210: 6172 6e65 7373 2036 2e30 2062 3236 3b20 arness 6.0 b26; │ │ │ │ │ -000ba220: 6275 696c 7420 6f6e 204d 6172 6368 2031 built on March 1 │ │ │ │ │ -000ba230: 382c 2032 3032 362c 2031 323a 3030 3a30 8, 2026, 12:00:0 │ │ │ │ │ -000ba240: 30e2 80af 414d 2055 5443 2077 6974 6820 0...AM UTC with │ │ │ │ │ -000ba250: 6f70 656e 6a64 6b20 7665 7273 696f 6e20 openjdk version │ │ │ │ │ -000ba260: 2232 352e 302e 332d 6561 2220 3230 3236 "25.0.3-ea" 2026 │ │ │ │ │ -000ba270: 2d30 342d 3231 3c2f 736d 616c 6c3e 3c2f -04-21 │ │ │ │ │ +000ba1e0: 7465 6420 6f6e 204f 6374 2033 302c 2032 ted on Oct 30, 2 │ │ │ │ │ +000ba1f0: 3032 3620 343a 3033 3a34 36e2 80af 414d 026 4:03:46...AM │ │ │ │ │ +000ba200: 0a3c 6272 3e55 7369 6e67 204a 5420 4861 .
    Using JT Ha │ │ │ │ │ +000ba210: 726e 6573 7320 362e 3020 6232 363b 2062 rness 6.0 b26; b │ │ │ │ │ +000ba220: 7569 6c74 206f 6e20 4d61 7263 6820 3138 uilt on March 18 │ │ │ │ │ +000ba230: 2c20 3230 3236 2c20 3132 3a30 303a 3030 , 2026, 12:00:00 │ │ │ │ │ +000ba240: e280 af41 4d20 5554 4320 7769 7468 206f ...AM UTC with o │ │ │ │ │ +000ba250: 7065 6e6a 646b 2076 6572 7369 6f6e 2022 penjdk version " │ │ │ │ │ +000ba260: 3235 2e30 2e33 2d65 6122 2032 3032 362d 25.0.3-ea" 2026- │ │ │ │ │ +000ba270: 3034 2d32 313c 2f73 6d61 6c6c 3e3c 2f62 04-21 │ │ │ │ │ ├── html2text {} │ │ │ │ │ │ @@ -12775,10 +12775,10 @@ │ │ │ │ │ │ tools/launcher/modules/patch/systemmodules/PatchSystemModules.java: Patch │ │ │ │ │ │ java.base and user module with ModuleHashes attribute │ │ │ │ │ │ tools/launcher/modules/showmoduleresolution/ShowModuleResolutionTest.java: │ │ │ │ │ │ Basic test for java --show-module-resolution │ │ │ │ │ │ tools/launcher/modules/validate/ValidateModulesTest.java: Basic test for java - │ │ │ │ │ │ -validate-modules │ │ │ │ │ │ =============================================================================== │ │ │ │ │ │ -Report generated on Oct 22, 2026 12:30:22 PM │ │ │ │ │ │ +Report generated on Oct 30, 2026 4:03:46 AM │ │ │ │ │ │ Using JT Harness 6.0 b26; built on March 18, 2026, 12:00:00 AM UTC with openjdk │ │ │ │ │ │ version "25.0.3-ea" 2026-04-21 │ │ │ │ ├── jtreg-test-output/jdk/2/JTreport/html/error_gr.html │ │ │ │ │ @@ -6,9 +6,9 @@ │ │ │ │ │ │ │ │ │ │ JT Harness : Tests that had errors │ │ │ │ │ │ │ │ │ │ │ │ │ │ │ │ │ │ │ │

    JT Harness : Tests that had errors

    Tests are grouped by their final status message. │ │ │ │ │
    │ │ │ │ │ -Report generated on Oct 22, 2026 12:30:22 PM │ │ │ │ │ +Report generated on Oct 30, 2026 4:03:46 AM │ │ │ │ │
    Using JT Harness 6.0 b26; built on March 18, 2026, 12:00:00 AM UTC with openjdk version "25.0.3-ea" 2026-04-21
    │ │ │ │ │ ├── html2text {} │ │ │ │ │ │ @@ -1,6 +1,6 @@ │ │ │ │ │ │ ************ JJTT HHaarrnneessss :: TTeessttss tthhaatt hhaadd eerrrroorrss ************ │ │ │ │ │ │ Tests are grouped by their final status message. │ │ │ │ │ │ =============================================================================== │ │ │ │ │ │ -Report generated on Oct 22, 2026 12:30:22 PM │ │ │ │ │ │ +Report generated on Oct 30, 2026 4:03:46 AM │ │ │ │ │ │ Using JT Harness 6.0 b26; built on March 18, 2026, 12:00:00 AM UTC with openjdk │ │ │ │ │ │ version "25.0.3-ea" 2026-04-21 │ │ │ │ ├── jtreg-test-output/jdk/2/JTreport/html/error.html │ │ │ │ │ @@ -6,9 +6,9 @@ │ │ │ │ │ │ │ │ │ │ JT Harness : Tests that had errors │ │ │ │ │ │ │ │ │ │ │ │ │ │ │ │ │ │ │ │

    JT Harness : Tests that had errors

    │ │ │ │ │
    │ │ │ │ │ -Report generated on Oct 22, 2026 12:30:22 PM │ │ │ │ │ +Report generated on Oct 30, 2026 4:03:46 AM │ │ │ │ │
    Using JT Harness 6.0 b26; built on March 18, 2026, 12:00:00 AM UTC with openjdk version "25.0.3-ea" 2026-04-21
    │ │ │ │ │ ├── html2text {} │ │ │ │ │ │ @@ -1,5 +1,5 @@ │ │ │ │ │ │ ************ JJTT HHaarrnneessss :: TTeessttss tthhaatt hhaadd eerrrroorrss ************ │ │ │ │ │ │ =============================================================================== │ │ │ │ │ │ -Report generated on Oct 22, 2026 12:30:22 PM │ │ │ │ │ │ +Report generated on Oct 30, 2026 4:03:46 AM │ │ │ │ │ │ Using JT Harness 6.0 b26; built on March 18, 2026, 12:00:00 AM UTC with openjdk │ │ │ │ │ │ version "25.0.3-ea" 2026-04-21 │ │ │ │ ├── jtreg-test-output/jdk/2/JTreport/html/failed_gr.html │ │ │ │ │ @@ -56,9 +56,9 @@ │ │ │ │ │
  • │ │ │ │ │ java/net/MulticastSocket/SetLoopbackMode.java: Test MulticastSocket.setLoopbackMode │ │ │ │ │ │ │ │ │ │
  • │ │ │ │ │ java/net/MulticastSocket/SetLoopbackModeIPv4.java: Test MulticastSocket.setLoopbackMode with IPv4 addresses │ │ │ │ │ │ │ │ │ │
    │ │ │ │ │ -Report generated on Oct 22, 2026 12:30:22 PM │ │ │ │ │ +Report generated on Oct 30, 2026 4:03:46 AM │ │ │ │ │
    Using JT Harness 6.0 b26; built on March 18, 2026, 12:00:00 AM UTC with openjdk version "25.0.3-ea" 2026-04-21
    │ │ │ │ │ ├── html2text {} │ │ │ │ │ │ @@ -25,10 +25,10 @@ │ │ │ │ │ │ * _j_a_v_a_/_n_e_t_/_M_u_l_t_i_c_a_s_t_S_o_c_k_e_t_/_N_o_L_o_o_p_b_a_c_k_P_a_c_k_e_t_s_._j_a_v_a: Re-test IPv6 (and │ │ │ │ │ │ specifically MulticastSocket) with latest Linux & USAGI code │ │ │ │ │ │ * _j_a_v_a_/_n_e_t_/_M_u_l_t_i_c_a_s_t_S_o_c_k_e_t_/_S_e_t_L_o_o_p_b_a_c_k_M_o_d_e_._j_a_v_a: Test │ │ │ │ │ │ MulticastSocket.setLoopbackMode │ │ │ │ │ │ * _j_a_v_a_/_n_e_t_/_M_u_l_t_i_c_a_s_t_S_o_c_k_e_t_/_S_e_t_L_o_o_p_b_a_c_k_M_o_d_e_I_P_v_4_._j_a_v_a: Test │ │ │ │ │ │ MulticastSocket.setLoopbackMode with IPv4 addresses │ │ │ │ │ │ =============================================================================== │ │ │ │ │ │ -Report generated on Oct 22, 2026 12:30:22 PM │ │ │ │ │ │ +Report generated on Oct 30, 2026 4:03:46 AM │ │ │ │ │ │ Using JT Harness 6.0 b26; built on March 18, 2026, 12:00:00 AM UTC with openjdk │ │ │ │ │ │ version "25.0.3-ea" 2026-04-21 │ │ │ │ ├── jtreg-test-output/jdk/2/JTreport/html/failed.html │ │ │ │ │ @@ -33,9 +33,9 @@ │ │ │ │ │ java/net/SocketPermission/SocketPermissionTest.java: SocketPermission tests for legacy socket types. │ │ │ │ │
    │ │ │ │ │ sun/security/krb5/auto/Addresses.java: fix krb5 caddr │ │ │ │ │
    │ │ │ │ │
    │ │ │ │ │ -Report generated on Oct 22, 2026 12:30:22 PM │ │ │ │ │ +Report generated on Oct 30, 2026 4:03:46 AM │ │ │ │ │
    Using JT Harness 6.0 b26; built on March 18, 2026, 12:00:00 AM UTC with openjdk version "25.0.3-ea" 2026-04-21
    │ │ │ │ │ ├── html2text {} │ │ │ │ │ │ @@ -11,10 +11,10 @@ │ │ │ │ │ │ MulticastSocket.setLoopbackMode with IPv4 addresses │ │ │ │ │ │ _j_a_v_a_/_n_e_t_/_M_u_l_t_i_c_a_s_t_S_o_c_k_e_t_/_T_e_s_t_._j_a_v_a: IPv4 and IPv6 multicasting broken on Linux │ │ │ │ │ │ _j_a_v_a_/_n_e_t_/_S_o_c_k_e_t_O_p_t_i_o_n_/_O_p_t_i_o_n_s_T_e_s_t_._j_a_v_a: │ │ │ │ │ │ _j_a_v_a_/_n_e_t_/_S_o_c_k_e_t_P_e_r_m_i_s_s_i_o_n_/_S_o_c_k_e_t_P_e_r_m_i_s_s_i_o_n_T_e_s_t_._j_a_v_a: SocketPermission tests for │ │ │ │ │ │ legacy socket types. │ │ │ │ │ │ _s_u_n_/_s_e_c_u_r_i_t_y_/_k_r_b_5_/_a_u_t_o_/_A_d_d_r_e_s_s_e_s_._j_a_v_a: fix krb5 caddr │ │ │ │ │ │ =============================================================================== │ │ │ │ │ │ -Report generated on Oct 22, 2026 12:30:22 PM │ │ │ │ │ │ +Report generated on Oct 30, 2026 4:03:46 AM │ │ │ │ │ │ Using JT Harness 6.0 b26; built on March 18, 2026, 12:00:00 AM UTC with openjdk │ │ │ │ │ │ version "25.0.3-ea" 2026-04-21 │ │ │ │ ├── jtreg-test-output/jdk/2/JTreport/html/passed_gr.html │ │ │ │ │ @@ -242,77986 +242,77995 @@ │ │ │ │ │ 00000f10: 7373 6669 6c65 2f65 7861 6d70 6c65 732f ssfile/examples/ │ │ │ │ │ 00000f20: 5472 616e 7366 6f72 6d45 7861 6d70 6c65 TransformExample │ │ │ │ │ 00000f30: 732e 6a61 7661 3c2f 613e 3a20 5465 7374 s.java: Test │ │ │ │ │ 00000f40: 696e 6720 436c 6173 7366 696c 6520 5472 ing Classfile Tr │ │ │ │ │ 00000f50: 616e 7366 6f72 6d45 7861 6d70 6c65 7320 ansformExamples │ │ │ │ │ 00000f60: 636f 6d70 696c 6174 696f 6e2e 0a3c 2f75 compilation....

    DEBUG: [ │ │ │ │ │ -00000f80: 4874 7470 436c 6965 6e74 2d31 2d57 6f72 HttpClient-1-Wor │ │ │ │ │ -00000f90: 6b65 722d 305d 205b 3933 386d 735d 2053 ker-0] [938ms] S │ │ │ │ │ -00000fa0: 534c 2057 7269 7465 7228 536f 636b 6574 SL Writer(Socket │ │ │ │ │ -00000fb0: 5475 6265 2831 2929 2070 726f 6365 7373 Tube(1)) process │ │ │ │ │ -00000fc0: 4461 7461 2c20 7772 6974 654c 6973 7420 Data, writeList │ │ │ │ │ -00000fd0: 7265 6d61 696e 696e 673a 302c 2068 7354 remaining:0, hsT │ │ │ │ │ -00000fe0: 7269 6767 6572 6564 3a74 7275 652c 206e riggered:true, n │ │ │ │ │ -00000ff0: 6565 6457 7261 703a 7472 7565 3c2f 6834 eedWrap:true

    ....

    Exec │ │ │ │ │ -000010d0: 7574 696f 6e20 6661 696c 6564 2061 7320 ution failed as │ │ │ │ │ -000010e0: 6578 7065 6374 6564 3c2f 6834 3e0a 0a3c expected

    ..< │ │ │ │ │ -000010f0: 756c 3e0a 3c6c 693e 0a3c 6120 6872 6566 ul>.
  • .com/ │ │ │ │ │ -00001140: 7375 6e2f 7365 6375 7269 7479 2f73 6173 sun/security/sas │ │ │ │ │ -00001150: 6c2f 6469 6765 7374 2f55 6e62 6f75 6e64 l/digest/Unbound │ │ │ │ │ -00001160: 2e6a 6176 613c 2f61 3e3a 2053 4153 4c20 .java: SASL │ │ │ │ │ -00001170: 7365 7276 6963 6520 666f 7220 6d75 6c74 service for mult │ │ │ │ │ -00001180: 6970 6c65 2068 6f73 746e 616d 6573 0a0a iple hostnames.. │ │ │ │ │ -00001190: 3c6c 693e 0a3c 6120 6872 6566 3d22 2f74
  • .java │ │ │ │ │ -000011f0: 2f6e 696f 2f63 6861 6e6e 656c 732f 4173 /nio/channels/As │ │ │ │ │ -00001200: 796e 6368 726f 6e6f 7573 4368 616e 6e65 ynchronousChanne │ │ │ │ │ -00001210: 6c47 726f 7570 2f42 6164 5072 6f70 6572 lGroup/BadProper │ │ │ │ │ -00001220: 7469 6573 2e6a 6176 613c 2f61 3e3a 2055 ties.java: U │ │ │ │ │ -00001230: 6e69 7420 7465 7374 2066 6f72 2041 7379 nit test for Asy │ │ │ │ │ -00001240: 6e63 6872 6f6e 6f75 7343 6861 6e6e 656c nchronousChannel │ │ │ │ │ -00001250: 4772 6f75 700a 0a3c 6c69 3e0a 3c61 2068 Group..
  • .sun/securi │ │ │ │ │ -000012b0: 7479 2f6a 6773 732f 7370 6e65 676f 2f4e ty/jgss/spnego/N │ │ │ │ │ -000012c0: 6567 546f 6b65 6e54 6172 6746 6965 6c64 egTokenTargField │ │ │ │ │ -000012d0: 732e 6a61 7661 3c2f 613e 3a20 5350 4e45 s.java: SPNE │ │ │ │ │ -000012e0: 474f 2047 5353 2063 6f64 6520 646f 6573 GO GSS code does │ │ │ │ │ -000012f0: 206e 6f74 2070 6172 7365 2074 6f6b 656e not parse token │ │ │ │ │ -00001300: 7320 696e 2061 6363 6f72 6461 6e63 6520 s in accordance │ │ │ │ │ -00001310: 746f 2052 4643 2032 3437 380a 0a3c 6c69 to RFC 2478..
  • .java/net │ │ │ │ │ +00001070: 2f68 7474 7063 6c69 656e 742f 536d 6f6b /httpclient/Smok │ │ │ │ │ +00001080: 6554 6573 742e 6a61 7661 3c2f 613e 3a20 eTest.java: │ │ │ │ │ +00001090: 200a 3c2f 756c 3e0a 0a3c 6834 3e44 4542 ...

    DEB │ │ │ │ │ +000010a0: 5547 3a20 5b48 7474 7043 6c69 656e 742d UG: [HttpClient- │ │ │ │ │ +000010b0: 3336 2d53 656c 6563 746f 724d 616e 6167 36-SelectorManag │ │ │ │ │ +000010c0: 6572 5d20 5b32 7320 3837 386d 735d 2053 er] [2s 878ms] S │ │ │ │ │ +000010d0: 6f63 6b65 7454 7562 6528 3336 2920 7265 ocketTube(36) re │ │ │ │ │ +000010e0: 7375 6d69 6e67 2072 6561 6420 6576 656e suming read even │ │ │ │ │ +000010f0: 743c 2f68 343e 0a0a 3c75 6c3e 0a3c 6c69 t

    ....

    │ │ │ │ │ +00001880: 4578 6563 7574 696f 6e20 7375 6363 6573 Execution succes │ │ │ │ │ +00001890: 7366 756c 3c2f 6834 3e0a 0a3c 756c 3e0a sful

    ..