--- /srv/rebuilderd/tmp/rebuilderdAtGVaf/inputs/openjdk-21-jdk_21.0.13+9-1~deb13u2_arm64.deb +++ /srv/rebuilderd/tmp/rebuilderdAtGVaf/out/openjdk-21-jdk_21.0.13+9-1~deb13u2_arm64.deb ├── file list │ @@ -1,3 +1,3 @@ │ -rw-r--r-- 0 0 0 4 2026-10-24 19:08:21.000000 debian-binary │ -rw-r--r-- 0 0 0 1844 2026-10-24 19:08:21.000000 control.tar.xz │ --rw-r--r-- 0 0 0 3609196 2026-10-24 19:08:21.000000 data.tar.xz │ +-rw-r--r-- 0 0 0 3617340 2026-10-24 19:08:21.000000 data.tar.xz ├── control.tar.xz │ ├── control.tar │ │ ├── ./control │ │ │ @@ -1,13 +1,13 @@ │ │ │ Package: openjdk-21-jdk │ │ │ Source: openjdk-21 │ │ │ Version: 21.0.13+9-1~deb13u2 │ │ │ Architecture: arm64 │ │ │ Maintainer: OpenJDK Team │ │ │ -Installed-Size: 3778 │ │ │ +Installed-Size: 3790 │ │ │ Depends: openjdk-21-jre (= 21.0.13+9-1~deb13u2), openjdk-21-jdk-headless (= 21.0.13+9-1~deb13u2), libc6 (>= 2.34), zlib1g (>= 1:1.1.4) │ │ │ Recommends: libxt-dev │ │ │ Suggests: openjdk-21-demo, openjdk-21-source, visualvm │ │ │ Provides: java-compiler, java-sdk (= 21), java10-sdk, java11-sdk, java12-sdk, java13-sdk, java14-sdk, java15-sdk, java16-sdk, java17-sdk, java18-sdk, java19-sdk, java2-sdk, java20-sdk, java21-sdk, java5-sdk, java6-sdk, java7-sdk, java8-sdk, java9-sdk │ │ │ Section: java │ │ │ Priority: optional │ │ │ Multi-Arch: same │ │ ├── ./md5sums │ │ │ ├── ./md5sums │ │ │ │┄ Files differ ├── data.tar.xz │ ├── data.tar │ │ ├── file list │ │ │ @@ -17,13 +17,13 @@ │ │ │ drwxr-xr-x 0 root (0) root (0) 0 2026-10-24 19:08:21.000000 ./usr/share/doc/ │ │ │ drwxr-xr-x 0 root (0) root (0) 0 2026-10-24 19:08:21.000000 ./usr/share/doc/openjdk-21-jre-headless/ │ │ │ drwxr-xr-x 0 root (0) root (0) 0 2026-10-24 19:08:21.000000 ./usr/share/doc/openjdk-21-jre-headless/test-arm64/ │ │ │ -rw-r--r-- 0 root (0) root (0) 28695 2026-10-24 19:08:21.000000 ./usr/share/doc/openjdk-21-jre-headless/test-arm64/check-hotspot-hotspot.log.gz │ │ │ -rw-r--r-- 0 root (0) root (0) 3919 2026-10-24 19:08:21.000000 ./usr/share/doc/openjdk-21-jre-headless/test-arm64/check-jaxp-hotspot.log.gz │ │ │ -rw-r--r-- 0 root (0) root (0) 55751 2026-10-24 19:08:21.000000 ./usr/share/doc/openjdk-21-jre-headless/test-arm64/check-jdk-hotspot.log.gz │ │ │ -rw-r--r-- 0 root (0) root (0) 35242 2026-10-24 19:08:21.000000 ./usr/share/doc/openjdk-21-jre-headless/test-arm64/check-langtools-hotspot.log.gz │ │ │ --rw-r--r-- 0 root (0) root (0) 8563 2026-10-24 19:08:21.000000 ./usr/share/doc/openjdk-21-jre-headless/test-arm64/failed_tests-hotspot.tar.gz │ │ │ +-rw-r--r-- 0 root (0) root (0) 8593 2026-10-24 19:08:21.000000 ./usr/share/doc/openjdk-21-jre-headless/test-arm64/failed_tests-hotspot.tar.gz │ │ │ -rw-r--r-- 0 root (0) root (0) 3397 2026-10-24 19:08:21.000000 ./usr/share/doc/openjdk-21-jre-headless/test-arm64/jtreg-summary-hotspot.log │ │ │ --rw-r--r-- 0 root (0) root (0) 127689 2026-10-24 19:08:21.000000 ./usr/share/doc/openjdk-21-jre-headless/test-arm64/jtreg_output-hotspot.log.gz │ │ │ --rw-r--r-- 0 root (0) root (0) 3492937 2026-10-24 19:08:21.000000 ./usr/share/doc/openjdk-21-jre-headless/test-arm64/jtreport-hotspot.tar.gz │ │ │ +-rw-r--r-- 0 root (0) root (0) 127736 2026-10-24 19:08:21.000000 ./usr/share/doc/openjdk-21-jre-headless/test-arm64/jtreg_output-hotspot.log.gz │ │ │ +-rw-r--r-- 0 root (0) root (0) 3505576 2026-10-24 19:08:21.000000 ./usr/share/doc/openjdk-21-jre-headless/test-arm64/jtreport-hotspot.tar.gz │ │ │ lrwxrwxrwx 0 root (0) root (0) 0 2026-10-24 19:08:21.000000 ./usr/lib/jvm/openjdk-21/src.zip -> lib/src.zip │ │ │ lrwxrwxrwx 0 root (0) root (0) 0 2026-10-24 19:08:21.000000 ./usr/share/doc/openjdk-21-jdk -> openjdk-21-jre │ │ ├── ./usr/share/doc/openjdk-21-jre-headless/test-arm64/failed_tests-hotspot.tar.gz │ │ │ ├── failed_tests-hotspot.tar │ │ │ │ ├── file list │ │ │ │ │ @@ -1,9 +1,9 @@ │ │ │ │ │ --rw-r--r-- 0 sbuild (999) sbuild (999) 6791 2026-10-26 01:43:26.000000 jtreg-test-output/jdk/JTwork/java/net/MulticastSocket/B6427403.jtr │ │ │ │ │ --rw-r--r-- 0 sbuild (999) sbuild (999) 7810 2026-10-26 01:43:26.000000 jtreg-test-output/jdk/JTwork/java/net/MulticastSocket/NoLoopbackPackets.jtr │ │ │ │ │ --rw-r--r-- 0 sbuild (999) sbuild (999) 7814 2026-10-26 01:43:27.000000 jtreg-test-output/jdk/JTwork/java/net/MulticastSocket/Promiscuous.jtr │ │ │ │ │ --rw-r--r-- 0 sbuild (999) sbuild (999) 8435 2026-10-26 01:43:27.000000 jtreg-test-output/jdk/JTwork/java/net/MulticastSocket/SetLoopbackMode.jtr │ │ │ │ │ --rw-r--r-- 0 sbuild (999) sbuild (999) 8850 2026-10-26 01:43:27.000000 jtreg-test-output/jdk/JTwork/java/net/MulticastSocket/SetLoopbackModeIPv4.jtr │ │ │ │ │ --rw-r--r-- 0 sbuild (999) sbuild (999) 9706 2026-10-26 01:43:27.000000 jtreg-test-output/jdk/JTwork/java/net/MulticastSocket/Test.jtr │ │ │ │ │ --rw-r--r-- 0 sbuild (999) sbuild (999) 7457 2026-10-26 01:43:27.000000 jtreg-test-output/jdk/JTwork/java/net/SocketOption/OptionsTest.jtr │ │ │ │ │ --rw-r--r-- 0 sbuild (999) sbuild (999) 15140 2026-10-26 01:43:28.000000 jtreg-test-output/jdk/JTwork/java/net/SocketPermission/SocketPermissionTest.jtr │ │ │ │ │ --rw-r--r-- 0 sbuild (999) sbuild (999) 25697 2026-10-26 01:43:31.000000 jtreg-test-output/jdk/JTwork/sun/security/krb5/auto/Addresses.jtr │ │ │ │ │ +-rw-r--r-- 0 sbuild (996) sbuild (996) 6812 2026-10-30 12:28:20.000000 jtreg-test-output/jdk/JTwork/java/net/MulticastSocket/B6427403.jtr │ │ │ │ │ +-rw-r--r-- 0 sbuild (996) sbuild (996) 7831 2026-10-30 12:28:20.000000 jtreg-test-output/jdk/JTwork/java/net/MulticastSocket/NoLoopbackPackets.jtr │ │ │ │ │ +-rw-r--r-- 0 sbuild (996) sbuild (996) 7837 2026-10-30 12:28:20.000000 jtreg-test-output/jdk/JTwork/java/net/MulticastSocket/Promiscuous.jtr │ │ │ │ │ +-rw-r--r-- 0 sbuild (996) sbuild (996) 8452 2026-10-30 12:28:21.000000 jtreg-test-output/jdk/JTwork/java/net/MulticastSocket/SetLoopbackMode.jtr │ │ │ │ │ +-rw-r--r-- 0 sbuild (996) sbuild (996) 8869 2026-10-30 12:28:21.000000 jtreg-test-output/jdk/JTwork/java/net/MulticastSocket/SetLoopbackModeIPv4.jtr │ │ │ │ │ +-rw-r--r-- 0 sbuild (996) sbuild (996) 9724 2026-10-30 12:28:21.000000 jtreg-test-output/jdk/JTwork/java/net/MulticastSocket/Test.jtr │ │ │ │ │ +-rw-r--r-- 0 sbuild (996) sbuild (996) 7476 2026-10-30 12:28:21.000000 jtreg-test-output/jdk/JTwork/java/net/SocketOption/OptionsTest.jtr │ │ │ │ │ +-rw-r--r-- 0 sbuild (996) sbuild (996) 15158 2026-10-30 12:28:23.000000 jtreg-test-output/jdk/JTwork/java/net/SocketPermission/SocketPermissionTest.jtr │ │ │ │ │ +-rw-r--r-- 0 sbuild (996) sbuild (996) 25718 2026-10-30 12:28:26.000000 jtreg-test-output/jdk/JTwork/sun/security/krb5/auto/Addresses.jtr │ │ │ │ ├── jtreg-test-output/jdk/JTwork/java/net/MulticastSocket/B6427403.jtr │ │ │ │ │ @@ -1,70 +1,70 @@ │ │ │ │ │ #Test Results (version 2) │ │ │ │ │ -#Mon Oct 26 01:43:26 UTC 2026 │ │ │ │ │ +#Fri Oct 30 12:28:20 UTC 2026 │ │ │ │ │ #-----testdescription----- │ │ │ │ │ $file=/build/reproducible-path/openjdk-21-21.0.13+9/test/jdk/java/net/MulticastSocket/B6427403.java │ │ │ │ │ $root=/build/reproducible-path/openjdk-21-21.0.13+9/test/jdk │ │ │ │ │ keywords=bug6427403 │ │ │ │ │ run=USER_SPECIFIED main B6427403\n │ │ │ │ │ source=B6427403.java │ │ │ │ │ title=java.net.MulticastSocket.joinGroup() reports 'socket closed' │ │ │ │ │ │ │ │ │ │ #-----environment----- │ │ │ │ │ │ │ │ │ │ #-----testresult----- │ │ │ │ │ description=file\:/build/reproducible-path/openjdk-21-21.0.13+9/test/jdk/java/net/MulticastSocket/B6427403.java │ │ │ │ │ -elapsed=621 0\:00\:00.621 │ │ │ │ │ -end=Mon Oct 26 01\:43\:26 UTC 2026 │ │ │ │ │ +elapsed=1091 0\:00\:01.091 │ │ │ │ │ +end=Fri Oct 30 12\:28\:20 UTC 2026 │ │ │ │ │ environment=regtest │ │ │ │ │ execStatus=Failed. Execution failed\: `main' threw exception\: java.net.SocketException\: No such device (setsockopt failed) │ │ │ │ │ harnessLoaderMode=Classpath Loader │ │ │ │ │ harnessVariety=Full Bundle │ │ │ │ │ hostname=sbuild │ │ │ │ │ -javatestOS=Linux 6.12.113+deb13-arm64 (aarch64) │ │ │ │ │ +javatestOS=Linux 6.12.113+deb13-cloud-arm64 (aarch64) │ │ │ │ │ javatestVersion=6.0-ea+b24-1970-01-25-${BUILT_FROM_COMMIT} │ │ │ │ │ jtregVersion=jtreg 8.3 src 1 │ │ │ │ │ script=com.sun.javatest.regtest.exec.RegressionScript │ │ │ │ │ sections=script_messages build main │ │ │ │ │ -start=Mon Oct 26 01\:43\:26 UTC 2026 │ │ │ │ │ +start=Fri Oct 30 12\:28\:19 UTC 2026 │ │ │ │ │ test=java/net/MulticastSocket/B6427403.java │ │ │ │ │ testJDK=/build/reproducible-path/openjdk-21-21.0.13+9/build/bootcycle-build/images/jdk │ │ │ │ │ -testJDK_OS=[name\:Linux,arch\:aarch64,version\:6.12.113+deb13-arm64,family\:linux,simple_arch\:aarch64,simple_version\:6.12,processors\:8,maxMemory\:25155866624,maxSwap\:182536105984] │ │ │ │ │ +testJDK_OS=[name\:Linux,arch\:aarch64,version\:6.12.113+deb13-cloud-arm64,family\:linux,simple_arch\:aarch64,simple_version\:6.12,processors\:12,maxMemory\:33596653568,maxSwap\:137438949376] │ │ │ │ │ testJDK_os.arch=aarch64 │ │ │ │ │ testJDK_os.name=Linux │ │ │ │ │ -testJDK_os.version=6.12.113+deb13-arm64 │ │ │ │ │ -totalTime=632 │ │ │ │ │ +testJDK_os.version=6.12.113+deb13-cloud-arm64 │ │ │ │ │ +totalTime=1097 │ │ │ │ │ user.name=sbuild │ │ │ │ │ work=/tmp/jdk/JTwork/java/net/MulticastSocket │ │ │ │ │ │ │ │ │ │ #section:script_messages │ │ │ │ │ ----------messages:(4/276)---------- │ │ │ │ │ JDK under test: /build/reproducible-path/openjdk-21-21.0.13+9/build/bootcycle-build/images/jdk │ │ │ │ │ openjdk version "21.0.13" 2026-10-20 │ │ │ │ │ OpenJDK Runtime Environment (build 21.0.13+9-1-deb13u2-Debian) │ │ │ │ │ OpenJDK 64-Bit Server VM (build 21.0.13+9-1-deb13u2-Debian, mixed mode, sharing) │ │ │ │ │ │ │ │ │ │ #section:build │ │ │ │ │ ----------messages:(5/178)---------- │ │ │ │ │ command: build B6427403 │ │ │ │ │ reason: Named class compiled on demand │ │ │ │ │ -started: Mon Oct 26 01:43:26.368 UTC 2026 │ │ │ │ │ -finished: Mon Oct 26 01:43:26.392 UTC 2026 │ │ │ │ │ -elapsed time (seconds): 0.024 │ │ │ │ │ +started: Fri Oct 30 12:28:19.854 UTC 2026 │ │ │ │ │ +finished: Fri Oct 30 12:28:19.895 UTC 2026 │ │ │ │ │ +elapsed time (seconds): 0.041 │ │ │ │ │ result: Passed. All files up to date │ │ │ │ │ │ │ │ │ │ #section:main │ │ │ │ │ ----------messages:(8/234)---------- │ │ │ │ │ command: main B6427403 │ │ │ │ │ reason: User specified action: run main B6427403 │ │ │ │ │ -started: Mon Oct 26 01:43:26.395 UTC 2026 │ │ │ │ │ +started: Fri Oct 30 12:28:19.897 UTC 2026 │ │ │ │ │ Mode: agentvm │ │ │ │ │ Agent id: 1 │ │ │ │ │ -Process id: 2875568 │ │ │ │ │ -finished: Mon Oct 26 01:43:26.839 UTC 2026 │ │ │ │ │ -elapsed time (seconds): 0.444 │ │ │ │ │ +Process id: 2700270 │ │ │ │ │ +finished: Fri Oct 30 12:28:20.719 UTC 2026 │ │ │ │ │ +elapsed time (seconds): 0.822 │ │ │ │ │ ----------configuration:(15/666)---------- │ │ │ │ │ Boot Layer │ │ │ │ │ class path: /usr/share/jtreg/lib/javatest.jar │ │ │ │ │ /usr/share/jtreg/lib/jtreg.jar │ │ │ │ │ /usr/share/jtreg/lib/junit-platform-console-standalone.jar │ │ │ │ │ /usr/share/jtreg/lib/testng.jar │ │ │ │ │ /usr/share/jtreg/lib/guice.jar │ │ │ │ ├── jtreg-test-output/jdk/JTwork/java/net/MulticastSocket/NoLoopbackPackets.jtr │ │ │ │ │ @@ -1,75 +1,75 @@ │ │ │ │ │ #Test Results (version 2) │ │ │ │ │ -#Mon Oct 26 01:43:26 UTC 2026 │ │ │ │ │ +#Fri Oct 30 12:28:20 UTC 2026 │ │ │ │ │ #-----testdescription----- │ │ │ │ │ $file=/build/reproducible-path/openjdk-21-21.0.13+9/test/jdk/java/net/MulticastSocket/NoLoopbackPackets.java │ │ │ │ │ $root=/build/reproducible-path/openjdk-21-21.0.13+9/test/jdk │ │ │ │ │ keywords=bug4742177 │ │ │ │ │ library=/test/lib │ │ │ │ │ requires=os.family \!\= "windows" │ │ │ │ │ run=ASSUMED_ACTION main NoLoopbackPackets\n │ │ │ │ │ source=NoLoopbackPackets.java │ │ │ │ │ title=Re-test IPv6 (and specifically MulticastSocket) with latest Linux & USAGI code │ │ │ │ │ │ │ │ │ │ #-----environment----- │ │ │ │ │ │ │ │ │ │ #-----testresult----- │ │ │ │ │ description=file\:/build/reproducible-path/openjdk-21-21.0.13+9/test/jdk/java/net/MulticastSocket/NoLoopbackPackets.java │ │ │ │ │ -elapsed=101 0\:00\:00.101 │ │ │ │ │ -end=Mon Oct 26 01\:43\:26 UTC 2026 │ │ │ │ │ +elapsed=119 0\:00\:00.119 │ │ │ │ │ +end=Fri Oct 30 12\:28\:20 UTC 2026 │ │ │ │ │ environment=regtest │ │ │ │ │ execStatus=Failed. Execution failed\: `main' threw exception\: java.net.SocketException\: No such device (setsockopt failed) │ │ │ │ │ harnessLoaderMode=Classpath Loader │ │ │ │ │ harnessVariety=Full Bundle │ │ │ │ │ hostname=sbuild │ │ │ │ │ -javatestOS=Linux 6.12.113+deb13-arm64 (aarch64) │ │ │ │ │ +javatestOS=Linux 6.12.113+deb13-cloud-arm64 (aarch64) │ │ │ │ │ javatestVersion=6.0-ea+b24-1970-01-25-${BUILT_FROM_COMMIT} │ │ │ │ │ jtregVersion=jtreg 8.3 src 1 │ │ │ │ │ script=com.sun.javatest.regtest.exec.RegressionScript │ │ │ │ │ sections=script_messages build main │ │ │ │ │ -start=Mon Oct 26 01\:43\:26 UTC 2026 │ │ │ │ │ +start=Fri Oct 30 12\:28\:20 UTC 2026 │ │ │ │ │ test=java/net/MulticastSocket/NoLoopbackPackets.java │ │ │ │ │ testJDK=/build/reproducible-path/openjdk-21-21.0.13+9/build/bootcycle-build/images/jdk │ │ │ │ │ -testJDK_OS=[name\:Linux,arch\:aarch64,version\:6.12.113+deb13-arm64,family\:linux,simple_arch\:aarch64,simple_version\:6.12,processors\:8,maxMemory\:25155866624,maxSwap\:182536105984] │ │ │ │ │ +testJDK_OS=[name\:Linux,arch\:aarch64,version\:6.12.113+deb13-cloud-arm64,family\:linux,simple_arch\:aarch64,simple_version\:6.12,processors\:12,maxMemory\:33596653568,maxSwap\:137438949376] │ │ │ │ │ testJDK_os.arch=aarch64 │ │ │ │ │ testJDK_os.name=Linux │ │ │ │ │ -testJDK_os.version=6.12.113+deb13-arm64 │ │ │ │ │ -totalTime=103 │ │ │ │ │ +testJDK_os.version=6.12.113+deb13-cloud-arm64 │ │ │ │ │ +totalTime=120 │ │ │ │ │ user.name=sbuild │ │ │ │ │ work=/tmp/jdk/JTwork/java/net/MulticastSocket │ │ │ │ │ │ │ │ │ │ #section:script_messages │ │ │ │ │ ----------messages:(7/484)---------- │ │ │ │ │ JDK under test: /build/reproducible-path/openjdk-21-21.0.13+9/build/bootcycle-build/images/jdk │ │ │ │ │ openjdk version "21.0.13" 2026-10-20 │ │ │ │ │ OpenJDK Runtime Environment (build 21.0.13+9-1-deb13u2-Debian) │ │ │ │ │ OpenJDK 64-Bit Server VM (build 21.0.13+9-1-deb13u2-Debian, mixed mode, sharing) │ │ │ │ │ Library /test/lib; kind: packages │ │ │ │ │ source directory: /build/reproducible-path/openjdk-21-21.0.13+9/test/lib │ │ │ │ │ class directory: /tmp/jdk/JTwork/classes/java/net/MulticastSocket/NoLoopbackPackets.d/test/lib │ │ │ │ │ │ │ │ │ │ #section:build │ │ │ │ │ -----------messages:(5/185)---------- │ │ │ │ │ +----------messages:(5/187)---------- │ │ │ │ │ command: build NoLoopbackPackets │ │ │ │ │ reason: Named class compiled on demand │ │ │ │ │ -started: Mon Oct 26 01:43:26.859 UTC 2026 │ │ │ │ │ -finished: Mon Oct 26 01:43:26.859 UTC 2026 │ │ │ │ │ -elapsed time (seconds): 0.0 │ │ │ │ │ +started: Fri Oct 30 12:28:20.743 UTC 2026 │ │ │ │ │ +finished: Fri Oct 30 12:28:20.744 UTC 2026 │ │ │ │ │ +elapsed time (seconds): 0.001 │ │ │ │ │ result: Passed. All files up to date │ │ │ │ │ │ │ │ │ │ #section:main │ │ │ │ │ ----------messages:(8/264)---------- │ │ │ │ │ command: main NoLoopbackPackets │ │ │ │ │ reason: Assumed action based on file name: run main NoLoopbackPackets │ │ │ │ │ -started: Mon Oct 26 01:43:26.859 UTC 2026 │ │ │ │ │ +started: Fri Oct 30 12:28:20.744 UTC 2026 │ │ │ │ │ Mode: agentvm │ │ │ │ │ Agent id: 1 │ │ │ │ │ -Process id: 2875568 │ │ │ │ │ -finished: Mon Oct 26 01:43:26.955 UTC 2026 │ │ │ │ │ -elapsed time (seconds): 0.096 │ │ │ │ │ +Process id: 2700270 │ │ │ │ │ +finished: Fri Oct 30 12:28:20.855 UTC 2026 │ │ │ │ │ +elapsed time (seconds): 0.111 │ │ │ │ │ ----------configuration:(17/836)---------- │ │ │ │ │ Boot Layer │ │ │ │ │ class path: /usr/share/jtreg/lib/javatest.jar │ │ │ │ │ /usr/share/jtreg/lib/jtreg.jar │ │ │ │ │ /usr/share/jtreg/lib/junit-platform-console-standalone.jar │ │ │ │ │ /usr/share/jtreg/lib/testng.jar │ │ │ │ │ /usr/share/jtreg/lib/guice.jar │ │ │ │ │ @@ -113,15 +113,15 @@ │ │ │ │ │ -Dtest.class.path=/tmp/jdk/JTwork/classes/java/net/MulticastSocket/NoLoopbackPackets.d:/tmp/jdk/JTwork/classes/java/net/MulticastSocket/NoLoopbackPackets.d/test/lib \\ │ │ │ │ │ -Dtest.class.path.prefix=/tmp/jdk/JTwork/classes/java/net/MulticastSocket/NoLoopbackPackets.d:/build/reproducible-path/openjdk-21-21.0.13+9/test/jdk/java/net/MulticastSocket:/tmp/jdk/JTwork/classes/java/net/MulticastSocket/NoLoopbackPackets.d/test/lib \\ │ │ │ │ │ -classpath /tmp/jdk/JTwork/classes/java/net/MulticastSocket/NoLoopbackPackets.d:/build/reproducible-path/openjdk-21-21.0.13+9/test/jdk/java/net/MulticastSocket:/tmp/jdk/JTwork/classes/java/net/MulticastSocket/NoLoopbackPackets.d/test/lib:/build/reproducible-path/openjdk-21-21.0.13+9/test/lib:/usr/share/jtreg/lib/javatest.jar:/usr/share/jtreg/lib/jtreg.jar \\ │ │ │ │ │ NoLoopbackPackets │ │ │ │ │ ----------stdout:(0/0)---------- │ │ │ │ │ ----------stderr:(0/0)---------- │ │ │ │ │ ----------System.out:(1/32)---------- │ │ │ │ │ -joining group: /224.1.1.1:45333 │ │ │ │ │ +joining group: /224.1.1.1:44537 │ │ │ │ │ ----------System.err:(17/1050)---------- │ │ │ │ │ java.net.SocketException: No such device (setsockopt failed) │ │ │ │ │ at java.base/sun.nio.ch.Net.joinOrDrop4(Native Method) │ │ │ │ │ at java.base/sun.nio.ch.Net.join4(Net.java:720) │ │ │ │ │ at java.base/sun.nio.ch.DatagramChannelImpl.innerJoin(DatagramChannelImpl.java:1676) │ │ │ │ │ at java.base/sun.nio.ch.DatagramChannelImpl.join(DatagramChannelImpl.java:1694) │ │ │ │ │ at java.base/sun.nio.ch.DatagramSocketAdaptor.joinGroup(DatagramSocketAdaptor.java:494) │ │ │ │ ├── jtreg-test-output/jdk/JTwork/java/net/MulticastSocket/Promiscuous.jtr │ │ │ │ │ @@ -1,74 +1,74 @@ │ │ │ │ │ #Test Results (version 2) │ │ │ │ │ -#Mon Oct 26 01:43:27 UTC 2026 │ │ │ │ │ +#Fri Oct 30 12:28:20 UTC 2026 │ │ │ │ │ #-----testdescription----- │ │ │ │ │ $file=/build/reproducible-path/openjdk-21-21.0.13+9/test/jdk/java/net/MulticastSocket/Promiscuous.java │ │ │ │ │ $root=/build/reproducible-path/openjdk-21-21.0.13+9/test/jdk │ │ │ │ │ keywords=bug8014499 bug8219804 othervm │ │ │ │ │ library=/test/lib │ │ │ │ │ run=USER_SPECIFIED main Promiscuous\nUSER_SPECIFIED main/othervm -Djava.net.preferIPv4Stack\=true Promiscuous\n │ │ │ │ │ source=Promiscuous.java │ │ │ │ │ title=Test for interference when two sockets are bound to the same port but joined to different multicast groups │ │ │ │ │ │ │ │ │ │ #-----environment----- │ │ │ │ │ │ │ │ │ │ #-----testresult----- │ │ │ │ │ description=file\:/build/reproducible-path/openjdk-21-21.0.13+9/test/jdk/java/net/MulticastSocket/Promiscuous.java │ │ │ │ │ -elapsed=90 0\:00\:00.090 │ │ │ │ │ -end=Mon Oct 26 01\:43\:27 UTC 2026 │ │ │ │ │ +elapsed=104 0\:00\:00.104 │ │ │ │ │ +end=Fri Oct 30 12\:28\:20 UTC 2026 │ │ │ │ │ environment=regtest │ │ │ │ │ execStatus=Failed. Execution failed\: `main' threw exception\: java.net.SocketException\: Network is unreachable │ │ │ │ │ harnessLoaderMode=Classpath Loader │ │ │ │ │ harnessVariety=Full Bundle │ │ │ │ │ hostname=sbuild │ │ │ │ │ -javatestOS=Linux 6.12.113+deb13-arm64 (aarch64) │ │ │ │ │ +javatestOS=Linux 6.12.113+deb13-cloud-arm64 (aarch64) │ │ │ │ │ javatestVersion=6.0-ea+b24-1970-01-25-${BUILT_FROM_COMMIT} │ │ │ │ │ jtregVersion=jtreg 8.3 src 1 │ │ │ │ │ script=com.sun.javatest.regtest.exec.RegressionScript │ │ │ │ │ sections=script_messages build main │ │ │ │ │ -start=Mon Oct 26 01\:43\:26 UTC 2026 │ │ │ │ │ +start=Fri Oct 30 12\:28\:20 UTC 2026 │ │ │ │ │ test=java/net/MulticastSocket/Promiscuous.java │ │ │ │ │ testJDK=/build/reproducible-path/openjdk-21-21.0.13+9/build/bootcycle-build/images/jdk │ │ │ │ │ -testJDK_OS=[name\:Linux,arch\:aarch64,version\:6.12.113+deb13-arm64,family\:linux,simple_arch\:aarch64,simple_version\:6.12,processors\:8,maxMemory\:25155866624,maxSwap\:182536105984] │ │ │ │ │ +testJDK_OS=[name\:Linux,arch\:aarch64,version\:6.12.113+deb13-cloud-arm64,family\:linux,simple_arch\:aarch64,simple_version\:6.12,processors\:12,maxMemory\:33596653568,maxSwap\:137438949376] │ │ │ │ │ testJDK_os.arch=aarch64 │ │ │ │ │ testJDK_os.name=Linux │ │ │ │ │ -testJDK_os.version=6.12.113+deb13-arm64 │ │ │ │ │ -totalTime=92 │ │ │ │ │ +testJDK_os.version=6.12.113+deb13-cloud-arm64 │ │ │ │ │ +totalTime=106 │ │ │ │ │ user.name=sbuild │ │ │ │ │ work=/tmp/jdk/JTwork/java/net/MulticastSocket │ │ │ │ │ │ │ │ │ │ #section:script_messages │ │ │ │ │ ----------messages:(7/478)---------- │ │ │ │ │ JDK under test: /build/reproducible-path/openjdk-21-21.0.13+9/build/bootcycle-build/images/jdk │ │ │ │ │ openjdk version "21.0.13" 2026-10-20 │ │ │ │ │ OpenJDK Runtime Environment (build 21.0.13+9-1-deb13u2-Debian) │ │ │ │ │ OpenJDK 64-Bit Server VM (build 21.0.13+9-1-deb13u2-Debian, mixed mode, sharing) │ │ │ │ │ Library /test/lib; kind: packages │ │ │ │ │ source directory: /build/reproducible-path/openjdk-21-21.0.13+9/test/lib │ │ │ │ │ class directory: /tmp/jdk/JTwork/classes/java/net/MulticastSocket/Promiscuous.d/test/lib │ │ │ │ │ │ │ │ │ │ #section:build │ │ │ │ │ -----------messages:(5/179)---------- │ │ │ │ │ +----------messages:(5/181)---------- │ │ │ │ │ command: build Promiscuous │ │ │ │ │ reason: Named class compiled on demand │ │ │ │ │ -started: Mon Oct 26 01:43:26.966 UTC 2026 │ │ │ │ │ -finished: Mon Oct 26 01:43:26.966 UTC 2026 │ │ │ │ │ -elapsed time (seconds): 0.0 │ │ │ │ │ +started: Fri Oct 30 12:28:20.865 UTC 2026 │ │ │ │ │ +finished: Fri Oct 30 12:28:20.870 UTC 2026 │ │ │ │ │ +elapsed time (seconds): 0.005 │ │ │ │ │ result: Passed. All files up to date │ │ │ │ │ │ │ │ │ │ #section:main │ │ │ │ │ ----------messages:(8/240)---------- │ │ │ │ │ command: main Promiscuous │ │ │ │ │ reason: User specified action: run main Promiscuous │ │ │ │ │ -started: Mon Oct 26 01:43:26.967 UTC 2026 │ │ │ │ │ +started: Fri Oct 30 12:28:20.870 UTC 2026 │ │ │ │ │ Mode: agentvm │ │ │ │ │ Agent id: 1 │ │ │ │ │ -Process id: 2875568 │ │ │ │ │ -finished: Mon Oct 26 01:43:27.052 UTC 2026 │ │ │ │ │ -elapsed time (seconds): 0.085 │ │ │ │ │ +Process id: 2700270 │ │ │ │ │ +finished: Fri Oct 30 12:28:20.967 UTC 2026 │ │ │ │ │ +elapsed time (seconds): 0.097 │ │ │ │ │ ----------configuration:(17/824)---------- │ │ │ │ │ Boot Layer │ │ │ │ │ class path: /usr/share/jtreg/lib/javatest.jar │ │ │ │ │ /usr/share/jtreg/lib/jtreg.jar │ │ │ │ │ /usr/share/jtreg/lib/junit-platform-console-standalone.jar │ │ │ │ │ /usr/share/jtreg/lib/testng.jar │ │ │ │ │ /usr/share/jtreg/lib/guice.jar │ │ │ │ │ @@ -112,16 +112,16 @@ │ │ │ │ │ -Dtest.class.path=/tmp/jdk/JTwork/classes/java/net/MulticastSocket/Promiscuous.d:/tmp/jdk/JTwork/classes/java/net/MulticastSocket/Promiscuous.d/test/lib \\ │ │ │ │ │ -Dtest.class.path.prefix=/tmp/jdk/JTwork/classes/java/net/MulticastSocket/Promiscuous.d:/build/reproducible-path/openjdk-21-21.0.13+9/test/jdk/java/net/MulticastSocket:/tmp/jdk/JTwork/classes/java/net/MulticastSocket/Promiscuous.d/test/lib \\ │ │ │ │ │ -classpath /tmp/jdk/JTwork/classes/java/net/MulticastSocket/Promiscuous.d:/build/reproducible-path/openjdk-21-21.0.13+9/test/jdk/java/net/MulticastSocket:/tmp/jdk/JTwork/classes/java/net/MulticastSocket/Promiscuous.d/test/lib:/build/reproducible-path/openjdk-21-21.0.13+9/test/lib:/usr/share/jtreg/lib/javatest.jar:/usr/share/jtreg/lib/jtreg.jar \\ │ │ │ │ │ Promiscuous │ │ │ │ │ ----------stdout:(0/0)---------- │ │ │ │ │ ----------stderr:(0/0)---------- │ │ │ │ │ ----------System.out:(2/58)---------- │ │ │ │ │ -Using port: 56941 │ │ │ │ │ -Sending datagram to: /224.1.1.120/56941 │ │ │ │ │ +Using port: 45066 │ │ │ │ │ +Sending datagram to: /224.1.1.120/45066 │ │ │ │ │ ----------System.err:(18/1123)---------- │ │ │ │ │ java.net.SocketException: Network is unreachable │ │ │ │ │ at java.base/sun.nio.ch.DatagramChannelImpl.send0(Native Method) │ │ │ │ │ at java.base/sun.nio.ch.DatagramChannelImpl.sendFromNativeBuffer(DatagramChannelImpl.java:1005) │ │ │ │ │ at java.base/sun.nio.ch.DatagramChannelImpl.send(DatagramChannelImpl.java:966) │ │ │ │ │ at java.base/sun.nio.ch.DatagramChannelImpl.send(DatagramChannelImpl.java:889) │ │ │ │ │ at java.base/sun.nio.ch.DatagramChannelImpl.blockingSend(DatagramChannelImpl.java:952) │ │ │ │ ├── jtreg-test-output/jdk/JTwork/java/net/MulticastSocket/SetLoopbackMode.jtr │ │ │ │ │ @@ -1,44 +1,44 @@ │ │ │ │ │ #Test Results (version 2) │ │ │ │ │ -#Mon Oct 26 01:43:27 UTC 2026 │ │ │ │ │ +#Fri Oct 30 12:28:21 UTC 2026 │ │ │ │ │ #-----testdescription----- │ │ │ │ │ $file=/build/reproducible-path/openjdk-21-21.0.13+9/test/jdk/java/net/MulticastSocket/SetLoopbackMode.java │ │ │ │ │ $root=/build/reproducible-path/openjdk-21-21.0.13+9/test/jdk │ │ │ │ │ keywords=bug4686717 othervm │ │ │ │ │ library=/test/lib │ │ │ │ │ modules=java.base/java.net\:+open │ │ │ │ │ run=USER_SPECIFIED build jdk.test.lib.NetworkConfiguration jdk.test.lib.Platform\nUSER_SPECIFIED main/othervm SetLoopbackMode\n │ │ │ │ │ source=SetLoopbackMode.java │ │ │ │ │ title=Test MulticastSocket.setLoopbackMode │ │ │ │ │ │ │ │ │ │ #-----environment----- │ │ │ │ │ │ │ │ │ │ #-----testresult----- │ │ │ │ │ description=file\:/build/reproducible-path/openjdk-21-21.0.13+9/test/jdk/java/net/MulticastSocket/SetLoopbackMode.java │ │ │ │ │ -elapsed=236 0\:00\:00.236 │ │ │ │ │ -end=Mon Oct 26 01\:43\:27 UTC 2026 │ │ │ │ │ +elapsed=297 0\:00\:00.297 │ │ │ │ │ +end=Fri Oct 30 12\:28\:21 UTC 2026 │ │ │ │ │ environment=regtest │ │ │ │ │ execStatus=Failed. Execution failed\: `main' threw exception\: java.net.SocketException\: No such device (setsockopt failed) │ │ │ │ │ harnessLoaderMode=Classpath Loader │ │ │ │ │ harnessVariety=Full Bundle │ │ │ │ │ hostname=sbuild │ │ │ │ │ -javatestOS=Linux 6.12.113+deb13-arm64 (aarch64) │ │ │ │ │ +javatestOS=Linux 6.12.113+deb13-cloud-arm64 (aarch64) │ │ │ │ │ javatestVersion=6.0-ea+b24-1970-01-25-${BUILT_FROM_COMMIT} │ │ │ │ │ jtregVersion=jtreg 8.3 src 1 │ │ │ │ │ modules=java.base/java.net\:+open │ │ │ │ │ script=com.sun.javatest.regtest.exec.RegressionScript │ │ │ │ │ sections=script_messages build build main │ │ │ │ │ -start=Mon Oct 26 01\:43\:27 UTC 2026 │ │ │ │ │ +start=Fri Oct 30 12\:28\:20 UTC 2026 │ │ │ │ │ test=java/net/MulticastSocket/SetLoopbackMode.java │ │ │ │ │ testJDK=/build/reproducible-path/openjdk-21-21.0.13+9/build/bootcycle-build/images/jdk │ │ │ │ │ -testJDK_OS=[name\:Linux,arch\:aarch64,version\:6.12.113+deb13-arm64,family\:linux,simple_arch\:aarch64,simple_version\:6.12,processors\:8,maxMemory\:25155866624,maxSwap\:182536105984] │ │ │ │ │ +testJDK_OS=[name\:Linux,arch\:aarch64,version\:6.12.113+deb13-cloud-arm64,family\:linux,simple_arch\:aarch64,simple_version\:6.12,processors\:12,maxMemory\:33596653568,maxSwap\:137438949376] │ │ │ │ │ testJDK_os.arch=aarch64 │ │ │ │ │ testJDK_os.name=Linux │ │ │ │ │ -testJDK_os.version=6.12.113+deb13-arm64 │ │ │ │ │ -totalTime=238 │ │ │ │ │ +testJDK_os.version=6.12.113+deb13-cloud-arm64 │ │ │ │ │ +totalTime=298 │ │ │ │ │ user.name=sbuild │ │ │ │ │ work=/tmp/jdk/JTwork/java/net/MulticastSocket │ │ │ │ │ │ │ │ │ │ #section:script_messages │ │ │ │ │ ----------messages:(7/482)---------- │ │ │ │ │ JDK under test: /build/reproducible-path/openjdk-21-21.0.13+9/build/bootcycle-build/images/jdk │ │ │ │ │ openjdk version "21.0.13" 2026-10-20 │ │ │ │ │ @@ -48,38 +48,38 @@ │ │ │ │ │ source directory: /build/reproducible-path/openjdk-21-21.0.13+9/test/lib │ │ │ │ │ class directory: /tmp/jdk/JTwork/classes/java/net/MulticastSocket/SetLoopbackMode.d/test/lib │ │ │ │ │ │ │ │ │ │ #section:build │ │ │ │ │ ----------messages:(5/284)---------- │ │ │ │ │ command: build jdk.test.lib.NetworkConfiguration jdk.test.lib.Platform │ │ │ │ │ reason: User specified action: run build jdk.test.lib.NetworkConfiguration jdk.test.lib.Platform │ │ │ │ │ -started: Mon Oct 26 01:43:27.063 UTC 2026 │ │ │ │ │ -finished: Mon Oct 26 01:43:27.064 UTC 2026 │ │ │ │ │ +started: Fri Oct 30 12:28:20.981 UTC 2026 │ │ │ │ │ +finished: Fri Oct 30 12:28:20.982 UTC 2026 │ │ │ │ │ elapsed time (seconds): 0.001 │ │ │ │ │ result: Passed. All files up to date │ │ │ │ │ │ │ │ │ │ #section:build │ │ │ │ │ -----------messages:(5/185)---------- │ │ │ │ │ +----------messages:(5/183)---------- │ │ │ │ │ command: build SetLoopbackMode │ │ │ │ │ reason: Named class compiled on demand │ │ │ │ │ -started: Mon Oct 26 01:43:27.064 UTC 2026 │ │ │ │ │ -finished: Mon Oct 26 01:43:27.065 UTC 2026 │ │ │ │ │ -elapsed time (seconds): 0.001 │ │ │ │ │ +started: Fri Oct 30 12:28:20.982 UTC 2026 │ │ │ │ │ +finished: Fri Oct 30 12:28:20.982 UTC 2026 │ │ │ │ │ +elapsed time (seconds): 0.0 │ │ │ │ │ result: Passed. All files up to date │ │ │ │ │ │ │ │ │ │ #section:main │ │ │ │ │ ----------messages:(8/411)---------- │ │ │ │ │ command: main SetLoopbackMode │ │ │ │ │ reason: User specified action: run main/othervm SetLoopbackMode │ │ │ │ │ -started: Mon Oct 26 01:43:27.065 UTC 2026 │ │ │ │ │ +started: Fri Oct 30 12:28:20.982 UTC 2026 │ │ │ │ │ Mode: othervm [/othervm specified] │ │ │ │ │ Additional options from @modules: --add-modules java.base --add-exports java.base/java.net=ALL-UNNAMED --add-opens java.base/java.net=ALL-UNNAMED │ │ │ │ │ -Process id: 2875596 │ │ │ │ │ -finished: Mon Oct 26 01:43:27.294 UTC 2026 │ │ │ │ │ -elapsed time (seconds): 0.229 │ │ │ │ │ +Process id: 2700298 │ │ │ │ │ +finished: Fri Oct 30 12:28:21.275 UTC 2026 │ │ │ │ │ +elapsed time (seconds): 0.293 │ │ │ │ │ ----------configuration:(5/139)---------- │ │ │ │ │ Boot Layer │ │ │ │ │ add modules: java.base │ │ │ │ │ add exports: java.base/java.net ALL-UNNAMED │ │ │ │ │ add opens: java.base/java.net ALL-UNNAMED │ │ │ │ │ │ │ │ │ │ ----------System.out:(5/155)---------- │ │ │ │ ├── jtreg-test-output/jdk/JTwork/java/net/MulticastSocket/SetLoopbackModeIPv4.jtr │ │ │ │ │ @@ -1,44 +1,44 @@ │ │ │ │ │ #Test Results (version 2) │ │ │ │ │ -#Mon Oct 26 01:43:27 UTC 2026 │ │ │ │ │ +#Fri Oct 30 12:28:21 UTC 2026 │ │ │ │ │ #-----testdescription----- │ │ │ │ │ $file=/build/reproducible-path/openjdk-21-21.0.13+9/test/jdk/java/net/MulticastSocket/SetLoopbackModeIPv4.java │ │ │ │ │ $root=/build/reproducible-path/openjdk-21-21.0.13+9/test/jdk │ │ │ │ │ keywords=bug4686717 bug8241786 othervm │ │ │ │ │ library=/test/lib │ │ │ │ │ modules=java.base/java.net\:+open │ │ │ │ │ run=USER_SPECIFIED build jdk.test.lib.NetworkConfiguration jdk.test.lib.Platform SetLoopbackMode SetLoopbackModeIPv4\nUSER_SPECIFIED main/othervm -Djava.net.preferIPv4Stack\=true SetLoopbackModeIPv4\n │ │ │ │ │ source=SetLoopbackModeIPv4.java │ │ │ │ │ title=Test MulticastSocket.setLoopbackMode with IPv4 addresses │ │ │ │ │ │ │ │ │ │ #-----environment----- │ │ │ │ │ │ │ │ │ │ #-----testresult----- │ │ │ │ │ description=file\:/build/reproducible-path/openjdk-21-21.0.13+9/test/jdk/java/net/MulticastSocket/SetLoopbackModeIPv4.java │ │ │ │ │ -elapsed=230 0\:00\:00.230 │ │ │ │ │ -end=Mon Oct 26 01\:43\:27 UTC 2026 │ │ │ │ │ +elapsed=275 0\:00\:00.275 │ │ │ │ │ +end=Fri Oct 30 12\:28\:21 UTC 2026 │ │ │ │ │ environment=regtest │ │ │ │ │ execStatus=Failed. Execution failed\: `main' threw exception\: java.net.SocketException\: No such device (setsockopt failed) │ │ │ │ │ harnessLoaderMode=Classpath Loader │ │ │ │ │ harnessVariety=Full Bundle │ │ │ │ │ hostname=sbuild │ │ │ │ │ -javatestOS=Linux 6.12.113+deb13-arm64 (aarch64) │ │ │ │ │ +javatestOS=Linux 6.12.113+deb13-cloud-arm64 (aarch64) │ │ │ │ │ javatestVersion=6.0-ea+b24-1970-01-25-${BUILT_FROM_COMMIT} │ │ │ │ │ jtregVersion=jtreg 8.3 src 1 │ │ │ │ │ modules=java.base/java.net\:+open │ │ │ │ │ script=com.sun.javatest.regtest.exec.RegressionScript │ │ │ │ │ sections=script_messages build build main │ │ │ │ │ -start=Mon Oct 26 01\:43\:27 UTC 2026 │ │ │ │ │ +start=Fri Oct 30 12\:28\:21 UTC 2026 │ │ │ │ │ test=java/net/MulticastSocket/SetLoopbackModeIPv4.java │ │ │ │ │ testJDK=/build/reproducible-path/openjdk-21-21.0.13+9/build/bootcycle-build/images/jdk │ │ │ │ │ -testJDK_OS=[name\:Linux,arch\:aarch64,version\:6.12.113+deb13-arm64,family\:linux,simple_arch\:aarch64,simple_version\:6.12,processors\:8,maxMemory\:25155866624,maxSwap\:182536105984] │ │ │ │ │ +testJDK_OS=[name\:Linux,arch\:aarch64,version\:6.12.113+deb13-cloud-arm64,family\:linux,simple_arch\:aarch64,simple_version\:6.12,processors\:12,maxMemory\:33596653568,maxSwap\:137438949376] │ │ │ │ │ testJDK_os.arch=aarch64 │ │ │ │ │ testJDK_os.name=Linux │ │ │ │ │ -testJDK_os.version=6.12.113+deb13-arm64 │ │ │ │ │ -totalTime=231 │ │ │ │ │ +testJDK_os.version=6.12.113+deb13-cloud-arm64 │ │ │ │ │ +totalTime=276 │ │ │ │ │ user.name=sbuild │ │ │ │ │ work=/tmp/jdk/JTwork/java/net/MulticastSocket │ │ │ │ │ │ │ │ │ │ #section:script_messages │ │ │ │ │ ----------messages:(7/486)---------- │ │ │ │ │ JDK under test: /build/reproducible-path/openjdk-21-21.0.13+9/build/bootcycle-build/images/jdk │ │ │ │ │ openjdk version "21.0.13" 2026-10-20 │ │ │ │ │ @@ -48,38 +48,38 @@ │ │ │ │ │ source directory: /build/reproducible-path/openjdk-21-21.0.13+9/test/lib │ │ │ │ │ class directory: /tmp/jdk/JTwork/classes/java/net/MulticastSocket/SetLoopbackModeIPv4.d/test/lib │ │ │ │ │ │ │ │ │ │ #section:build │ │ │ │ │ ----------messages:(5/356)---------- │ │ │ │ │ command: build jdk.test.lib.NetworkConfiguration jdk.test.lib.Platform SetLoopbackMode SetLoopbackModeIPv4 │ │ │ │ │ reason: User specified action: run build jdk.test.lib.NetworkConfiguration jdk.test.lib.Platform SetLoopbackMode SetLoopbackModeIPv4 │ │ │ │ │ -started: Mon Oct 26 01:43:27.302 UTC 2026 │ │ │ │ │ -finished: Mon Oct 26 01:43:27.304 UTC 2026 │ │ │ │ │ -elapsed time (seconds): 0.002 │ │ │ │ │ +started: Fri Oct 30 12:28:21.283 UTC 2026 │ │ │ │ │ +finished: Fri Oct 30 12:28:21.284 UTC 2026 │ │ │ │ │ +elapsed time (seconds): 0.001 │ │ │ │ │ result: Passed. All files up to date │ │ │ │ │ │ │ │ │ │ #section:build │ │ │ │ │ ----------messages:(5/187)---------- │ │ │ │ │ command: build SetLoopbackModeIPv4 │ │ │ │ │ reason: Named class compiled on demand │ │ │ │ │ -started: Mon Oct 26 01:43:27.304 UTC 2026 │ │ │ │ │ -finished: Mon Oct 26 01:43:27.304 UTC 2026 │ │ │ │ │ +started: Fri Oct 30 12:28:21.284 UTC 2026 │ │ │ │ │ +finished: Fri Oct 30 12:28:21.284 UTC 2026 │ │ │ │ │ elapsed time (seconds): 0.0 │ │ │ │ │ result: Passed. All files up to date │ │ │ │ │ │ │ │ │ │ #section:main │ │ │ │ │ ----------messages:(8/483)---------- │ │ │ │ │ command: main -Djava.net.preferIPv4Stack=true SetLoopbackModeIPv4 │ │ │ │ │ reason: User specified action: run main/othervm -Djava.net.preferIPv4Stack=true SetLoopbackModeIPv4 │ │ │ │ │ -started: Mon Oct 26 01:43:27.304 UTC 2026 │ │ │ │ │ +started: Fri Oct 30 12:28:21.285 UTC 2026 │ │ │ │ │ Mode: othervm [/othervm specified] │ │ │ │ │ Additional options from @modules: --add-modules java.base --add-exports java.base/java.net=ALL-UNNAMED --add-opens java.base/java.net=ALL-UNNAMED │ │ │ │ │ -Process id: 2875618 │ │ │ │ │ -finished: Mon Oct 26 01:43:27.529 UTC 2026 │ │ │ │ │ -elapsed time (seconds): 0.225 │ │ │ │ │ +Process id: 2700320 │ │ │ │ │ +finished: Fri Oct 30 12:28:21.554 UTC 2026 │ │ │ │ │ +elapsed time (seconds): 0.269 │ │ │ │ │ ----------configuration:(5/139)---------- │ │ │ │ │ Boot Layer │ │ │ │ │ add modules: java.base │ │ │ │ │ add exports: java.base/java.net ALL-UNNAMED │ │ │ │ │ add opens: java.base/java.net ALL-UNNAMED │ │ │ │ │ │ │ │ │ │ ----------System.out:(5/155)---------- │ │ │ │ ├── jtreg-test-output/jdk/JTwork/java/net/MulticastSocket/Test.jtr │ │ │ │ │ @@ -1,42 +1,42 @@ │ │ │ │ │ #Test Results (version 2) │ │ │ │ │ -#Mon Oct 26 01:43:27 UTC 2026 │ │ │ │ │ +#Fri Oct 30 12:28:21 UTC 2026 │ │ │ │ │ #-----testdescription----- │ │ │ │ │ $file=/build/reproducible-path/openjdk-21-21.0.13+9/test/jdk/java/net/MulticastSocket/Test.java │ │ │ │ │ $root=/build/reproducible-path/openjdk-21-21.0.13+9/test/jdk │ │ │ │ │ keywords=bug4488458 othervm │ │ │ │ │ library=/test/lib │ │ │ │ │ run=USER_SPECIFIED build jdk.test.lib.NetworkConfiguration jdk.test.lib.Platform\nUSER_SPECIFIED main Test\nUSER_SPECIFIED main/othervm -Djava.net.preferIPv4Stack\=true Test\n │ │ │ │ │ source=Test.java │ │ │ │ │ title=IPv4 and IPv6 multicasting broken on Linux │ │ │ │ │ │ │ │ │ │ #-----environment----- │ │ │ │ │ │ │ │ │ │ #-----testresult----- │ │ │ │ │ description=file\:/build/reproducible-path/openjdk-21-21.0.13+9/test/jdk/java/net/MulticastSocket/Test.java │ │ │ │ │ -elapsed=103 0\:00\:00.103 │ │ │ │ │ -end=Mon Oct 26 01\:43\:27 UTC 2026 │ │ │ │ │ +elapsed=84 0\:00\:00.084 │ │ │ │ │ +end=Fri Oct 30 12\:28\:21 UTC 2026 │ │ │ │ │ environment=regtest │ │ │ │ │ execStatus=Failed. Execution failed\: `main' threw exception\: java.lang.Exception\: Test failed - see log file for details │ │ │ │ │ harnessLoaderMode=Classpath Loader │ │ │ │ │ harnessVariety=Full Bundle │ │ │ │ │ hostname=sbuild │ │ │ │ │ -javatestOS=Linux 6.12.113+deb13-arm64 (aarch64) │ │ │ │ │ +javatestOS=Linux 6.12.113+deb13-cloud-arm64 (aarch64) │ │ │ │ │ javatestVersion=6.0-ea+b24-1970-01-25-${BUILT_FROM_COMMIT} │ │ │ │ │ jtregVersion=jtreg 8.3 src 1 │ │ │ │ │ script=com.sun.javatest.regtest.exec.RegressionScript │ │ │ │ │ sections=script_messages build build main │ │ │ │ │ -start=Mon Oct 26 01\:43\:27 UTC 2026 │ │ │ │ │ +start=Fri Oct 30 12\:28\:21 UTC 2026 │ │ │ │ │ test=java/net/MulticastSocket/Test.java │ │ │ │ │ testJDK=/build/reproducible-path/openjdk-21-21.0.13+9/build/bootcycle-build/images/jdk │ │ │ │ │ -testJDK_OS=[name\:Linux,arch\:aarch64,version\:6.12.113+deb13-arm64,family\:linux,simple_arch\:aarch64,simple_version\:6.12,processors\:8,maxMemory\:25155866624,maxSwap\:182536105984] │ │ │ │ │ +testJDK_OS=[name\:Linux,arch\:aarch64,version\:6.12.113+deb13-cloud-arm64,family\:linux,simple_arch\:aarch64,simple_version\:6.12,processors\:12,maxMemory\:33596653568,maxSwap\:137438949376] │ │ │ │ │ testJDK_os.arch=aarch64 │ │ │ │ │ testJDK_os.name=Linux │ │ │ │ │ -testJDK_os.version=6.12.113+deb13-arm64 │ │ │ │ │ -totalTime=104 │ │ │ │ │ +testJDK_os.version=6.12.113+deb13-cloud-arm64 │ │ │ │ │ +totalTime=84 │ │ │ │ │ user.name=sbuild │ │ │ │ │ work=/tmp/jdk/JTwork/java/net/MulticastSocket │ │ │ │ │ │ │ │ │ │ #section:script_messages │ │ │ │ │ ----------messages:(7/471)---------- │ │ │ │ │ JDK under test: /build/reproducible-path/openjdk-21-21.0.13+9/build/bootcycle-build/images/jdk │ │ │ │ │ openjdk version "21.0.13" 2026-10-20 │ │ │ │ │ @@ -46,38 +46,38 @@ │ │ │ │ │ source directory: /build/reproducible-path/openjdk-21-21.0.13+9/test/lib │ │ │ │ │ class directory: /tmp/jdk/JTwork/classes/java/net/MulticastSocket/Test.d/test/lib │ │ │ │ │ │ │ │ │ │ #section:build │ │ │ │ │ ----------messages:(5/284)---------- │ │ │ │ │ command: build jdk.test.lib.NetworkConfiguration jdk.test.lib.Platform │ │ │ │ │ reason: User specified action: run build jdk.test.lib.NetworkConfiguration jdk.test.lib.Platform │ │ │ │ │ -started: Mon Oct 26 01:43:27.538 UTC 2026 │ │ │ │ │ -finished: Mon Oct 26 01:43:27.539 UTC 2026 │ │ │ │ │ +started: Fri Oct 30 12:28:21.571 UTC 2026 │ │ │ │ │ +finished: Fri Oct 30 12:28:21.572 UTC 2026 │ │ │ │ │ elapsed time (seconds): 0.001 │ │ │ │ │ result: Passed. All files up to date │ │ │ │ │ │ │ │ │ │ #section:build │ │ │ │ │ -----------messages:(5/172)---------- │ │ │ │ │ +----------messages:(5/174)---------- │ │ │ │ │ command: build Test │ │ │ │ │ reason: Named class compiled on demand │ │ │ │ │ -started: Mon Oct 26 01:43:27.540 UTC 2026 │ │ │ │ │ -finished: Mon Oct 26 01:43:27.540 UTC 2026 │ │ │ │ │ -elapsed time (seconds): 0.0 │ │ │ │ │ +started: Fri Oct 30 12:28:21.572 UTC 2026 │ │ │ │ │ +finished: Fri Oct 30 12:28:21.577 UTC 2026 │ │ │ │ │ +elapsed time (seconds): 0.005 │ │ │ │ │ result: Passed. All files up to date │ │ │ │ │ │ │ │ │ │ #section:main │ │ │ │ │ -----------messages:(8/226)---------- │ │ │ │ │ +----------messages:(8/225)---------- │ │ │ │ │ command: main Test │ │ │ │ │ reason: User specified action: run main Test │ │ │ │ │ -started: Mon Oct 26 01:43:27.540 UTC 2026 │ │ │ │ │ +started: Fri Oct 30 12:28:21.577 UTC 2026 │ │ │ │ │ Mode: agentvm │ │ │ │ │ Agent id: 1 │ │ │ │ │ -Process id: 2875568 │ │ │ │ │ -finished: Mon Oct 26 01:43:27.637 UTC 2026 │ │ │ │ │ -elapsed time (seconds): 0.097 │ │ │ │ │ +Process id: 2700270 │ │ │ │ │ +finished: Fri Oct 30 12:28:21.647 UTC 2026 │ │ │ │ │ +elapsed time (seconds): 0.07 │ │ │ │ │ ----------configuration:(17/810)---------- │ │ │ │ │ Boot Layer │ │ │ │ │ class path: /usr/share/jtreg/lib/javatest.jar │ │ │ │ │ /usr/share/jtreg/lib/jtreg.jar │ │ │ │ │ /usr/share/jtreg/lib/junit-platform-console-standalone.jar │ │ │ │ │ /usr/share/jtreg/lib/testng.jar │ │ │ │ │ /usr/share/jtreg/lib/guice.jar │ │ │ │ ├── jtreg-test-output/jdk/JTwork/java/net/SocketOption/OptionsTest.jtr │ │ │ │ │ @@ -1,43 +1,43 @@ │ │ │ │ │ #Test Results (version 2) │ │ │ │ │ -#Mon Oct 26 01:43:27 UTC 2026 │ │ │ │ │ +#Fri Oct 30 12:28:21 UTC 2026 │ │ │ │ │ #-----testdescription----- │ │ │ │ │ $file=/build/reproducible-path/openjdk-21-21.0.13+9/test/jdk/java/net/SocketOption/OptionsTest.java │ │ │ │ │ $root=/build/reproducible-path/openjdk-21-21.0.13+9/test/jdk │ │ │ │ │ keywords=bug8036979 bug8072384 bug8044773 bug8225214 bug8233296 bug8234083 othervm │ │ │ │ │ library=/test/lib │ │ │ │ │ requires=\!vm.graal.enabled │ │ │ │ │ run=USER_SPECIFIED main/othervm -Xcheck\:jni OptionsTest\nUSER_SPECIFIED main/othervm -Xcheck\:jni -Djava.net.preferIPv4Stack\=true OptionsTest\nUSER_SPECIFIED main/othervm --limit-modules\=java.base OptionsTest\nUSER_SPECIFIED main/othervm/policy\=options.policy OptionsTest\n │ │ │ │ │ source=OptionsTest.java │ │ │ │ │ title=\ │ │ │ │ │ │ │ │ │ │ #-----environment----- │ │ │ │ │ │ │ │ │ │ #-----testresult----- │ │ │ │ │ description=file\:/build/reproducible-path/openjdk-21-21.0.13+9/test/jdk/java/net/SocketOption/OptionsTest.java │ │ │ │ │ -elapsed=236 0\:00\:00.236 │ │ │ │ │ -end=Mon Oct 26 01\:43\:27 UTC 2026 │ │ │ │ │ +elapsed=292 0\:00\:00.292 │ │ │ │ │ +end=Fri Oct 30 12\:28\:21 UTC 2026 │ │ │ │ │ environment=regtest │ │ │ │ │ execStatus=Failed. Execution failed\: `main' threw exception\: java.lang.IllegalArgumentException\: Invalid value 'null' │ │ │ │ │ harnessLoaderMode=Classpath Loader │ │ │ │ │ harnessVariety=Full Bundle │ │ │ │ │ hostname=sbuild │ │ │ │ │ -javatestOS=Linux 6.12.113+deb13-arm64 (aarch64) │ │ │ │ │ +javatestOS=Linux 6.12.113+deb13-cloud-arm64 (aarch64) │ │ │ │ │ javatestVersion=6.0-ea+b24-1970-01-25-${BUILT_FROM_COMMIT} │ │ │ │ │ jtregVersion=jtreg 8.3 src 1 │ │ │ │ │ script=com.sun.javatest.regtest.exec.RegressionScript │ │ │ │ │ sections=script_messages build main │ │ │ │ │ -start=Mon Oct 26 01\:43\:27 UTC 2026 │ │ │ │ │ +start=Fri Oct 30 12\:28\:21 UTC 2026 │ │ │ │ │ test=java/net/SocketOption/OptionsTest.java │ │ │ │ │ testJDK=/build/reproducible-path/openjdk-21-21.0.13+9/build/bootcycle-build/images/jdk │ │ │ │ │ -testJDK_OS=[name\:Linux,arch\:aarch64,version\:6.12.113+deb13-arm64,family\:linux,simple_arch\:aarch64,simple_version\:6.12,processors\:8,maxMemory\:25155866624,maxSwap\:182536105984] │ │ │ │ │ +testJDK_OS=[name\:Linux,arch\:aarch64,version\:6.12.113+deb13-cloud-arm64,family\:linux,simple_arch\:aarch64,simple_version\:6.12,processors\:12,maxMemory\:33596653568,maxSwap\:137438949376] │ │ │ │ │ testJDK_os.arch=aarch64 │ │ │ │ │ testJDK_os.name=Linux │ │ │ │ │ -testJDK_os.version=6.12.113+deb13-arm64 │ │ │ │ │ -totalTime=237 │ │ │ │ │ +testJDK_os.version=6.12.113+deb13-cloud-arm64 │ │ │ │ │ +totalTime=293 │ │ │ │ │ user.name=sbuild │ │ │ │ │ work=/tmp/jdk/JTwork/java/net/SocketOption │ │ │ │ │ │ │ │ │ │ #section:script_messages │ │ │ │ │ ----------messages:(7/475)---------- │ │ │ │ │ JDK under test: /build/reproducible-path/openjdk-21-21.0.13+9/build/bootcycle-build/images/jdk │ │ │ │ │ openjdk version "21.0.13" 2026-10-20 │ │ │ │ │ @@ -47,28 +47,28 @@ │ │ │ │ │ source directory: /build/reproducible-path/openjdk-21-21.0.13+9/test/lib │ │ │ │ │ class directory: /tmp/jdk/JTwork/classes/java/net/SocketOption/OptionsTest.d/test/lib │ │ │ │ │ │ │ │ │ │ #section:build │ │ │ │ │ ----------messages:(5/181)---------- │ │ │ │ │ command: build OptionsTest │ │ │ │ │ reason: Named class compiled on demand │ │ │ │ │ -started: Mon Oct 26 01:43:27.647 UTC 2026 │ │ │ │ │ -finished: Mon Oct 26 01:43:27.648 UTC 2026 │ │ │ │ │ -elapsed time (seconds): 0.001 │ │ │ │ │ +started: Fri Oct 30 12:28:21.657 UTC 2026 │ │ │ │ │ +finished: Fri Oct 30 12:28:21.662 UTC 2026 │ │ │ │ │ +elapsed time (seconds): 0.005 │ │ │ │ │ result: Passed. All files up to date │ │ │ │ │ │ │ │ │ │ #section:main │ │ │ │ │ ----------messages:(7/281)---------- │ │ │ │ │ command: main -Xcheck:jni OptionsTest │ │ │ │ │ reason: User specified action: run main/othervm -Xcheck:jni OptionsTest │ │ │ │ │ -started: Mon Oct 26 01:43:27.648 UTC 2026 │ │ │ │ │ +started: Fri Oct 30 12:28:21.662 UTC 2026 │ │ │ │ │ Mode: othervm [/othervm specified] │ │ │ │ │ -Process id: 2875640 │ │ │ │ │ -finished: Mon Oct 26 01:43:27.880 UTC 2026 │ │ │ │ │ -elapsed time (seconds): 0.232 │ │ │ │ │ +Process id: 2700342 │ │ │ │ │ +finished: Fri Oct 30 12:28:21.947 UTC 2026 │ │ │ │ │ +elapsed time (seconds): 0.285 │ │ │ │ │ ----------configuration:(0/0)---------- │ │ │ │ │ ----------System.out:(7/201)---------- │ │ │ │ │ Testing SO_LINGER with:-1 │ │ │ │ │ Testing SO_LINGER with:-2 │ │ │ │ │ Testing SO_LINGER with:-100 │ │ │ │ │ Testing SO_LINGER with:-65534 │ │ │ │ │ Testing SO_LINGER with:-65535 │ │ │ │ ├── jtreg-test-output/jdk/JTwork/java/net/SocketPermission/SocketPermissionTest.jtr │ │ │ │ │ @@ -1,42 +1,42 @@ │ │ │ │ │ #Test Results (version 2) │ │ │ │ │ -#Mon Oct 26 01:43:28 UTC 2026 │ │ │ │ │ +#Fri Oct 30 12:28:23 UTC 2026 │ │ │ │ │ #-----testdescription----- │ │ │ │ │ $file=/build/reproducible-path/openjdk-21-21.0.13+9/test/jdk/java/net/SocketPermission/SocketPermissionTest.java │ │ │ │ │ $root=/build/reproducible-path/openjdk-21-21.0.13+9/test/jdk │ │ │ │ │ keywords=bug8047031 intermittent othervm testng │ │ │ │ │ library=/test/lib │ │ │ │ │ run=USER_SPECIFIED build jdk.test.lib.NetworkConfiguration jdk.test.lib.Platform\nUSER_SPECIFIED testng/othervm -Djava.security.manager\=allow SocketPermissionTest\n │ │ │ │ │ source=SocketPermissionTest.java │ │ │ │ │ title=SocketPermission tests for legacy socket types. │ │ │ │ │ │ │ │ │ │ #-----environment----- │ │ │ │ │ │ │ │ │ │ #-----testresult----- │ │ │ │ │ description=file\:/build/reproducible-path/openjdk-21-21.0.13+9/test/jdk/java/net/SocketPermission/SocketPermissionTest.java │ │ │ │ │ -elapsed=602 0\:00\:00.602 │ │ │ │ │ -end=Mon Oct 26 01\:43\:28 UTC 2026 │ │ │ │ │ +elapsed=991 0\:00\:00.991 │ │ │ │ │ +end=Fri Oct 30 12\:28\:23 UTC 2026 │ │ │ │ │ environment=regtest │ │ │ │ │ execStatus=Failed. Execution failed\: `main' threw exception\: java.lang.Exception\: config failures\: 0, test failures\: 2 │ │ │ │ │ harnessLoaderMode=Classpath Loader │ │ │ │ │ harnessVariety=Full Bundle │ │ │ │ │ hostname=sbuild │ │ │ │ │ -javatestOS=Linux 6.12.113+deb13-arm64 (aarch64) │ │ │ │ │ +javatestOS=Linux 6.12.113+deb13-cloud-arm64 (aarch64) │ │ │ │ │ javatestVersion=6.0-ea+b24-1970-01-25-${BUILT_FROM_COMMIT} │ │ │ │ │ jtregVersion=jtreg 8.3 src 1 │ │ │ │ │ script=com.sun.javatest.regtest.exec.RegressionScript │ │ │ │ │ sections=script_messages build build testng │ │ │ │ │ -start=Mon Oct 26 01\:43\:28 UTC 2026 │ │ │ │ │ +start=Fri Oct 30 12\:28\:22 UTC 2026 │ │ │ │ │ test=java/net/SocketPermission/SocketPermissionTest.java │ │ │ │ │ testJDK=/build/reproducible-path/openjdk-21-21.0.13+9/build/bootcycle-build/images/jdk │ │ │ │ │ -testJDK_OS=[name\:Linux,arch\:aarch64,version\:6.12.113+deb13-arm64,family\:linux,simple_arch\:aarch64,simple_version\:6.12,processors\:8,maxMemory\:25155866624,maxSwap\:182536105984] │ │ │ │ │ +testJDK_OS=[name\:Linux,arch\:aarch64,version\:6.12.113+deb13-cloud-arm64,family\:linux,simple_arch\:aarch64,simple_version\:6.12,processors\:12,maxMemory\:33596653568,maxSwap\:137438949376] │ │ │ │ │ testJDK_os.arch=aarch64 │ │ │ │ │ testJDK_os.name=Linux │ │ │ │ │ -testJDK_os.version=6.12.113+deb13-arm64 │ │ │ │ │ -totalTime=603 │ │ │ │ │ +testJDK_os.version=6.12.113+deb13-cloud-arm64 │ │ │ │ │ +totalTime=993 │ │ │ │ │ user.name=sbuild │ │ │ │ │ work=/tmp/jdk/JTwork/java/net/SocketPermission │ │ │ │ │ │ │ │ │ │ #section:script_messages │ │ │ │ │ ----------messages:(7/488)---------- │ │ │ │ │ JDK under test: /build/reproducible-path/openjdk-21-21.0.13+9/build/bootcycle-build/images/jdk │ │ │ │ │ openjdk version "21.0.13" 2026-10-20 │ │ │ │ │ @@ -46,47 +46,47 @@ │ │ │ │ │ source directory: /build/reproducible-path/openjdk-21-21.0.13+9/test/lib │ │ │ │ │ class directory: /tmp/jdk/JTwork/classes/java/net/SocketPermission/SocketPermissionTest.d/test/lib │ │ │ │ │ │ │ │ │ │ #section:build │ │ │ │ │ ----------messages:(5/284)---------- │ │ │ │ │ command: build jdk.test.lib.NetworkConfiguration jdk.test.lib.Platform │ │ │ │ │ reason: User specified action: run build jdk.test.lib.NetworkConfiguration jdk.test.lib.Platform │ │ │ │ │ -started: Mon Oct 26 01:43:28.386 UTC 2026 │ │ │ │ │ -finished: Mon Oct 26 01:43:28.387 UTC 2026 │ │ │ │ │ +started: Fri Oct 30 12:28:22.268 UTC 2026 │ │ │ │ │ +finished: Fri Oct 30 12:28:22.269 UTC 2026 │ │ │ │ │ elapsed time (seconds): 0.001 │ │ │ │ │ result: Passed. All files up to date │ │ │ │ │ │ │ │ │ │ #section:build │ │ │ │ │ -----------messages:(5/190)---------- │ │ │ │ │ +----------messages:(5/188)---------- │ │ │ │ │ command: build SocketPermissionTest │ │ │ │ │ reason: Named class compiled on demand │ │ │ │ │ -started: Mon Oct 26 01:43:28.387 UTC 2026 │ │ │ │ │ -finished: Mon Oct 26 01:43:28.388 UTC 2026 │ │ │ │ │ -elapsed time (seconds): 0.001 │ │ │ │ │ +started: Fri Oct 30 12:28:22.269 UTC 2026 │ │ │ │ │ +finished: Fri Oct 30 12:28:22.269 UTC 2026 │ │ │ │ │ +elapsed time (seconds): 0.0 │ │ │ │ │ result: Passed. All files up to date │ │ │ │ │ │ │ │ │ │ #section:testng │ │ │ │ │ ----------messages:(7/339)---------- │ │ │ │ │ command: testng -Djava.security.manager=allow SocketPermissionTest │ │ │ │ │ reason: User specified action: run testng/othervm -Djava.security.manager=allow SocketPermissionTest │ │ │ │ │ -started: Mon Oct 26 01:43:28.388 UTC 2026 │ │ │ │ │ +started: Fri Oct 30 12:28:22.269 UTC 2026 │ │ │ │ │ Mode: othervm [/othervm specified] │ │ │ │ │ -Process id: 2875661 │ │ │ │ │ -finished: Mon Oct 26 01:43:28.977 UTC 2026 │ │ │ │ │ -elapsed time (seconds): 0.589 │ │ │ │ │ +Process id: 2700363 │ │ │ │ │ +finished: Fri Oct 30 12:28:23.250 UTC 2026 │ │ │ │ │ +elapsed time (seconds): 0.981 │ │ │ │ │ ----------configuration:(0/0)---------- │ │ │ │ │ -----------System.out:(97/6917)---------- │ │ │ │ │ -[01:43:28.837] config SocketPermissionTest.setupSecurityManager(): success [0ms] │ │ │ │ │ -[01:43:28.863] test SocketPermissionTest.acceptServerSocketTest(): success [21ms] │ │ │ │ │ -[01:43:28.864] config SocketPermissionTest.setupSecurityManager(): success [0ms] │ │ │ │ │ -[01:43:28.876] test SocketPermissionTest.connectDatagramSocketTest(): success [11ms] │ │ │ │ │ -[01:43:28.877] config SocketPermissionTest.setupSecurityManager(): success [0ms] │ │ │ │ │ -[01:43:28.879] test SocketPermissionTest.connectSocketTest(): success [1ms] │ │ │ │ │ -[01:43:28.880] config SocketPermissionTest.setupSecurityManager(): success [0ms] │ │ │ │ │ -[01:43:28.887] test SocketPermissionTest.joinGroupMulticastTest(): failure [8ms] │ │ │ │ │ +----------System.out:(97/6918)---------- │ │ │ │ │ +[12:28:22.977] config SocketPermissionTest.setupSecurityManager(): success [0ms] │ │ │ │ │ +[12:28:23.034] test SocketPermissionTest.acceptServerSocketTest(): success [40ms] │ │ │ │ │ +[12:28:23.036] config SocketPermissionTest.setupSecurityManager(): success [0ms] │ │ │ │ │ +[12:28:23.066] test SocketPermissionTest.connectDatagramSocketTest(): success [29ms] │ │ │ │ │ +[12:28:23.070] config SocketPermissionTest.setupSecurityManager(): success [0ms] │ │ │ │ │ +[12:28:23.077] test SocketPermissionTest.connectSocketTest(): success [6ms] │ │ │ │ │ +[12:28:23.082] config SocketPermissionTest.setupSecurityManager(): success [0ms] │ │ │ │ │ +[12:28:23.093] test SocketPermissionTest.joinGroupMulticastTest(): failure [11ms] │ │ │ │ │ java.util.NoSuchElementException: No value present │ │ │ │ │ at java.base/java.util.Optional.get(Optional.java:143) │ │ │ │ │ at SocketPermissionTest.joinGroupMulticastTest(SocketPermissionTest.java:227) │ │ │ │ │ at java.base/jdk.internal.reflect.DirectMethodHandleAccessor.invoke(DirectMethodHandleAccessor.java:103) │ │ │ │ │ at java.base/java.lang.reflect.Method.invoke(Method.java:580) │ │ │ │ │ at org.testng.internal.invokers.MethodInvocationHelper.invokeMethod(MethodInvocationHelper.java:136) │ │ │ │ │ at org.testng.internal.invokers.TestInvoker.invokeMethod(TestInvoker.java:658) │ │ │ │ │ @@ -111,22 +111,22 @@ │ │ │ │ │ at org.testng.TestNG.run(TestNG.java:1060) │ │ │ │ │ at com.sun.javatest.regtest.agent.TestNGRunner.main(TestNGRunner.java:109) │ │ │ │ │ at com.sun.javatest.regtest.agent.TestNGRunner.main(TestNGRunner.java:65) │ │ │ │ │ at java.base/jdk.internal.reflect.DirectMethodHandleAccessor.invoke(DirectMethodHandleAccessor.java:103) │ │ │ │ │ at java.base/java.lang.reflect.Method.invoke(Method.java:580) │ │ │ │ │ at com.sun.javatest.regtest.agent.MainWrapper$MainTask.run(MainWrapper.java:143) │ │ │ │ │ at java.base/java.lang.Thread.run(Thread.java:1583) │ │ │ │ │ -[01:43:28.889] config SocketPermissionTest.setupSecurityManager(): success [0ms] │ │ │ │ │ -[01:43:28.890] test SocketPermissionTest.listenDatagramSocketTest(): success [1ms] │ │ │ │ │ -[01:43:28.891] config SocketPermissionTest.setupSecurityManager(): success [0ms] │ │ │ │ │ -[01:43:28.892] test SocketPermissionTest.listenMulticastSocketTest(): success [1ms] │ │ │ │ │ -[01:43:28.893] config SocketPermissionTest.setupSecurityManager(): success [0ms] │ │ │ │ │ -[01:43:28.894] test SocketPermissionTest.listenServerSocketTest(): success [1ms] │ │ │ │ │ -[01:43:28.895] config SocketPermissionTest.setupSecurityManager(): success [0ms] │ │ │ │ │ -[01:43:28.897] test SocketPermissionTest.sendDatagramPacketTest(): failure [1ms] │ │ │ │ │ +[12:28:23.096] config SocketPermissionTest.setupSecurityManager(): success [0ms] │ │ │ │ │ +[12:28:23.098] test SocketPermissionTest.listenDatagramSocketTest(): success [2ms] │ │ │ │ │ +[12:28:23.100] config SocketPermissionTest.setupSecurityManager(): success [0ms] │ │ │ │ │ +[12:28:23.103] test SocketPermissionTest.listenMulticastSocketTest(): success [2ms] │ │ │ │ │ +[12:28:23.104] config SocketPermissionTest.setupSecurityManager(): success [0ms] │ │ │ │ │ +[12:28:23.107] test SocketPermissionTest.listenServerSocketTest(): success [2ms] │ │ │ │ │ +[12:28:23.108] config SocketPermissionTest.setupSecurityManager(): success [0ms] │ │ │ │ │ +[12:28:23.111] test SocketPermissionTest.sendDatagramPacketTest(): failure [2ms] │ │ │ │ │ java.security.PrivilegedActionException: java.net.SocketException: Network is unreachable │ │ │ │ │ at java.base/java.security.AccessController.doPrivileged(AccessController.java:718) │ │ │ │ │ at SocketPermissionTest.sendDatagramPacketTest(SocketPermissionTest.java:195) │ │ │ │ │ at java.base/jdk.internal.reflect.DirectMethodHandleAccessor.invoke(DirectMethodHandleAccessor.java:103) │ │ │ │ │ at java.base/java.lang.reflect.Method.invoke(Method.java:580) │ │ │ │ │ at org.testng.internal.invokers.MethodInvocationHelper.invokeMethod(MethodInvocationHelper.java:136) │ │ │ │ │ at org.testng.internal.invokers.TestInvoker.invokeMethod(TestInvoker.java:658) │ │ │ │ ├── jtreg-test-output/jdk/JTwork/sun/security/krb5/auto/Addresses.jtr │ │ │ │ │ @@ -1,44 +1,44 @@ │ │ │ │ │ #Test Results (version 2) │ │ │ │ │ -#Mon Oct 26 01:43:31 UTC 2026 │ │ │ │ │ +#Fri Oct 30 12:28:26 UTC 2026 │ │ │ │ │ #-----testdescription----- │ │ │ │ │ $file=/build/reproducible-path/openjdk-21-21.0.13+9/test/jdk/sun/security/krb5/auto/Addresses.java │ │ │ │ │ $root=/build/reproducible-path/openjdk-21-21.0.13+9/test/jdk │ │ │ │ │ keywords=bug8031111 bug8194486 othervm │ │ │ │ │ library=/test/lib │ │ │ │ │ modules=java.base/jdk.internal.misc java.base/sun.security.util java.security.jgss/sun.security.jgss java.security.jgss/sun.security.jgss.krb5 java.security.jgss/sun.security.krb5\:+open java.security.jgss/sun.security.krb5.internal\:+open java.security.jgss/sun.security.krb5.internal.ccache java.security.jgss/sun.security.krb5.internal.rcache java.security.jgss/sun.security.krb5.internal.crypto java.security.jgss/sun.security.krb5.internal.ktab jdk.security.auth jdk.security.jgss │ │ │ │ │ run=USER_SPECIFIED compile -XDignore.symbol.file Addresses.java\nUSER_SPECIFIED main jdk.test.lib.FileInstaller TestHosts TestHosts\nUSER_SPECIFIED main/othervm -Djdk.net.hosts.file\=TestHosts Addresses\n │ │ │ │ │ source=Addresses.java │ │ │ │ │ title=fix krb5 caddr │ │ │ │ │ │ │ │ │ │ #-----environment----- │ │ │ │ │ │ │ │ │ │ #-----testresult----- │ │ │ │ │ description=file\:/build/reproducible-path/openjdk-21-21.0.13+9/test/jdk/sun/security/krb5/auto/Addresses.java │ │ │ │ │ -elapsed=2680 0\:00\:02.680 │ │ │ │ │ -end=Mon Oct 26 01\:43\:31 UTC 2026 │ │ │ │ │ +elapsed=3582 0\:00\:03.582 │ │ │ │ │ +end=Fri Oct 30 12\:28\:26 UTC 2026 │ │ │ │ │ environment=regtest │ │ │ │ │ execStatus=Failed. Execution failed\: `main' threw exception\: java.lang.Exception │ │ │ │ │ harnessLoaderMode=Classpath Loader │ │ │ │ │ harnessVariety=Full Bundle │ │ │ │ │ hostname=sbuild │ │ │ │ │ -javatestOS=Linux 6.12.113+deb13-arm64 (aarch64) │ │ │ │ │ +javatestOS=Linux 6.12.113+deb13-cloud-arm64 (aarch64) │ │ │ │ │ javatestVersion=6.0-ea+b24-1970-01-25-${BUILT_FROM_COMMIT} │ │ │ │ │ jtregVersion=jtreg 8.3 src 1 │ │ │ │ │ modules=java.base/jdk.internal.misc java.base/sun.security.util java.security.jgss/sun.security.jgss java.security.jgss/sun.security.jgss.krb5 java.security.jgss/sun.security.krb5\:+open java.security.jgss/sun.security.krb5.internal\:+open java.security.jgss/sun.security.krb5.internal.ccache java.security.jgss/sun.security.krb5.internal.rcache java.security.jgss/sun.security.krb5.internal.crypto java.security.jgss/sun.security.krb5.internal.ktab jdk.security.auth jdk.security.jgss │ │ │ │ │ script=com.sun.javatest.regtest.exec.RegressionScript │ │ │ │ │ sections=script_messages compile build main build main │ │ │ │ │ -start=Mon Oct 26 01\:43\:28 UTC 2026 │ │ │ │ │ +start=Fri Oct 30 12\:28\:23 UTC 2026 │ │ │ │ │ test=sun/security/krb5/auto/Addresses.java │ │ │ │ │ testJDK=/build/reproducible-path/openjdk-21-21.0.13+9/build/bootcycle-build/images/jdk │ │ │ │ │ -testJDK_OS=[name\:Linux,arch\:aarch64,version\:6.12.113+deb13-arm64,family\:linux,simple_arch\:aarch64,simple_version\:6.12,processors\:8,maxMemory\:25155866624,maxSwap\:182536105984] │ │ │ │ │ +testJDK_OS=[name\:Linux,arch\:aarch64,version\:6.12.113+deb13-cloud-arm64,family\:linux,simple_arch\:aarch64,simple_version\:6.12,processors\:12,maxMemory\:33596653568,maxSwap\:137438949376] │ │ │ │ │ testJDK_os.arch=aarch64 │ │ │ │ │ testJDK_os.name=Linux │ │ │ │ │ -testJDK_os.version=6.12.113+deb13-arm64 │ │ │ │ │ -totalTime=2683 │ │ │ │ │ +testJDK_os.version=6.12.113+deb13-cloud-arm64 │ │ │ │ │ +totalTime=3584 │ │ │ │ │ user.name=sbuild │ │ │ │ │ work=/tmp/jdk/JTwork/sun/security/krb5/auto │ │ │ │ │ │ │ │ │ │ #section:script_messages │ │ │ │ │ ----------messages:(7/474)---------- │ │ │ │ │ JDK under test: /build/reproducible-path/openjdk-21-21.0.13+9/build/bootcycle-build/images/jdk │ │ │ │ │ openjdk version "21.0.13" 2026-10-20 │ │ │ │ │ @@ -48,21 +48,21 @@ │ │ │ │ │ source directory: /build/reproducible-path/openjdk-21-21.0.13+9/test/lib │ │ │ │ │ class directory: /tmp/jdk/JTwork/classes/sun/security/krb5/auto/Addresses.d/test/lib │ │ │ │ │ │ │ │ │ │ #section:compile │ │ │ │ │ ----------messages:(9/1175)---------- │ │ │ │ │ command: compile -XDignore.symbol.file /build/reproducible-path/openjdk-21-21.0.13+9/test/jdk/sun/security/krb5/auto/Addresses.java │ │ │ │ │ reason: User specified action: run compile -XDignore.symbol.file Addresses.java │ │ │ │ │ -started: Mon Oct 26 01:43:28.997 UTC 2026 │ │ │ │ │ +started: Fri Oct 30 12:28:23.270 UTC 2026 │ │ │ │ │ Additional options from @modules: --add-modules java.base,java.security.jgss,jdk.security.auth,jdk.security.jgss --add-exports java.base/jdk.internal.misc=ALL-UNNAMED --add-exports java.base/sun.security.util=ALL-UNNAMED --add-exports java.security.jgss/sun.security.jgss=ALL-UNNAMED --add-exports java.security.jgss/sun.security.jgss.krb5=ALL-UNNAMED --add-exports java.security.jgss/sun.security.krb5=ALL-UNNAMED --add-exports java.security.jgss/sun.security.krb5.internal=ALL-UNNAMED --add-exports java.security.jgss/sun.security.krb5.internal.ccache=ALL-UNNAMED --add-exports java.security.jgss/sun.security.krb5.internal.rcache=ALL-UNNAMED --add-exports java.security.jgss/sun.security.krb5.internal.crypto=ALL-UNNAMED --add-exports java.security.jgss/sun.security.krb5.internal.ktab=ALL-UNNAMED │ │ │ │ │ Mode: agentvm │ │ │ │ │ Agent id: 2 │ │ │ │ │ -Process id: 2875691 │ │ │ │ │ -finished: Mon Oct 26 01:43:29.872 UTC 2026 │ │ │ │ │ -elapsed time (seconds): 0.875 │ │ │ │ │ +Process id: 2700392 │ │ │ │ │ +finished: Fri Oct 30 12:28:24.851 UTC 2026 │ │ │ │ │ +elapsed time (seconds): 1.581 │ │ │ │ │ ----------configuration:(23/1523)---------- │ │ │ │ │ Boot Layer (javac runtime environment) │ │ │ │ │ class path: /usr/share/jtreg/lib/javatest.jar │ │ │ │ │ /usr/share/jtreg/lib/jtreg.jar │ │ │ │ │ patch: java.base /tmp/jdk/JTwork/patches/java.base │ │ │ │ │ │ │ │ │ │ javac compilation environment │ │ │ │ │ @@ -135,31 +135,31 @@ │ │ │ │ │ ----------stderr:(0/0)---------- │ │ │ │ │ result: Passed. Compilation successful │ │ │ │ │ │ │ │ │ │ #section:build │ │ │ │ │ ----------messages:(5/196)---------- │ │ │ │ │ command: build jdk.test.lib.FileInstaller │ │ │ │ │ reason: Named class compiled on demand │ │ │ │ │ -started: Mon Oct 26 01:43:29.872 UTC 2026 │ │ │ │ │ -finished: Mon Oct 26 01:43:29.873 UTC 2026 │ │ │ │ │ +started: Fri Oct 30 12:28:24.852 UTC 2026 │ │ │ │ │ +finished: Fri Oct 30 12:28:24.853 UTC 2026 │ │ │ │ │ elapsed time (seconds): 0.001 │ │ │ │ │ result: Passed. All files up to date │ │ │ │ │ │ │ │ │ │ #section:main │ │ │ │ │ ----------messages:(10/925)---------- │ │ │ │ │ command: main jdk.test.lib.FileInstaller TestHosts TestHosts │ │ │ │ │ reason: User specified action: run main jdk.test.lib.FileInstaller TestHosts TestHosts │ │ │ │ │ -started: Mon Oct 26 01:43:29.874 UTC 2026 │ │ │ │ │ +started: Fri Oct 30 12:28:24.853 UTC 2026 │ │ │ │ │ Mode: agentvm │ │ │ │ │ Agent id: 1 │ │ │ │ │ -Process id: 2875568 │ │ │ │ │ +Process id: 2700270 │ │ │ │ │ Additional exports to unnamed modules from @modules: java.base/jdk.internal.misc java.base/sun.security.util java.security.jgss/sun.security.jgss java.security.jgss/sun.security.jgss.krb5 java.security.jgss/sun.security.krb5 java.security.jgss/sun.security.krb5.internal java.security.jgss/sun.security.krb5.internal.ccache java.security.jgss/sun.security.krb5.internal.rcache java.security.jgss/sun.security.krb5.internal.crypto java.security.jgss/sun.security.krb5.internal.ktab │ │ │ │ │ Additional opens to unnamed modules from @modules: java.security.jgss/sun.security.krb5 java.security.jgss/sun.security.krb5.internal │ │ │ │ │ -finished: Mon Oct 26 01:43:29.950 UTC 2026 │ │ │ │ │ -elapsed time (seconds): 0.076 │ │ │ │ │ +finished: Fri Oct 30 12:28:24.926 UTC 2026 │ │ │ │ │ +elapsed time (seconds): 0.073 │ │ │ │ │ ----------configuration:(29/1782)---------- │ │ │ │ │ Boot Layer │ │ │ │ │ class path: /usr/share/jtreg/lib/javatest.jar │ │ │ │ │ /usr/share/jtreg/lib/jtreg.jar │ │ │ │ │ /usr/share/jtreg/lib/junit-platform-console-standalone.jar │ │ │ │ │ /usr/share/jtreg/lib/testng.jar │ │ │ │ │ /usr/share/jtreg/lib/guice.jar │ │ │ │ │ @@ -224,32 +224,32 @@ │ │ │ │ │ ----------System.err:(3/35)---------- │ │ │ │ │ │ │ │ │ │ JavaTest Message: Test complete. │ │ │ │ │ │ │ │ │ │ result: Passed. Execution successful │ │ │ │ │ │ │ │ │ │ #section:build │ │ │ │ │ -----------messages:(5/177)---------- │ │ │ │ │ +----------messages:(5/179)---------- │ │ │ │ │ command: build Addresses │ │ │ │ │ reason: Named class compiled on demand │ │ │ │ │ -started: Mon Oct 26 01:43:29.951 UTC 2026 │ │ │ │ │ -finished: Mon Oct 26 01:43:29.951 UTC 2026 │ │ │ │ │ -elapsed time (seconds): 0.0 │ │ │ │ │ +started: Fri Oct 30 12:28:24.926 UTC 2026 │ │ │ │ │ +finished: Fri Oct 30 12:28:24.927 UTC 2026 │ │ │ │ │ +elapsed time (seconds): 0.001 │ │ │ │ │ result: Passed. All files up to date │ │ │ │ │ │ │ │ │ │ #section:main │ │ │ │ │ ----------messages:(8/1247)---------- │ │ │ │ │ command: main -Djdk.net.hosts.file=TestHosts Addresses │ │ │ │ │ reason: User specified action: run main/othervm -Djdk.net.hosts.file=TestHosts Addresses │ │ │ │ │ -started: Mon Oct 26 01:43:29.952 UTC 2026 │ │ │ │ │ +started: Fri Oct 30 12:28:24.928 UTC 2026 │ │ │ │ │ Mode: othervm [/othervm specified] │ │ │ │ │ Additional options from @modules: --add-modules java.base,java.security.jgss,jdk.security.auth,jdk.security.jgss --add-exports java.base/jdk.internal.misc=ALL-UNNAMED --add-exports java.base/sun.security.util=ALL-UNNAMED --add-exports java.security.jgss/sun.security.jgss=ALL-UNNAMED --add-exports java.security.jgss/sun.security.jgss.krb5=ALL-UNNAMED --add-exports java.security.jgss/sun.security.krb5=ALL-UNNAMED --add-opens java.security.jgss/sun.security.krb5=ALL-UNNAMED --add-exports java.security.jgss/sun.security.krb5.internal=ALL-UNNAMED --add-opens java.security.jgss/sun.security.krb5.internal=ALL-UNNAMED --add-exports java.security.jgss/sun.security.krb5.internal.ccache=ALL-UNNAMED --add-exports java.security.jgss/sun.security.krb5.internal.rcache=ALL-UNNAMED --add-exports java.security.jgss/sun.security.krb5.internal.crypto=ALL-UNNAMED --add-exports java.security.jgss/sun.security.krb5.internal.ktab=ALL-UNNAMED │ │ │ │ │ -Process id: 2875722 │ │ │ │ │ -finished: Mon Oct 26 01:43:31.670 UTC 2026 │ │ │ │ │ -elapsed time (seconds): 1.718 │ │ │ │ │ +Process id: 2700428 │ │ │ │ │ +finished: Fri Oct 30 12:28:26.845 UTC 2026 │ │ │ │ │ +elapsed time (seconds): 1.917 │ │ │ │ │ ----------configuration:(15/1053)---------- │ │ │ │ │ Boot Layer │ │ │ │ │ add modules: java.base java.security.jgss jdk.security.auth jdk.security.jgss │ │ │ │ │ add exports: java.base/jdk.internal.misc ALL-UNNAMED │ │ │ │ │ java.base/sun.security.util ALL-UNNAMED │ │ │ │ │ java.security.jgss/sun.security.jgss ALL-UNNAMED │ │ │ │ │ java.security.jgss/sun.security.jgss.krb5 ALL-UNNAMED │ │ │ │ │ @@ -259,27 +259,27 @@ │ │ │ │ │ java.security.jgss/sun.security.krb5.internal.crypto ALL-UNNAMED │ │ │ │ │ java.security.jgss/sun.security.krb5.internal.ktab ALL-UNNAMED │ │ │ │ │ java.security.jgss/sun.security.krb5.internal.rcache ALL-UNNAMED │ │ │ │ │ add opens: java.security.jgss/sun.security.krb5 ALL-UNNAMED │ │ │ │ │ java.security.jgss/sun.security.krb5.internal ALL-UNNAMED │ │ │ │ │ │ │ │ │ │ ----------System.out:(24/852)---------- │ │ │ │ │ -Start KDC on 15945 │ │ │ │ │ +Start KDC on 15391 │ │ │ │ │ ----------------------------------------------- │ │ │ │ │ >>>>> UDP packet received │ │ │ │ │ -RABBIT.HOLE:15945> dummy@RABBIT.HOLE sends AS-REQ for krbtgt/RABBIT.HOLE@RABBIT.HOLE, KDCOptions: │ │ │ │ │ +RABBIT.HOLE:15391> dummy@RABBIT.HOLE sends AS-REQ for krbtgt/RABBIT.HOLE@RABBIT.HOLE, KDCOptions: │ │ │ │ │ KrbException: Additional pre-authentication required (25) │ │ │ │ │ at KDC.processAsReq(KDC.java:1335) │ │ │ │ │ at KDC.processMessage(KDC.java:809) │ │ │ │ │ at KDC$1.run(KDC.java:1565) │ │ │ │ │ Error 25 Additional pre-authentication required │ │ │ │ │ >>>>> UDP request honored │ │ │ │ │ ----------------------------------------------- │ │ │ │ │ >>>>> UDP packet received │ │ │ │ │ -RABBIT.HOLE:15945> dummy@RABBIT.HOLE sends AS-REQ for krbtgt/RABBIT.HOLE@RABBIT.HOLE, KDCOptions: │ │ │ │ │ +RABBIT.HOLE:15391> dummy@RABBIT.HOLE sends AS-REQ for krbtgt/RABBIT.HOLE@RABBIT.HOLE, KDCOptions: │ │ │ │ │ Return dummy@RABBIT.HOLE ticket for krbtgt/RABBIT.HOLE@RABBIT.HOLE, flags INITIAL;PRE-AUTHENT │ │ │ │ │ >>>>> UDP request honored │ │ │ │ │ /10.0.0.10 │ │ │ │ │ extra1 found │ │ │ │ │ /10.0.0.11 │ │ │ │ │ extra2 found │ │ │ │ │ /10.0.0.12 │ │ ├── ./usr/share/doc/openjdk-21-jre-headless/test-arm64/jtreg_output-hotspot.log.gz │ │ │ ├── jtreg_output-hotspot.log │ │ │ │ @@ -3148,31 +3148,31 @@ │ │ │ │ Results written to /tmp/hotspot/JTwork │ │ │ │ [debian/tests/jtreg-autopkgtest.sh] nothing to cleanup │ │ │ │ grep: debian/tests/hotspot-archs: No such file or directory │ │ │ │ Unable to compare jtreg results: no build jtreport found for hotspot/arm64. │ │ │ │ Reason: '/usr/share/doc/openjdk-21-jre-headless//test-arm64/jtreport-hotspot.tar.gz' does not exist. │ │ │ │ Command exited with non-zero status 77 │ │ │ │ Command being timed: "debian/tests/hotspot" │ │ │ │ - User time (seconds): 14035.83 │ │ │ │ - System time (seconds): 2027.36 │ │ │ │ - Percent of CPU this job got: 142% │ │ │ │ - Elapsed (wall clock) time (h:mm:ss or m:ss): 3:07:24 │ │ │ │ + User time (seconds): 12061.56 │ │ │ │ + System time (seconds): 1572.06 │ │ │ │ + Percent of CPU this job got: 113% │ │ │ │ + Elapsed (wall clock) time (h:mm:ss or m:ss): 3:20:40 │ │ │ │ Average shared text size (kbytes): 0 │ │ │ │ Average unshared data size (kbytes): 0 │ │ │ │ Average stack size (kbytes): 0 │ │ │ │ Average total size (kbytes): 0 │ │ │ │ - Maximum resident set size (kbytes): 6203604 │ │ │ │ + Maximum resident set size (kbytes): 7866044 │ │ │ │ Average resident set size (kbytes): 0 │ │ │ │ - Major (requiring I/O) page faults: 2311 │ │ │ │ - Minor (reclaiming a frame) page faults: 124082974 │ │ │ │ - Voluntary context switches: 59180550 │ │ │ │ - Involuntary context switches: 4842353 │ │ │ │ + Major (requiring I/O) page faults: 1370 │ │ │ │ + Minor (reclaiming a frame) page faults: 143383976 │ │ │ │ + Voluntary context switches: 42051330 │ │ │ │ + Involuntary context switches: 11540993 │ │ │ │ Swaps: 0 │ │ │ │ - File system inputs: 222480 │ │ │ │ - File system outputs: 0 │ │ │ │ + File system inputs: 1752200 │ │ │ │ + File system outputs: 26259192 │ │ │ │ Socket messages sent: 0 │ │ │ │ Socket messages received: 0 │ │ │ │ Signals delivered: 0 │ │ │ │ Page size (bytes): 4096 │ │ │ │ Exit status: 77 │ │ │ │ ===== END check-hotspot ===== │ │ │ │ ===== START check-langtools ===== │ │ │ │ @@ -7631,31 +7631,31 @@ │ │ │ │ Results written to /tmp/langtools/JTwork │ │ │ │ [debian/tests/jtreg-autopkgtest.sh] nothing to cleanup │ │ │ │ grep: debian/tests/hotspot-archs: No such file or directory │ │ │ │ Unable to compare jtreg results: no build jtreport found for hotspot/arm64. │ │ │ │ Reason: '/usr/share/doc/openjdk-21-jre-headless//test-arm64/jtreport-hotspot.tar.gz' does not exist. │ │ │ │ Command exited with non-zero status 77 │ │ │ │ Command being timed: "debian/tests/langtools" │ │ │ │ - User time (seconds): 5149.11 │ │ │ │ - System time (seconds): 370.93 │ │ │ │ + User time (seconds): 3919.88 │ │ │ │ + System time (seconds): 307.47 │ │ │ │ Percent of CPU this job got: 143% │ │ │ │ - Elapsed (wall clock) time (h:mm:ss or m:ss): 1:04:06 │ │ │ │ + Elapsed (wall clock) time (h:mm:ss or m:ss): 49:04.49 │ │ │ │ Average shared text size (kbytes): 0 │ │ │ │ Average unshared data size (kbytes): 0 │ │ │ │ Average stack size (kbytes): 0 │ │ │ │ Average total size (kbytes): 0 │ │ │ │ - Maximum resident set size (kbytes): 5490520 │ │ │ │ + Maximum resident set size (kbytes): 7633616 │ │ │ │ Average resident set size (kbytes): 0 │ │ │ │ - Major (requiring I/O) page faults: 263 │ │ │ │ - Minor (reclaiming a frame) page faults: 16117350 │ │ │ │ - Voluntary context switches: 4005344 │ │ │ │ - Involuntary context switches: 54161 │ │ │ │ + Major (requiring I/O) page faults: 109 │ │ │ │ + Minor (reclaiming a frame) page faults: 17652152 │ │ │ │ + Voluntary context switches: 3901521 │ │ │ │ + Involuntary context switches: 1347317 │ │ │ │ Swaps: 0 │ │ │ │ - File system inputs: 100368 │ │ │ │ - File system outputs: 0 │ │ │ │ + File system inputs: 232760 │ │ │ │ + File system outputs: 3203944 │ │ │ │ Socket messages sent: 0 │ │ │ │ Socket messages received: 0 │ │ │ │ Signals delivered: 0 │ │ │ │ Page size (bytes): 4096 │ │ │ │ Exit status: 77 │ │ │ │ ===== END check-langtools ===== │ │ │ │ ===== START check-jaxp ===== │ │ │ │ @@ -8181,50 +8181,50 @@ │ │ │ │ Results written to /tmp/jaxp/JTwork │ │ │ │ [debian/tests/jtreg-autopkgtest.sh] nothing to cleanup │ │ │ │ grep: debian/tests/hotspot-archs: No such file or directory │ │ │ │ Unable to compare jtreg results: no build jtreport found for hotspot/arm64. │ │ │ │ Reason: '/usr/share/doc/openjdk-21-jre-headless//test-arm64/jtreport-hotspot.tar.gz' does not exist. │ │ │ │ Command exited with non-zero status 77 │ │ │ │ Command being timed: "debian/tests/jaxp" │ │ │ │ - User time (seconds): 3279.06 │ │ │ │ - System time (seconds): 231.26 │ │ │ │ - Percent of CPU this job got: 279% │ │ │ │ - Elapsed (wall clock) time (h:mm:ss or m:ss): 20:57.31 │ │ │ │ + User time (seconds): 3695.31 │ │ │ │ + System time (seconds): 235.00 │ │ │ │ + Percent of CPU this job got: 282% │ │ │ │ + Elapsed (wall clock) time (h:mm:ss or m:ss): 23:09.67 │ │ │ │ Average shared text size (kbytes): 0 │ │ │ │ Average unshared data size (kbytes): 0 │ │ │ │ Average stack size (kbytes): 0 │ │ │ │ Average total size (kbytes): 0 │ │ │ │ - Maximum resident set size (kbytes): 384268 │ │ │ │ + Maximum resident set size (kbytes): 467552 │ │ │ │ Average resident set size (kbytes): 0 │ │ │ │ - Major (requiring I/O) page faults: 8 │ │ │ │ - Minor (reclaiming a frame) page faults: 21368281 │ │ │ │ - Voluntary context switches: 2971079 │ │ │ │ - Involuntary context switches: 22071 │ │ │ │ + Major (requiring I/O) page faults: 5 │ │ │ │ + Minor (reclaiming a frame) page faults: 21388963 │ │ │ │ + Voluntary context switches: 2797130 │ │ │ │ + Involuntary context switches: 37463 │ │ │ │ Swaps: 0 │ │ │ │ - File system inputs: 780528 │ │ │ │ - File system outputs: 0 │ │ │ │ + File system inputs: 898048 │ │ │ │ + File system outputs: 2835712 │ │ │ │ Socket messages sent: 0 │ │ │ │ Socket messages received: 0 │ │ │ │ Signals delivered: 0 │ │ │ │ Page size (bytes): 4096 │ │ │ │ Exit status: 77 │ │ │ │ ===== END check-jaxp ===== │ │ │ │ ===== START check-jdk ===== │ │ │ │ mkdir -p jtreg-test-output/jdk │ │ │ │ BOOTJDK_HOME=/usr/lib/jvm/java-21-openjdk-arm64 JTREG_OPTIONS= VMNAME=hotspot JDK_TO_TEST=build/bootcycle-build/images/jdk \ │ │ │ │ AUTOPKGTEST_TMP=/tmp/ AUTOPKGTEST_ARTIFACTS=jtreg-test-output/ \ │ │ │ │ /usr/bin/time -v debian/tests/jdk | tee jtreg-test-output/check-jdk.log │ │ │ │ │ │ │ │ -(xfwm4:2389852): dbind-WARNING **: 21:24:49.617: AT-SPI: Error retrieving accessibility bus address: org.freedesktop.DBus.Error.ServiceUnknown: The name org.a11y.Bus was not provided by any .service files │ │ │ │ -dbus-daemon[2389841]: [session uid=999 pid=2389841 pidfd=5] Activating service name='org.xfce.Xfconf' requested by ':1.1' (uid=999 pid=2389852 comm="xfwm4") │ │ │ │ -dbus-daemon[2389841]: [session uid=999 pid=2389841 pidfd=5] Successfully activated service 'org.xfce.Xfconf' │ │ │ │ +(xfwm4:2208176): dbind-WARNING **: 07:45:16.431: AT-SPI: Error retrieving accessibility bus address: org.freedesktop.DBus.Error.ServiceUnknown: The name org.a11y.Bus was not provided by any .service files │ │ │ │ +dbus-daemon[2208165]: [session uid=996 pid=2208165 pidfd=5] Activating service name='org.xfce.Xfconf' requested by ':1.1' (uid=996 pid=2208176 comm="xfwm4") │ │ │ │ +dbus-daemon[2208165]: [session uid=996 pid=2208165 pidfd=5] Successfully activated service 'org.xfce.Xfconf' │ │ │ │ │ │ │ │ -(xfwm4:2389852): xfwm4-WARNING **: 21:24:50.976: Another compositing manager is running on screen 0 │ │ │ │ +(xfwm4:2208176): xfwm4-WARNING **: 07:45:17.677: Another compositing manager is running on screen 0 │ │ │ │ │ │ │ │ -(xfwm4:2389852): xfwm4-WARNING **: 21:24:50.982: Failed to connect to session manager: Failed to connect to the session manager: SESSION_MANAGER environment variable not defined │ │ │ │ +(xfwm4:2208176): xfwm4-WARNING **: 07:45:17.679: Failed to connect to session manager: Failed to connect to the session manager: SESSION_MANAGER environment variable not defined │ │ │ │ dpkg: error: --compare-versions takes three arguments: │ │ │ │ │ │ │ │ Type dpkg --help for help about installing and deinstalling packages [*]; │ │ │ │ Use 'apt' or 'aptitude' for user-friendly package management; │ │ │ │ Type dpkg -Dhelp for a list of dpkg debug flag values; │ │ │ │ Type dpkg --force-help for a list of forcing options; │ │ │ │ Type dpkg-deb --help for help about manipulating *.deb files; │ │ │ │ @@ -14742,17 +14742,17 @@ │ │ │ │ Passed: tools/launcher/ToolsOpts.java │ │ │ │ Passed: tools/launcher/TooSmallStackSize.java │ │ │ │ Passed: tools/launcher/UnicodeTest.java │ │ │ │ Passed: tools/launcher/UnresolvedExceptions.java │ │ │ │ Passed: tools/launcher/VersionCheck.java │ │ │ │ Test results: passed: 6,503; failed: 9; skipped: 115; excluded: 38; did not match keywords: 37; did not meet module requirements: 3; did not meet platform requirements: 99 │ │ │ │ Framework-based tests: 335,228 = 164,254 TestNG + 170,974 JUnit │ │ │ │ +Error: Some tests failed or other problems occurred. │ │ │ │ Report written to /build/reproducible-path/openjdk-21-21.0.13+9/jtreg-test-output/jdk/0/JTreport/html/report.html │ │ │ │ Results written to /tmp/jdk/JTwork │ │ │ │ -Error: Some tests failed or other problems occurred. │ │ │ │ Directory "jtreg-test-output/jdk/1/JTreport" not found: creating │ │ │ │ FAILED: java/net/MulticastSocket/B6427403.java │ │ │ │ FAILED: java/net/MulticastSocket/NoLoopbackPackets.java │ │ │ │ FAILED: java/net/MulticastSocket/Promiscuous.java │ │ │ │ FAILED: java/net/MulticastSocket/SetLoopbackMode.java │ │ │ │ FAILED: java/net/MulticastSocket/SetLoopbackModeIPv4.java │ │ │ │ FAILED: java/net/MulticastSocket/Test.java │ │ │ │ @@ -14778,31 +14778,31 @@ │ │ │ │ Framework-based tests: 8 = 8 TestNG + 0 JUnit │ │ │ │ Report written to /build/reproducible-path/openjdk-21-21.0.13+9/jtreg-test-output/jdk/2/JTreport/html/report.html │ │ │ │ Results written to /tmp/jdk/JTwork │ │ │ │ Error: Some tests failed or other problems occurred. │ │ │ │ [debian/tests/jtreg-autopkgtest.sh] nothing to cleanup │ │ │ │ Command exited with non-zero status 2 │ │ │ │ Command being timed: "debian/tests/jdk" │ │ │ │ - User time (seconds): 22433.39 │ │ │ │ - System time (seconds): 2047.80 │ │ │ │ - Percent of CPU this job got: 157% │ │ │ │ - Elapsed (wall clock) time (h:mm:ss or m:ss): 4:19:11 │ │ │ │ + User time (seconds): 21812.38 │ │ │ │ + System time (seconds): 1796.34 │ │ │ │ + Percent of CPU this job got: 138% │ │ │ │ + Elapsed (wall clock) time (h:mm:ss or m:ss): 4:43:30 │ │ │ │ Average shared text size (kbytes): 0 │ │ │ │ Average unshared data size (kbytes): 0 │ │ │ │ Average stack size (kbytes): 0 │ │ │ │ Average total size (kbytes): 0 │ │ │ │ - Maximum resident set size (kbytes): 16019988 │ │ │ │ + Maximum resident set size (kbytes): 15069132 │ │ │ │ Average resident set size (kbytes): 0 │ │ │ │ - Major (requiring I/O) page faults: 1267 │ │ │ │ - Minor (reclaiming a frame) page faults: 125097142 │ │ │ │ - Voluntary context switches: 40853599 │ │ │ │ - Involuntary context switches: 2060045 │ │ │ │ + Major (requiring I/O) page faults: 696 │ │ │ │ + Minor (reclaiming a frame) page faults: 146651401 │ │ │ │ + Voluntary context switches: 43525886 │ │ │ │ + Involuntary context switches: 10917918 │ │ │ │ Swaps: 0 │ │ │ │ - File system inputs: 2201120 │ │ │ │ - File system outputs: 0 │ │ │ │ + File system inputs: 3158768 │ │ │ │ + File system outputs: 85960928 │ │ │ │ Socket messages sent: 0 │ │ │ │ Socket messages received: 0 │ │ │ │ Signals delivered: 0 │ │ │ │ Page size (bytes): 4096 │ │ │ │ Exit status: 2 │ │ │ │ Killed │ │ │ │ ===== END check-jdk ===== │ │ │ │ @@ -14861,29 +14861,29 @@ │ │ │ │ FAILED: java/net/SocketPermission/SocketPermissionTest.java │ │ │ │ FAILED: sun/security/krb5/auto/Addresses.java │ │ │ │ Test results: failed: 9; excluded: 38; did not match keywords: 37; did not match prior status: 6,605 │ │ │ │ Framework-based tests: 8 = 8 TestNG + 0 JUnit │ │ │ │ [debian/tests/jtreg-autopkgtest.sh] nothing to cleanup │ │ │ │ make[2]: Leaving directory '/build/reproducible-path/openjdk-21-21.0.13+9' │ │ │ │ Command being timed: "/usr/bin/make -f debian/rules -k jtregcheck TEST_SUITES=hotspot langtools jaxp jdk JTREG_OPTIONS=" │ │ │ │ - User time (seconds): 44898.66 │ │ │ │ - System time (seconds): 4678.58 │ │ │ │ - Percent of CPU this job got: 155% │ │ │ │ - Elapsed (wall clock) time (h:mm:ss or m:ss): 8:51:41 │ │ │ │ + User time (seconds): 41490.34 │ │ │ │ + System time (seconds): 3912.14 │ │ │ │ + Percent of CPU this job got: 135% │ │ │ │ + Elapsed (wall clock) time (h:mm:ss or m:ss): 9:16:26 │ │ │ │ Average shared text size (kbytes): 0 │ │ │ │ Average unshared data size (kbytes): 0 │ │ │ │ Average stack size (kbytes): 0 │ │ │ │ Average total size (kbytes): 0 │ │ │ │ - Maximum resident set size (kbytes): 16019988 │ │ │ │ + Maximum resident set size (kbytes): 15069132 │ │ │ │ Average resident set size (kbytes): 0 │ │ │ │ - Major (requiring I/O) page faults: 3854 │ │ │ │ - Minor (reclaiming a frame) page faults: 286694994 │ │ │ │ - Voluntary context switches: 107025524 │ │ │ │ - Involuntary context switches: 6978681 │ │ │ │ + Major (requiring I/O) page faults: 2218 │ │ │ │ + Minor (reclaiming a frame) page faults: 329105826 │ │ │ │ + Voluntary context switches: 92291004 │ │ │ │ + Involuntary context switches: 23844800 │ │ │ │ Swaps: 0 │ │ │ │ - File system inputs: 3304680 │ │ │ │ - File system outputs: 0 │ │ │ │ + File system inputs: 6045448 │ │ │ │ + File system outputs: 118282672 │ │ │ │ Socket messages sent: 0 │ │ │ │ Socket messages received: 0 │ │ │ │ Signals delivered: 0 │ │ │ │ Page size (bytes): 4096 │ │ │ │ Exit status: 0 │ │ ├── ./usr/share/doc/openjdk-21-jre-headless/test-arm64/jtreport-hotspot.tar.gz │ │ │ ├── jtreport-hotspot.tar │ │ │ │ ├── file list │ │ │ │ │ @@ -1,230 +1,230 @@ │ │ │ │ │ -lrwxrwxrwx 0 sbuild (999) sbuild (999) 0 2026-10-26 01:44:00.000000 jtreg-test-output/jdk/JTreport -> 2/JTreport │ │ │ │ │ -drwxr-xr-x 0 sbuild (999) sbuild (999) 0 2026-10-26 01:43:35.000000 jtreg-test-output/jdk/2/JTreport/ │ │ │ │ │ --rw-r--r-- 0 sbuild (999) sbuild (999) 698 2026-10-26 01:43:35.000000 jtreg-test-output/jdk/2/JTreport/index.html │ │ │ │ │ --rw-r--r-- 0 sbuild (999) sbuild (999) 0 2026-10-26 01:43:35.000000 jtreg-test-output/jdk/2/JTreport/reportdir.dat │ │ │ │ │ -drwxr-xr-x 0 sbuild (999) sbuild (999) 0 2026-10-26 01:43:35.000000 jtreg-test-output/jdk/2/JTreport/html/ │ │ │ │ │ --rw-r--r-- 0 sbuild (999) sbuild (999) 762768 2026-10-26 01:43:35.000000 jtreg-test-output/jdk/2/JTreport/html/notRun_gr.html │ │ │ │ │ --rw-r--r-- 0 sbuild (999) sbuild (999) 762495 2026-10-26 01:43:35.000000 jtreg-test-output/jdk/2/JTreport/html/notRun.html │ │ │ │ │ --rw-r--r-- 0 sbuild (999) sbuild (999) 509 2026-10-26 01:43:35.000000 jtreg-test-output/jdk/2/JTreport/html/error_gr.html │ │ │ │ │ --rw-r--r-- 0 sbuild (999) sbuild (999) 461 2026-10-26 01:43:35.000000 jtreg-test-output/jdk/2/JTreport/html/error.html │ │ │ │ │ --rw-r--r-- 0 sbuild (999) sbuild (999) 2738 2026-10-26 01:43:35.000000 jtreg-test-output/jdk/2/JTreport/html/failed_gr.html │ │ │ │ │ --rw-r--r-- 0 sbuild (999) sbuild (999) 2008 2026-10-26 01:43:35.000000 jtreg-test-output/jdk/2/JTreport/html/failed.html │ │ │ │ │ --rw-r--r-- 0 sbuild (999) sbuild (999) 1251600 2026-10-26 01:43:35.000000 jtreg-test-output/jdk/2/JTreport/html/passed_gr.html │ │ │ │ │ --rw-r--r-- 0 sbuild (999) sbuild (999) 1250419 2026-10-26 01:43:35.000000 jtreg-test-output/jdk/2/JTreport/html/passed.html │ │ │ │ │ --rw-r--r-- 0 sbuild (999) sbuild (999) 83137 2026-10-26 01:43:35.000000 jtreg-test-output/jdk/2/JTreport/html/excluded.html │ │ │ │ │ --rw-r--r-- 0 sbuild (999) sbuild (999) 4191 2026-10-26 01:43:35.000000 jtreg-test-output/jdk/2/JTreport/html/env.html │ │ │ │ │ --rw-r--r-- 0 sbuild (999) sbuild (999) 24346 2026-10-26 01:43:35.000000 jtreg-test-output/jdk/2/JTreport/html/config.html │ │ │ │ │ --rw-r--r-- 0 sbuild (999) sbuild (999) 307 2026-10-26 01:43:34.000000 jtreg-test-output/jdk/2/JTreport/html/report.css │ │ │ │ │ --rw-r--r-- 0 sbuild (999) sbuild (999) 1100892 2026-10-26 01:43:35.000000 jtreg-test-output/jdk/2/JTreport/html/index.html │ │ │ │ │ --rw-r--r-- 0 sbuild (999) sbuild (999) 1100892 2026-10-26 01:43:35.000000 jtreg-test-output/jdk/2/JTreport/html/report.html │ │ │ │ │ -drwxr-xr-x 0 sbuild (999) sbuild (999) 0 2026-10-26 01:43:35.000000 jtreg-test-output/jdk/2/JTreport/text/ │ │ │ │ │ --rw-r--r-- 0 sbuild (999) sbuild (999) 132 2026-10-26 01:43:35.000000 jtreg-test-output/jdk/2/JTreport/text/testng.txt │ │ │ │ │ --rw-r--r-- 0 sbuild (999) sbuild (999) 1023561 2026-10-26 01:43:35.000000 jtreg-test-output/jdk/2/JTreport/text/notRun.txt │ │ │ │ │ --rw-r--r-- 0 sbuild (999) sbuild (999) 101 2026-10-26 01:43:35.000000 jtreg-test-output/jdk/2/JTreport/text/stats.txt │ │ │ │ │ --rw-r--r-- 0 sbuild (999) sbuild (999) 116 2026-10-26 01:43:35.000000 jtreg-test-output/jdk/2/JTreport/text/timeStats.txt │ │ │ │ │ --rw-r--r-- 0 sbuild (999) sbuild (999) 21 2026-10-26 01:43:35.000000 jtreg-test-output/jdk/2/JTreport/text/tc_newfailures.txt │ │ │ │ │ --rw-r--r-- 0 sbuild (999) sbuild (999) 21 2026-10-26 01:43:35.000000 jtreg-test-output/jdk/2/JTreport/text/tc_fail2notrun.txt │ │ │ │ │ --rw-r--r-- 0 sbuild (999) sbuild (999) 20 2026-10-26 01:43:35.000000 jtreg-test-output/jdk/2/JTreport/text/tc_fail2error.txt │ │ │ │ │ --rw-r--r-- 0 sbuild (999) sbuild (999) 19 2026-10-26 01:43:35.000000 jtreg-test-output/jdk/2/JTreport/text/tc_fail2pass.txt │ │ │ │ │ --rw-r--r-- 0 sbuild (999) sbuild (999) 22 2026-10-26 01:43:35.000000 jtreg-test-output/jdk/2/JTreport/text/tc_fail2missing.txt │ │ │ │ │ --rw-r--r-- 0 sbuild (999) sbuild (999) 19 2026-10-26 01:43:35.000000 jtreg-test-output/jdk/2/JTreport/text/other_errors.txt │ │ │ │ │ --rw-r--r-- 0 sbuild (999) sbuild (999) 416 2026-10-26 01:43:35.000000 jtreg-test-output/jdk/2/JTreport/text/newfailures.txt │ │ │ │ │ --rw-r--r-- 0 sbuild (999) sbuild (999) 16 2026-10-26 01:43:35.000000 jtreg-test-output/jdk/2/JTreport/text/fail2fail.txt │ │ │ │ │ --rw-r--r-- 0 sbuild (999) sbuild (999) 18 2026-10-26 01:43:35.000000 jtreg-test-output/jdk/2/JTreport/text/fail2notrun.txt │ │ │ │ │ --rw-r--r-- 0 sbuild (999) sbuild (999) 17 2026-10-26 01:43:35.000000 jtreg-test-output/jdk/2/JTreport/text/faiL2error.txt │ │ │ │ │ --rw-r--r-- 0 sbuild (999) sbuild (999) 16 2026-10-26 01:43:35.000000 jtreg-test-output/jdk/2/JTreport/text/fail2pass.txt │ │ │ │ │ --rw-r--r-- 0 sbuild (999) sbuild (999) 19 2026-10-26 01:43:35.000000 jtreg-test-output/jdk/2/JTreport/text/fail2missing.txt │ │ │ │ │ --rw-r--r-- 0 sbuild (999) sbuild (999) 890214 2026-10-26 01:43:35.000000 jtreg-test-output/jdk/2/JTreport/text/summary.txt │ │ │ │ │ --rw-r--r-- 0 sbuild (999) sbuild (999) 548 2026-10-26 01:43:22.000000 jtreg-test-output/jdk/2/JTreport/text/cmdArgs.txt │ │ │ │ │ -drwxr-xr-x 0 sbuild (999) sbuild (999) 0 2026-10-26 01:42:57.000000 jtreg-test-output/jdk/1/JTreport/ │ │ │ │ │ --rw-r--r-- 0 sbuild (999) sbuild (999) 698 2026-10-26 01:42:57.000000 jtreg-test-output/jdk/1/JTreport/index.html │ │ │ │ │ --rw-r--r-- 0 sbuild (999) sbuild (999) 0 2026-10-26 01:42:57.000000 jtreg-test-output/jdk/1/JTreport/reportdir.dat │ │ │ │ │ -drwxr-xr-x 0 sbuild (999) sbuild (999) 0 2026-10-26 01:42:57.000000 jtreg-test-output/jdk/1/JTreport/html/ │ │ │ │ │ --rw-r--r-- 0 sbuild (999) sbuild (999) 762768 2026-10-26 01:42:57.000000 jtreg-test-output/jdk/1/JTreport/html/notRun_gr.html │ │ │ │ │ --rw-r--r-- 0 sbuild (999) sbuild (999) 762495 2026-10-26 01:42:57.000000 jtreg-test-output/jdk/1/JTreport/html/notRun.html │ │ │ │ │ --rw-r--r-- 0 sbuild (999) sbuild (999) 509 2026-10-26 01:42:57.000000 jtreg-test-output/jdk/1/JTreport/html/error_gr.html │ │ │ │ │ --rw-r--r-- 0 sbuild (999) sbuild (999) 461 2026-10-26 01:42:57.000000 jtreg-test-output/jdk/1/JTreport/html/error.html │ │ │ │ │ --rw-r--r-- 0 sbuild (999) sbuild (999) 2738 2026-10-26 01:42:57.000000 jtreg-test-output/jdk/1/JTreport/html/failed_gr.html │ │ │ │ │ --rw-r--r-- 0 sbuild (999) sbuild (999) 2008 2026-10-26 01:42:57.000000 jtreg-test-output/jdk/1/JTreport/html/failed.html │ │ │ │ │ --rw-r--r-- 0 sbuild (999) sbuild (999) 1251600 2026-10-26 01:42:57.000000 jtreg-test-output/jdk/1/JTreport/html/passed_gr.html │ │ │ │ │ --rw-r--r-- 0 sbuild (999) sbuild (999) 1250419 2026-10-26 01:42:57.000000 jtreg-test-output/jdk/1/JTreport/html/passed.html │ │ │ │ │ --rw-r--r-- 0 sbuild (999) sbuild (999) 83137 2026-10-26 01:42:56.000000 jtreg-test-output/jdk/1/JTreport/html/excluded.html │ │ │ │ │ --rw-r--r-- 0 sbuild (999) sbuild (999) 4191 2026-10-26 01:42:56.000000 jtreg-test-output/jdk/1/JTreport/html/env.html │ │ │ │ │ --rw-r--r-- 0 sbuild (999) sbuild (999) 24346 2026-10-26 01:42:56.000000 jtreg-test-output/jdk/1/JTreport/html/config.html │ │ │ │ │ --rw-r--r-- 0 sbuild (999) sbuild (999) 307 2026-10-26 01:42:56.000000 jtreg-test-output/jdk/1/JTreport/html/report.css │ │ │ │ │ --rw-r--r-- 0 sbuild (999) sbuild (999) 1100892 2026-10-26 01:42:56.000000 jtreg-test-output/jdk/1/JTreport/html/index.html │ │ │ │ │ --rw-r--r-- 0 sbuild (999) sbuild (999) 1100892 2026-10-26 01:42:56.000000 jtreg-test-output/jdk/1/JTreport/html/report.html │ │ │ │ │ -drwxr-xr-x 0 sbuild (999) sbuild (999) 0 2026-10-26 01:42:57.000000 jtreg-test-output/jdk/1/JTreport/text/ │ │ │ │ │ --rw-r--r-- 0 sbuild (999) sbuild (999) 132 2026-10-26 01:42:57.000000 jtreg-test-output/jdk/1/JTreport/text/testng.txt │ │ │ │ │ --rw-r--r-- 0 sbuild (999) sbuild (999) 1023561 2026-10-26 01:42:57.000000 jtreg-test-output/jdk/1/JTreport/text/notRun.txt │ │ │ │ │ --rw-r--r-- 0 sbuild (999) sbuild (999) 101 2026-10-26 01:42:57.000000 jtreg-test-output/jdk/1/JTreport/text/stats.txt │ │ │ │ │ --rw-r--r-- 0 sbuild (999) sbuild (999) 116 2026-10-26 01:42:57.000000 jtreg-test-output/jdk/1/JTreport/text/timeStats.txt │ │ │ │ │ --rw-r--r-- 0 sbuild (999) sbuild (999) 21 2026-10-26 01:42:57.000000 jtreg-test-output/jdk/1/JTreport/text/tc_newfailures.txt │ │ │ │ │ --rw-r--r-- 0 sbuild (999) sbuild (999) 21 2026-10-26 01:42:57.000000 jtreg-test-output/jdk/1/JTreport/text/tc_fail2notrun.txt │ │ │ │ │ --rw-r--r-- 0 sbuild (999) sbuild (999) 20 2026-10-26 01:42:57.000000 jtreg-test-output/jdk/1/JTreport/text/tc_fail2error.txt │ │ │ │ │ --rw-r--r-- 0 sbuild (999) sbuild (999) 19 2026-10-26 01:42:57.000000 jtreg-test-output/jdk/1/JTreport/text/tc_fail2pass.txt │ │ │ │ │ --rw-r--r-- 0 sbuild (999) sbuild (999) 22 2026-10-26 01:42:57.000000 jtreg-test-output/jdk/1/JTreport/text/tc_fail2missing.txt │ │ │ │ │ --rw-r--r-- 0 sbuild (999) sbuild (999) 19 2026-10-26 01:42:57.000000 jtreg-test-output/jdk/1/JTreport/text/other_errors.txt │ │ │ │ │ --rw-r--r-- 0 sbuild (999) sbuild (999) 416 2026-10-26 01:42:57.000000 jtreg-test-output/jdk/1/JTreport/text/newfailures.txt │ │ │ │ │ --rw-r--r-- 0 sbuild (999) sbuild (999) 16 2026-10-26 01:42:57.000000 jtreg-test-output/jdk/1/JTreport/text/fail2fail.txt │ │ │ │ │ --rw-r--r-- 0 sbuild (999) sbuild (999) 18 2026-10-26 01:42:57.000000 jtreg-test-output/jdk/1/JTreport/text/fail2notrun.txt │ │ │ │ │ --rw-r--r-- 0 sbuild (999) sbuild (999) 17 2026-10-26 01:42:57.000000 jtreg-test-output/jdk/1/JTreport/text/faiL2error.txt │ │ │ │ │ --rw-r--r-- 0 sbuild (999) sbuild (999) 16 2026-10-26 01:42:57.000000 jtreg-test-output/jdk/1/JTreport/text/fail2pass.txt │ │ │ │ │ --rw-r--r-- 0 sbuild (999) sbuild (999) 19 2026-10-26 01:42:57.000000 jtreg-test-output/jdk/1/JTreport/text/fail2missing.txt │ │ │ │ │ --rw-r--r-- 0 sbuild (999) sbuild (999) 890214 2026-10-26 01:42:57.000000 jtreg-test-output/jdk/1/JTreport/text/summary.txt │ │ │ │ │ --rw-r--r-- 0 sbuild (999) sbuild (999) 548 2026-10-26 01:42:42.000000 jtreg-test-output/jdk/1/JTreport/text/cmdArgs.txt │ │ │ │ │ -drwxr-xr-x 0 sbuild (999) sbuild (999) 0 2026-10-26 01:42:16.000000 jtreg-test-output/jdk/0/JTreport/ │ │ │ │ │ --rw-r--r-- 0 sbuild (999) sbuild (999) 698 2026-10-26 01:42:16.000000 jtreg-test-output/jdk/0/JTreport/index.html │ │ │ │ │ --rw-r--r-- 0 sbuild (999) sbuild (999) 0 2026-10-26 01:42:16.000000 jtreg-test-output/jdk/0/JTreport/reportdir.dat │ │ │ │ │ -drwxr-xr-x 0 sbuild (999) sbuild (999) 0 2026-10-26 01:42:16.000000 jtreg-test-output/jdk/0/JTreport/html/ │ │ │ │ │ --rw-r--r-- 0 sbuild (999) sbuild (999) 20672 2026-10-26 01:42:16.000000 jtreg-test-output/jdk/0/JTreport/html/notRun_gr.html │ │ │ │ │ --rw-r--r-- 0 sbuild (999) sbuild (999) 20327 2026-10-26 01:42:16.000000 jtreg-test-output/jdk/0/JTreport/html/notRun.html │ │ │ │ │ --rw-r--r-- 0 sbuild (999) sbuild (999) 509 2026-10-26 01:42:16.000000 jtreg-test-output/jdk/0/JTreport/html/error_gr.html │ │ │ │ │ --rw-r--r-- 0 sbuild (999) sbuild (999) 461 2026-10-26 01:42:16.000000 jtreg-test-output/jdk/0/JTreport/html/error.html │ │ │ │ │ --rw-r--r-- 0 sbuild (999) sbuild (999) 2738 2026-10-26 01:42:16.000000 jtreg-test-output/jdk/0/JTreport/html/failed_gr.html │ │ │ │ │ --rw-r--r-- 0 sbuild (999) sbuild (999) 2008 2026-10-26 01:42:16.000000 jtreg-test-output/jdk/0/JTreport/html/failed.html │ │ │ │ │ --rw-r--r-- 0 sbuild (999) sbuild (999) 1251600 2026-10-26 01:42:16.000000 jtreg-test-output/jdk/0/JTreport/html/passed_gr.html │ │ │ │ │ --rw-r--r-- 0 sbuild (999) sbuild (999) 1250419 2026-10-26 01:42:16.000000 jtreg-test-output/jdk/0/JTreport/html/passed.html │ │ │ │ │ --rw-r--r-- 0 sbuild (999) sbuild (999) 83137 2026-10-26 01:42:16.000000 jtreg-test-output/jdk/0/JTreport/html/excluded.html │ │ │ │ │ --rw-r--r-- 0 sbuild (999) sbuild (999) 4172 2026-10-26 01:42:16.000000 jtreg-test-output/jdk/0/JTreport/html/env.html │ │ │ │ │ --rw-r--r-- 0 sbuild (999) sbuild (999) 23914 2026-10-26 01:42:16.000000 jtreg-test-output/jdk/0/JTreport/html/config.html │ │ │ │ │ --rw-r--r-- 0 sbuild (999) sbuild (999) 307 2026-10-26 01:42:16.000000 jtreg-test-output/jdk/0/JTreport/html/report.css │ │ │ │ │ --rw-r--r-- 0 sbuild (999) sbuild (999) 1123550 2026-10-26 01:42:16.000000 jtreg-test-output/jdk/0/JTreport/html/index.html │ │ │ │ │ --rw-r--r-- 0 sbuild (999) sbuild (999) 1123550 2026-10-26 01:42:16.000000 jtreg-test-output/jdk/0/JTreport/html/report.html │ │ │ │ │ -drwxr-xr-x 0 sbuild (999) sbuild (999) 0 2026-10-26 01:42:17.000000 jtreg-test-output/jdk/0/JTreport/text/ │ │ │ │ │ --rw-r--r-- 0 sbuild (999) sbuild (999) 86012 2026-10-26 01:42:17.000000 jtreg-test-output/jdk/0/JTreport/text/junit.txt │ │ │ │ │ --rw-r--r-- 0 sbuild (999) sbuild (999) 131917 2026-10-26 01:42:17.000000 jtreg-test-output/jdk/0/JTreport/text/testng.txt │ │ │ │ │ --rw-r--r-- 0 sbuild (999) sbuild (999) 26283 2026-10-26 01:42:16.000000 jtreg-test-output/jdk/0/JTreport/text/notRun.txt │ │ │ │ │ --rw-r--r-- 0 sbuild (999) sbuild (999) 172 2026-10-26 01:42:16.000000 jtreg-test-output/jdk/0/JTreport/text/stats.txt │ │ │ │ │ --rw-r--r-- 0 sbuild (999) sbuild (999) 947 2026-10-26 01:42:16.000000 jtreg-test-output/jdk/0/JTreport/text/timeStats.txt │ │ │ │ │ --rw-r--r-- 0 sbuild (999) sbuild (999) 21 2026-10-26 01:42:16.000000 jtreg-test-output/jdk/0/JTreport/text/tc_newfailures.txt │ │ │ │ │ --rw-r--r-- 0 sbuild (999) sbuild (999) 21 2026-10-26 01:42:16.000000 jtreg-test-output/jdk/0/JTreport/text/tc_fail2notrun.txt │ │ │ │ │ --rw-r--r-- 0 sbuild (999) sbuild (999) 20 2026-10-26 01:42:16.000000 jtreg-test-output/jdk/0/JTreport/text/tc_fail2error.txt │ │ │ │ │ --rw-r--r-- 0 sbuild (999) sbuild (999) 19 2026-10-26 01:42:16.000000 jtreg-test-output/jdk/0/JTreport/text/tc_fail2pass.txt │ │ │ │ │ --rw-r--r-- 0 sbuild (999) sbuild (999) 22 2026-10-26 01:42:16.000000 jtreg-test-output/jdk/0/JTreport/text/tc_fail2missing.txt │ │ │ │ │ --rw-r--r-- 0 sbuild (999) sbuild (999) 19 2026-10-26 01:42:16.000000 jtreg-test-output/jdk/0/JTreport/text/other_errors.txt │ │ │ │ │ --rw-r--r-- 0 sbuild (999) sbuild (999) 416 2026-10-26 01:42:16.000000 jtreg-test-output/jdk/0/JTreport/text/newfailures.txt │ │ │ │ │ --rw-r--r-- 0 sbuild (999) sbuild (999) 16 2026-10-26 01:42:16.000000 jtreg-test-output/jdk/0/JTreport/text/fail2fail.txt │ │ │ │ │ --rw-r--r-- 0 sbuild (999) sbuild (999) 18 2026-10-26 01:42:16.000000 jtreg-test-output/jdk/0/JTreport/text/fail2notrun.txt │ │ │ │ │ --rw-r--r-- 0 sbuild (999) sbuild (999) 17 2026-10-26 01:42:16.000000 jtreg-test-output/jdk/0/JTreport/text/faiL2error.txt │ │ │ │ │ --rw-r--r-- 0 sbuild (999) sbuild (999) 16 2026-10-26 01:42:16.000000 jtreg-test-output/jdk/0/JTreport/text/fail2pass.txt │ │ │ │ │ --rw-r--r-- 0 sbuild (999) sbuild (999) 19 2026-10-26 01:42:16.000000 jtreg-test-output/jdk/0/JTreport/text/fail2missing.txt │ │ │ │ │ --rw-r--r-- 0 sbuild (999) sbuild (999) 890214 2026-10-26 01:42:16.000000 jtreg-test-output/jdk/0/JTreport/text/summary.txt │ │ │ │ │ --rw-r--r-- 0 sbuild (999) sbuild (999) 529 2026-10-25 21:24:52.000000 jtreg-test-output/jdk/0/JTreport/text/cmdArgs.txt │ │ │ │ │ -lrwxrwxrwx 0 sbuild (999) sbuild (999) 0 2026-10-25 21:24:49.000000 jtreg-test-output/jaxp/JTreport -> 0/JTreport │ │ │ │ │ -drwxr-xr-x 0 sbuild (999) sbuild (999) 0 2026-10-25 21:24:47.000000 jtreg-test-output/jaxp/0/JTreport/ │ │ │ │ │ --rw-r--r-- 0 sbuild (999) sbuild (999) 700 2026-10-25 21:24:47.000000 jtreg-test-output/jaxp/0/JTreport/index.html │ │ │ │ │ --rw-r--r-- 0 sbuild (999) sbuild (999) 0 2026-10-25 21:24:47.000000 jtreg-test-output/jaxp/0/JTreport/reportdir.dat │ │ │ │ │ -drwxr-xr-x 0 sbuild (999) sbuild (999) 0 2026-10-25 21:24:46.000000 jtreg-test-output/jaxp/0/JTreport/html/ │ │ │ │ │ --rw-r--r-- 0 sbuild (999) sbuild (999) 683 2026-10-25 21:24:46.000000 jtreg-test-output/jaxp/0/JTreport/html/notRun_gr.html │ │ │ │ │ --rw-r--r-- 0 sbuild (999) sbuild (999) 561 2026-10-25 21:24:46.000000 jtreg-test-output/jaxp/0/JTreport/html/notRun.html │ │ │ │ │ --rw-r--r-- 0 sbuild (999) sbuild (999) 509 2026-10-25 21:24:46.000000 jtreg-test-output/jaxp/0/JTreport/html/error_gr.html │ │ │ │ │ --rw-r--r-- 0 sbuild (999) sbuild (999) 461 2026-10-25 21:24:46.000000 jtreg-test-output/jaxp/0/JTreport/html/error.html │ │ │ │ │ --rw-r--r-- 0 sbuild (999) sbuild (999) 501 2026-10-25 21:24:46.000000 jtreg-test-output/jaxp/0/JTreport/html/failed_gr.html │ │ │ │ │ --rw-r--r-- 0 sbuild (999) sbuild (999) 453 2026-10-25 21:24:46.000000 jtreg-test-output/jaxp/0/JTreport/html/failed.html │ │ │ │ │ --rw-r--r-- 0 sbuild (999) sbuild (999) 110050 2026-10-25 21:24:46.000000 jtreg-test-output/jaxp/0/JTreport/html/passed_gr.html │ │ │ │ │ --rw-r--r-- 0 sbuild (999) sbuild (999) 109961 2026-10-25 21:24:46.000000 jtreg-test-output/jaxp/0/JTreport/html/passed.html │ │ │ │ │ --rw-r--r-- 0 sbuild (999) sbuild (999) 3605 2026-10-25 21:24:46.000000 jtreg-test-output/jaxp/0/JTreport/html/excluded.html │ │ │ │ │ --rw-r--r-- 0 sbuild (999) sbuild (999) 4082 2026-10-25 21:24:46.000000 jtreg-test-output/jaxp/0/JTreport/html/env.html │ │ │ │ │ --rw-r--r-- 0 sbuild (999) sbuild (999) 4413 2026-10-25 21:24:46.000000 jtreg-test-output/jaxp/0/JTreport/html/config.html │ │ │ │ │ --rw-r--r-- 0 sbuild (999) sbuild (999) 307 2026-10-25 21:24:46.000000 jtreg-test-output/jaxp/0/JTreport/html/report.css │ │ │ │ │ --rw-r--r-- 0 sbuild (999) sbuild (999) 58282 2026-10-25 21:24:46.000000 jtreg-test-output/jaxp/0/JTreport/html/index.html │ │ │ │ │ --rw-r--r-- 0 sbuild (999) sbuild (999) 58282 2026-10-25 21:24:46.000000 jtreg-test-output/jaxp/0/JTreport/html/report.html │ │ │ │ │ -drwxr-xr-x 0 sbuild (999) sbuild (999) 0 2026-10-25 21:24:47.000000 jtreg-test-output/jaxp/0/JTreport/text/ │ │ │ │ │ --rw-r--r-- 0 sbuild (999) sbuild (999) 200 2026-10-25 21:24:47.000000 jtreg-test-output/jaxp/0/JTreport/text/junit.txt │ │ │ │ │ --rw-r--r-- 0 sbuild (999) sbuild (999) 69461 2026-10-25 21:24:47.000000 jtreg-test-output/jaxp/0/JTreport/text/testng.txt │ │ │ │ │ --rw-r--r-- 0 sbuild (999) sbuild (999) 116 2026-10-25 21:24:47.000000 jtreg-test-output/jaxp/0/JTreport/text/notRun.txt │ │ │ │ │ --rw-r--r-- 0 sbuild (999) sbuild (999) 65 2026-10-25 21:24:47.000000 jtreg-test-output/jaxp/0/JTreport/text/stats.txt │ │ │ │ │ --rw-r--r-- 0 sbuild (999) sbuild (999) 154 2026-10-25 21:24:47.000000 jtreg-test-output/jaxp/0/JTreport/text/timeStats.txt │ │ │ │ │ --rw-r--r-- 0 sbuild (999) sbuild (999) 21 2026-10-25 21:24:47.000000 jtreg-test-output/jaxp/0/JTreport/text/tc_newfailures.txt │ │ │ │ │ --rw-r--r-- 0 sbuild (999) sbuild (999) 21 2026-10-25 21:24:47.000000 jtreg-test-output/jaxp/0/JTreport/text/tc_fail2notrun.txt │ │ │ │ │ --rw-r--r-- 0 sbuild (999) sbuild (999) 20 2026-10-25 21:24:47.000000 jtreg-test-output/jaxp/0/JTreport/text/tc_fail2error.txt │ │ │ │ │ --rw-r--r-- 0 sbuild (999) sbuild (999) 19 2026-10-25 21:24:47.000000 jtreg-test-output/jaxp/0/JTreport/text/tc_fail2pass.txt │ │ │ │ │ --rw-r--r-- 0 sbuild (999) sbuild (999) 22 2026-10-25 21:24:47.000000 jtreg-test-output/jaxp/0/JTreport/text/tc_fail2missing.txt │ │ │ │ │ --rw-r--r-- 0 sbuild (999) sbuild (999) 19 2026-10-25 21:24:47.000000 jtreg-test-output/jaxp/0/JTreport/text/other_errors.txt │ │ │ │ │ --rw-r--r-- 0 sbuild (999) sbuild (999) 18 2026-10-25 21:24:47.000000 jtreg-test-output/jaxp/0/JTreport/text/newfailures.txt │ │ │ │ │ --rw-r--r-- 0 sbuild (999) sbuild (999) 16 2026-10-25 21:24:47.000000 jtreg-test-output/jaxp/0/JTreport/text/fail2fail.txt │ │ │ │ │ --rw-r--r-- 0 sbuild (999) sbuild (999) 18 2026-10-25 21:24:47.000000 jtreg-test-output/jaxp/0/JTreport/text/fail2notrun.txt │ │ │ │ │ --rw-r--r-- 0 sbuild (999) sbuild (999) 17 2026-10-25 21:24:47.000000 jtreg-test-output/jaxp/0/JTreport/text/faiL2error.txt │ │ │ │ │ --rw-r--r-- 0 sbuild (999) sbuild (999) 16 2026-10-25 21:24:47.000000 jtreg-test-output/jaxp/0/JTreport/text/fail2pass.txt │ │ │ │ │ --rw-r--r-- 0 sbuild (999) sbuild (999) 19 2026-10-25 21:24:47.000000 jtreg-test-output/jaxp/0/JTreport/text/fail2missing.txt │ │ │ │ │ --rw-r--r-- 0 sbuild (999) sbuild (999) 59118 2026-10-25 21:24:46.000000 jtreg-test-output/jaxp/0/JTreport/text/summary.txt │ │ │ │ │ --rw-r--r-- 0 sbuild (999) sbuild (999) 439 2026-10-25 21:03:52.000000 jtreg-test-output/jaxp/0/JTreport/text/cmdArgs.txt │ │ │ │ │ -lrwxrwxrwx 0 sbuild (999) sbuild (999) 0 2026-10-25 21:03:51.000000 jtreg-test-output/langtools/JTreport -> 0/JTreport │ │ │ │ │ -drwxr-xr-x 0 sbuild (999) sbuild (999) 0 2026-10-25 21:03:36.000000 jtreg-test-output/langtools/0/JTreport/ │ │ │ │ │ --rw-r--r-- 0 sbuild (999) sbuild (999) 710 2026-10-25 21:03:36.000000 jtreg-test-output/langtools/0/JTreport/index.html │ │ │ │ │ --rw-r--r-- 0 sbuild (999) sbuild (999) 0 2026-10-25 21:03:36.000000 jtreg-test-output/langtools/0/JTreport/reportdir.dat │ │ │ │ │ -drwxr-xr-x 0 sbuild (999) sbuild (999) 0 2026-10-25 21:03:36.000000 jtreg-test-output/langtools/0/JTreport/html/ │ │ │ │ │ --rw-r--r-- 0 sbuild (999) sbuild (999) 2451 2026-10-25 21:03:36.000000 jtreg-test-output/langtools/0/JTreport/html/notRun_gr.html │ │ │ │ │ --rw-r--r-- 0 sbuild (999) sbuild (999) 2162 2026-10-25 21:03:36.000000 jtreg-test-output/langtools/0/JTreport/html/notRun.html │ │ │ │ │ --rw-r--r-- 0 sbuild (999) sbuild (999) 509 2026-10-25 21:03:36.000000 jtreg-test-output/langtools/0/JTreport/html/error_gr.html │ │ │ │ │ --rw-r--r-- 0 sbuild (999) sbuild (999) 461 2026-10-25 21:03:36.000000 jtreg-test-output/langtools/0/JTreport/html/error.html │ │ │ │ │ --rw-r--r-- 0 sbuild (999) sbuild (999) 501 2026-10-25 21:03:36.000000 jtreg-test-output/langtools/0/JTreport/html/failed_gr.html │ │ │ │ │ --rw-r--r-- 0 sbuild (999) sbuild (999) 453 2026-10-25 21:03:36.000000 jtreg-test-output/langtools/0/JTreport/html/failed.html │ │ │ │ │ --rw-r--r-- 0 sbuild (999) sbuild (999) 885660 2026-10-25 21:03:36.000000 jtreg-test-output/langtools/0/JTreport/html/passed_gr.html │ │ │ │ │ --rw-r--r-- 0 sbuild (999) sbuild (999) 885335 2026-10-25 21:03:35.000000 jtreg-test-output/langtools/0/JTreport/html/passed.html │ │ │ │ │ --rw-r--r-- 0 sbuild (999) sbuild (999) 6158 2026-10-25 21:03:35.000000 jtreg-test-output/langtools/0/JTreport/html/excluded.html │ │ │ │ │ --rw-r--r-- 0 sbuild (999) sbuild (999) 4097 2026-10-25 21:03:35.000000 jtreg-test-output/langtools/0/JTreport/html/env.html │ │ │ │ │ --rw-r--r-- 0 sbuild (999) sbuild (999) 10773 2026-10-25 21:03:35.000000 jtreg-test-output/langtools/0/JTreport/html/config.html │ │ │ │ │ --rw-r--r-- 0 sbuild (999) sbuild (999) 307 2026-10-25 21:03:35.000000 jtreg-test-output/langtools/0/JTreport/html/report.css │ │ │ │ │ --rw-r--r-- 0 sbuild (999) sbuild (999) 541677 2026-10-25 21:03:35.000000 jtreg-test-output/langtools/0/JTreport/html/index.html │ │ │ │ │ --rw-r--r-- 0 sbuild (999) sbuild (999) 541677 2026-10-25 21:03:35.000000 jtreg-test-output/langtools/0/JTreport/html/report.html │ │ │ │ │ -drwxr-xr-x 0 sbuild (999) sbuild (999) 0 2026-10-25 21:03:36.000000 jtreg-test-output/langtools/0/JTreport/text/ │ │ │ │ │ --rw-r--r-- 0 sbuild (999) sbuild (999) 18737 2026-10-25 21:03:36.000000 jtreg-test-output/langtools/0/JTreport/text/junit.txt │ │ │ │ │ --rw-r--r-- 0 sbuild (999) sbuild (999) 9538 2026-10-25 21:03:36.000000 jtreg-test-output/langtools/0/JTreport/text/testng.txt │ │ │ │ │ --rw-r--r-- 0 sbuild (999) sbuild (999) 1921 2026-10-25 21:03:36.000000 jtreg-test-output/langtools/0/JTreport/text/notRun.txt │ │ │ │ │ --rw-r--r-- 0 sbuild (999) sbuild (999) 120 2026-10-25 21:03:36.000000 jtreg-test-output/langtools/0/JTreport/text/stats.txt │ │ │ │ │ --rw-r--r-- 0 sbuild (999) sbuild (999) 466 2026-10-25 21:03:36.000000 jtreg-test-output/langtools/0/JTreport/text/timeStats.txt │ │ │ │ │ --rw-r--r-- 0 sbuild (999) sbuild (999) 21 2026-10-25 21:03:36.000000 jtreg-test-output/langtools/0/JTreport/text/tc_newfailures.txt │ │ │ │ │ --rw-r--r-- 0 sbuild (999) sbuild (999) 21 2026-10-25 21:03:36.000000 jtreg-test-output/langtools/0/JTreport/text/tc_fail2notrun.txt │ │ │ │ │ --rw-r--r-- 0 sbuild (999) sbuild (999) 20 2026-10-25 21:03:36.000000 jtreg-test-output/langtools/0/JTreport/text/tc_fail2error.txt │ │ │ │ │ --rw-r--r-- 0 sbuild (999) sbuild (999) 19 2026-10-25 21:03:36.000000 jtreg-test-output/langtools/0/JTreport/text/tc_fail2pass.txt │ │ │ │ │ --rw-r--r-- 0 sbuild (999) sbuild (999) 22 2026-10-25 21:03:36.000000 jtreg-test-output/langtools/0/JTreport/text/tc_fail2missing.txt │ │ │ │ │ --rw-r--r-- 0 sbuild (999) sbuild (999) 19 2026-10-25 21:03:36.000000 jtreg-test-output/langtools/0/JTreport/text/other_errors.txt │ │ │ │ │ --rw-r--r-- 0 sbuild (999) sbuild (999) 18 2026-10-25 21:03:36.000000 jtreg-test-output/langtools/0/JTreport/text/newfailures.txt │ │ │ │ │ --rw-r--r-- 0 sbuild (999) sbuild (999) 16 2026-10-25 21:03:36.000000 jtreg-test-output/langtools/0/JTreport/text/fail2fail.txt │ │ │ │ │ --rw-r--r-- 0 sbuild (999) sbuild (999) 18 2026-10-25 21:03:36.000000 jtreg-test-output/langtools/0/JTreport/text/fail2notrun.txt │ │ │ │ │ --rw-r--r-- 0 sbuild (999) sbuild (999) 17 2026-10-25 21:03:36.000000 jtreg-test-output/langtools/0/JTreport/text/faiL2error.txt │ │ │ │ │ --rw-r--r-- 0 sbuild (999) sbuild (999) 16 2026-10-25 21:03:36.000000 jtreg-test-output/langtools/0/JTreport/text/fail2pass.txt │ │ │ │ │ --rw-r--r-- 0 sbuild (999) sbuild (999) 19 2026-10-25 21:03:36.000000 jtreg-test-output/langtools/0/JTreport/text/fail2missing.txt │ │ │ │ │ --rw-r--r-- 0 sbuild (999) sbuild (999) 643764 2026-10-25 21:03:36.000000 jtreg-test-output/langtools/0/JTreport/text/summary.txt │ │ │ │ │ --rw-r--r-- 0 sbuild (999) sbuild (999) 454 2026-10-25 19:59:46.000000 jtreg-test-output/langtools/0/JTreport/text/cmdArgs.txt │ │ │ │ │ -lrwxrwxrwx 0 sbuild (999) sbuild (999) 0 2026-10-25 19:59:45.000000 jtreg-test-output/hotspot/JTreport -> 0/JTreport │ │ │ │ │ -drwxr-xr-x 0 sbuild (999) sbuild (999) 0 2026-10-25 19:59:33.000000 jtreg-test-output/hotspot/0/JTreport/ │ │ │ │ │ --rw-r--r-- 0 sbuild (999) sbuild (999) 712 2026-10-25 19:59:33.000000 jtreg-test-output/hotspot/0/JTreport/index.html │ │ │ │ │ --rw-r--r-- 0 sbuild (999) sbuild (999) 0 2026-10-25 19:59:33.000000 jtreg-test-output/hotspot/0/JTreport/reportdir.dat │ │ │ │ │ -drwxr-xr-x 0 sbuild (999) sbuild (999) 0 2026-10-25 19:59:33.000000 jtreg-test-output/hotspot/0/JTreport/html/ │ │ │ │ │ --rw-r--r-- 0 sbuild (999) sbuild (999) 38192 2026-10-25 19:59:33.000000 jtreg-test-output/hotspot/0/JTreport/html/notRun_gr.html │ │ │ │ │ --rw-r--r-- 0 sbuild (999) sbuild (999) 37903 2026-10-25 19:59:33.000000 jtreg-test-output/hotspot/0/JTreport/html/notRun.html │ │ │ │ │ --rw-r--r-- 0 sbuild (999) sbuild (999) 509 2026-10-25 19:59:33.000000 jtreg-test-output/hotspot/0/JTreport/html/error_gr.html │ │ │ │ │ --rw-r--r-- 0 sbuild (999) sbuild (999) 461 2026-10-25 19:59:33.000000 jtreg-test-output/hotspot/0/JTreport/html/error.html │ │ │ │ │ --rw-r--r-- 0 sbuild (999) sbuild (999) 501 2026-10-25 19:59:33.000000 jtreg-test-output/hotspot/0/JTreport/html/failed_gr.html │ │ │ │ │ --rw-r--r-- 0 sbuild (999) sbuild (999) 453 2026-10-25 19:59:33.000000 jtreg-test-output/hotspot/0/JTreport/html/failed.html │ │ │ │ │ --rw-r--r-- 0 sbuild (999) sbuild (999) 631550 2026-10-25 19:59:33.000000 jtreg-test-output/hotspot/0/JTreport/html/passed_gr.html │ │ │ │ │ --rw-r--r-- 0 sbuild (999) sbuild (999) 631121 2026-10-25 19:59:33.000000 jtreg-test-output/hotspot/0/JTreport/html/passed.html │ │ │ │ │ --rw-r--r-- 0 sbuild (999) sbuild (999) 18287 2026-10-25 19:59:33.000000 jtreg-test-output/hotspot/0/JTreport/html/excluded.html │ │ │ │ │ --rw-r--r-- 0 sbuild (999) sbuild (999) 4194 2026-10-25 19:59:33.000000 jtreg-test-output/hotspot/0/JTreport/html/env.html │ │ │ │ │ --rw-r--r-- 0 sbuild (999) sbuild (999) 78247 2026-10-25 19:59:33.000000 jtreg-test-output/hotspot/0/JTreport/html/config.html │ │ │ │ │ --rw-r--r-- 0 sbuild (999) sbuild (999) 307 2026-10-25 19:59:33.000000 jtreg-test-output/hotspot/0/JTreport/html/report.css │ │ │ │ │ --rw-r--r-- 0 sbuild (999) sbuild (999) 526702 2026-10-25 19:59:33.000000 jtreg-test-output/hotspot/0/JTreport/html/index.html │ │ │ │ │ --rw-r--r-- 0 sbuild (999) sbuild (999) 526702 2026-10-25 19:59:33.000000 jtreg-test-output/hotspot/0/JTreport/html/report.html │ │ │ │ │ -drwxr-xr-x 0 sbuild (999) sbuild (999) 0 2026-10-25 19:59:33.000000 jtreg-test-output/hotspot/0/JTreport/text/ │ │ │ │ │ --rw-r--r-- 0 sbuild (999) sbuild (999) 9713 2026-10-25 19:59:33.000000 jtreg-test-output/hotspot/0/JTreport/text/junit.txt │ │ │ │ │ --rw-r--r-- 0 sbuild (999) sbuild (999) 9190 2026-10-25 19:59:33.000000 jtreg-test-output/hotspot/0/JTreport/text/testng.txt │ │ │ │ │ --rw-r--r-- 0 sbuild (999) sbuild (999) 50907 2026-10-25 19:59:33.000000 jtreg-test-output/hotspot/0/JTreport/text/notRun.txt │ │ │ │ │ --rw-r--r-- 0 sbuild (999) sbuild (999) 123 2026-10-25 19:59:33.000000 jtreg-test-output/hotspot/0/JTreport/text/stats.txt │ │ │ │ │ --rw-r--r-- 0 sbuild (999) sbuild (999) 886 2026-10-25 19:59:33.000000 jtreg-test-output/hotspot/0/JTreport/text/timeStats.txt │ │ │ │ │ --rw-r--r-- 0 sbuild (999) sbuild (999) 21 2026-10-25 19:59:33.000000 jtreg-test-output/hotspot/0/JTreport/text/tc_newfailures.txt │ │ │ │ │ --rw-r--r-- 0 sbuild (999) sbuild (999) 21 2026-10-25 19:59:33.000000 jtreg-test-output/hotspot/0/JTreport/text/tc_fail2notrun.txt │ │ │ │ │ --rw-r--r-- 0 sbuild (999) sbuild (999) 20 2026-10-25 19:59:33.000000 jtreg-test-output/hotspot/0/JTreport/text/tc_fail2error.txt │ │ │ │ │ --rw-r--r-- 0 sbuild (999) sbuild (999) 19 2026-10-25 19:59:33.000000 jtreg-test-output/hotspot/0/JTreport/text/tc_fail2pass.txt │ │ │ │ │ --rw-r--r-- 0 sbuild (999) sbuild (999) 22 2026-10-25 19:59:33.000000 jtreg-test-output/hotspot/0/JTreport/text/tc_fail2missing.txt │ │ │ │ │ --rw-r--r-- 0 sbuild (999) sbuild (999) 19 2026-10-25 19:59:33.000000 jtreg-test-output/hotspot/0/JTreport/text/other_errors.txt │ │ │ │ │ --rw-r--r-- 0 sbuild (999) sbuild (999) 18 2026-10-25 19:59:33.000000 jtreg-test-output/hotspot/0/JTreport/text/newfailures.txt │ │ │ │ │ --rw-r--r-- 0 sbuild (999) sbuild (999) 16 2026-10-25 19:59:33.000000 jtreg-test-output/hotspot/0/JTreport/text/fail2fail.txt │ │ │ │ │ --rw-r--r-- 0 sbuild (999) sbuild (999) 18 2026-10-25 19:59:33.000000 jtreg-test-output/hotspot/0/JTreport/text/fail2notrun.txt │ │ │ │ │ --rw-r--r-- 0 sbuild (999) sbuild (999) 17 2026-10-25 19:59:33.000000 jtreg-test-output/hotspot/0/JTreport/text/faiL2error.txt │ │ │ │ │ --rw-r--r-- 0 sbuild (999) sbuild (999) 16 2026-10-25 19:59:33.000000 jtreg-test-output/hotspot/0/JTreport/text/fail2pass.txt │ │ │ │ │ --rw-r--r-- 0 sbuild (999) sbuild (999) 19 2026-10-25 19:59:33.000000 jtreg-test-output/hotspot/0/JTreport/text/fail2missing.txt │ │ │ │ │ --rw-r--r-- 0 sbuild (999) sbuild (999) 475555 2026-10-25 19:59:33.000000 jtreg-test-output/hotspot/0/JTreport/text/summary.txt │ │ │ │ │ --rw-r--r-- 0 sbuild (999) sbuild (999) 551 2026-10-25 16:52:21.000000 jtreg-test-output/hotspot/0/JTreport/text/cmdArgs.txt │ │ │ │ │ +drwxr-xr-x 0 sbuild (996) sbuild (996) 0 2026-10-30 12:27:57.000000 jtreg-test-output/jdk/1/JTreport/ │ │ │ │ │ +-rw-r--r-- 0 sbuild (996) sbuild (996) 698 2026-10-30 12:27:57.000000 jtreg-test-output/jdk/1/JTreport/index.html │ │ │ │ │ +drwxr-xr-x 0 sbuild (996) sbuild (996) 0 2026-10-30 12:27:57.000000 jtreg-test-output/jdk/1/JTreport/html/ │ │ │ │ │ +-rw-r--r-- 0 sbuild (996) sbuild (996) 762496 2026-10-30 12:27:57.000000 jtreg-test-output/jdk/1/JTreport/html/notRun.html │ │ │ │ │ +-rw-r--r-- 0 sbuild (996) sbuild (996) 1100893 2026-10-30 12:27:57.000000 jtreg-test-output/jdk/1/JTreport/html/report.html │ │ │ │ │ +-rw-r--r-- 0 sbuild (996) sbuild (996) 83138 2026-10-30 12:27:57.000000 jtreg-test-output/jdk/1/JTreport/html/excluded.html │ │ │ │ │ +-rw-r--r-- 0 sbuild (996) sbuild (996) 462 2026-10-30 12:27:57.000000 jtreg-test-output/jdk/1/JTreport/html/error.html │ │ │ │ │ +-rw-r--r-- 0 sbuild (996) sbuild (996) 510 2026-10-30 12:27:57.000000 jtreg-test-output/jdk/1/JTreport/html/error_gr.html │ │ │ │ │ +-rw-r--r-- 0 sbuild (996) sbuild (996) 1100893 2026-10-30 12:27:57.000000 jtreg-test-output/jdk/1/JTreport/html/index.html │ │ │ │ │ +-rw-r--r-- 0 sbuild (996) sbuild (996) 1251662 2026-10-30 12:27:57.000000 jtreg-test-output/jdk/1/JTreport/html/passed_gr.html │ │ │ │ │ +-rw-r--r-- 0 sbuild (996) sbuild (996) 2739 2026-10-30 12:27:57.000000 jtreg-test-output/jdk/1/JTreport/html/failed_gr.html │ │ │ │ │ +-rw-r--r-- 0 sbuild (996) sbuild (996) 2009 2026-10-30 12:27:57.000000 jtreg-test-output/jdk/1/JTreport/html/failed.html │ │ │ │ │ +-rw-r--r-- 0 sbuild (996) sbuild (996) 4198 2026-10-30 12:27:57.000000 jtreg-test-output/jdk/1/JTreport/html/env.html │ │ │ │ │ +-rw-r--r-- 0 sbuild (996) sbuild (996) 762769 2026-10-30 12:27:57.000000 jtreg-test-output/jdk/1/JTreport/html/notRun_gr.html │ │ │ │ │ +-rw-r--r-- 0 sbuild (996) sbuild (996) 307 2026-10-30 12:27:56.000000 jtreg-test-output/jdk/1/JTreport/html/report.css │ │ │ │ │ +-rw-r--r-- 0 sbuild (996) sbuild (996) 24346 2026-10-30 12:27:57.000000 jtreg-test-output/jdk/1/JTreport/html/config.html │ │ │ │ │ +-rw-r--r-- 0 sbuild (996) sbuild (996) 1250420 2026-10-30 12:27:57.000000 jtreg-test-output/jdk/1/JTreport/html/passed.html │ │ │ │ │ +drwxr-xr-x 0 sbuild (996) sbuild (996) 0 2026-10-30 12:27:57.000000 jtreg-test-output/jdk/1/JTreport/text/ │ │ │ │ │ +-rw-r--r-- 0 sbuild (996) sbuild (996) 890233 2026-10-30 12:27:57.000000 jtreg-test-output/jdk/1/JTreport/text/summary.txt │ │ │ │ │ +-rw-r--r-- 0 sbuild (996) sbuild (996) 20 2026-10-30 12:27:57.000000 jtreg-test-output/jdk/1/JTreport/text/tc_fail2error.txt │ │ │ │ │ +-rw-r--r-- 0 sbuild (996) sbuild (996) 19 2026-10-30 12:27:57.000000 jtreg-test-output/jdk/1/JTreport/text/tc_fail2pass.txt │ │ │ │ │ +-rw-r--r-- 0 sbuild (996) sbuild (996) 129 2026-10-30 12:27:57.000000 jtreg-test-output/jdk/1/JTreport/text/timeStats.txt │ │ │ │ │ +-rw-r--r-- 0 sbuild (996) sbuild (996) 21 2026-10-30 12:27:57.000000 jtreg-test-output/jdk/1/JTreport/text/tc_fail2notrun.txt │ │ │ │ │ +-rw-r--r-- 0 sbuild (996) sbuild (996) 19 2026-10-30 12:27:57.000000 jtreg-test-output/jdk/1/JTreport/text/fail2missing.txt │ │ │ │ │ +-rw-r--r-- 0 sbuild (996) sbuild (996) 16 2026-10-30 12:27:57.000000 jtreg-test-output/jdk/1/JTreport/text/fail2fail.txt │ │ │ │ │ +-rw-r--r-- 0 sbuild (996) sbuild (996) 22 2026-10-30 12:27:57.000000 jtreg-test-output/jdk/1/JTreport/text/tc_fail2missing.txt │ │ │ │ │ +-rw-r--r-- 0 sbuild (996) sbuild (996) 16 2026-10-30 12:27:57.000000 jtreg-test-output/jdk/1/JTreport/text/fail2pass.txt │ │ │ │ │ +-rw-r--r-- 0 sbuild (996) sbuild (996) 19 2026-10-30 12:27:57.000000 jtreg-test-output/jdk/1/JTreport/text/other_errors.txt │ │ │ │ │ +-rw-r--r-- 0 sbuild (996) sbuild (996) 17 2026-10-30 12:27:57.000000 jtreg-test-output/jdk/1/JTreport/text/faiL2error.txt │ │ │ │ │ +-rw-r--r-- 0 sbuild (996) sbuild (996) 21 2026-10-30 12:27:57.000000 jtreg-test-output/jdk/1/JTreport/text/tc_newfailures.txt │ │ │ │ │ +-rw-r--r-- 0 sbuild (996) sbuild (996) 101 2026-10-30 12:27:57.000000 jtreg-test-output/jdk/1/JTreport/text/stats.txt │ │ │ │ │ +-rw-r--r-- 0 sbuild (996) sbuild (996) 548 2026-10-30 12:27:30.000000 jtreg-test-output/jdk/1/JTreport/text/cmdArgs.txt │ │ │ │ │ +-rw-r--r-- 0 sbuild (996) sbuild (996) 416 2026-10-30 12:27:57.000000 jtreg-test-output/jdk/1/JTreport/text/newfailures.txt │ │ │ │ │ +-rw-r--r-- 0 sbuild (996) sbuild (996) 132 2026-10-30 12:27:57.000000 jtreg-test-output/jdk/1/JTreport/text/testng.txt │ │ │ │ │ +-rw-r--r-- 0 sbuild (996) sbuild (996) 1023561 2026-10-30 12:27:57.000000 jtreg-test-output/jdk/1/JTreport/text/notRun.txt │ │ │ │ │ +-rw-r--r-- 0 sbuild (996) sbuild (996) 18 2026-10-30 12:27:57.000000 jtreg-test-output/jdk/1/JTreport/text/fail2notrun.txt │ │ │ │ │ +-rw-r--r-- 0 sbuild (996) sbuild (996) 0 2026-10-30 12:27:57.000000 jtreg-test-output/jdk/1/JTreport/reportdir.dat │ │ │ │ │ +drwxr-xr-x 0 sbuild (996) sbuild (996) 0 2026-10-30 12:27:00.000000 jtreg-test-output/jdk/0/JTreport/ │ │ │ │ │ +-rw-r--r-- 0 sbuild (996) sbuild (996) 698 2026-10-30 12:27:00.000000 jtreg-test-output/jdk/0/JTreport/index.html │ │ │ │ │ +drwxr-xr-x 0 sbuild (996) sbuild (996) 0 2026-10-30 12:27:00.000000 jtreg-test-output/jdk/0/JTreport/html/ │ │ │ │ │ +-rw-r--r-- 0 sbuild (996) sbuild (996) 20328 2026-10-30 12:27:00.000000 jtreg-test-output/jdk/0/JTreport/html/notRun.html │ │ │ │ │ +-rw-r--r-- 0 sbuild (996) sbuild (996) 1123551 2026-10-30 12:27:00.000000 jtreg-test-output/jdk/0/JTreport/html/report.html │ │ │ │ │ +-rw-r--r-- 0 sbuild (996) sbuild (996) 83138 2026-10-30 12:27:00.000000 jtreg-test-output/jdk/0/JTreport/html/excluded.html │ │ │ │ │ +-rw-r--r-- 0 sbuild (996) sbuild (996) 462 2026-10-30 12:27:00.000000 jtreg-test-output/jdk/0/JTreport/html/error.html │ │ │ │ │ +-rw-r--r-- 0 sbuild (996) sbuild (996) 510 2026-10-30 12:27:00.000000 jtreg-test-output/jdk/0/JTreport/html/error_gr.html │ │ │ │ │ +-rw-r--r-- 0 sbuild (996) sbuild (996) 1123551 2026-10-30 12:27:00.000000 jtreg-test-output/jdk/0/JTreport/html/index.html │ │ │ │ │ +-rw-r--r-- 0 sbuild (996) sbuild (996) 1251662 2026-10-30 12:27:00.000000 jtreg-test-output/jdk/0/JTreport/html/passed_gr.html │ │ │ │ │ +-rw-r--r-- 0 sbuild (996) sbuild (996) 2739 2026-10-30 12:27:00.000000 jtreg-test-output/jdk/0/JTreport/html/failed_gr.html │ │ │ │ │ +-rw-r--r-- 0 sbuild (996) sbuild (996) 2009 2026-10-30 12:27:00.000000 jtreg-test-output/jdk/0/JTreport/html/failed.html │ │ │ │ │ +-rw-r--r-- 0 sbuild (996) sbuild (996) 4179 2026-10-30 12:27:00.000000 jtreg-test-output/jdk/0/JTreport/html/env.html │ │ │ │ │ +-rw-r--r-- 0 sbuild (996) sbuild (996) 20673 2026-10-30 12:27:00.000000 jtreg-test-output/jdk/0/JTreport/html/notRun_gr.html │ │ │ │ │ +-rw-r--r-- 0 sbuild (996) sbuild (996) 307 2026-10-30 12:26:59.000000 jtreg-test-output/jdk/0/JTreport/html/report.css │ │ │ │ │ +-rw-r--r-- 0 sbuild (996) sbuild (996) 23914 2026-10-30 12:27:00.000000 jtreg-test-output/jdk/0/JTreport/html/config.html │ │ │ │ │ +-rw-r--r-- 0 sbuild (996) sbuild (996) 1250420 2026-10-30 12:27:00.000000 jtreg-test-output/jdk/0/JTreport/html/passed.html │ │ │ │ │ +drwxr-xr-x 0 sbuild (996) sbuild (996) 0 2026-10-30 12:27:00.000000 jtreg-test-output/jdk/0/JTreport/text/ │ │ │ │ │ +-rw-r--r-- 0 sbuild (996) sbuild (996) 890233 2026-10-30 12:27:00.000000 jtreg-test-output/jdk/0/JTreport/text/summary.txt │ │ │ │ │ +-rw-r--r-- 0 sbuild (996) sbuild (996) 20 2026-10-30 12:27:00.000000 jtreg-test-output/jdk/0/JTreport/text/tc_fail2error.txt │ │ │ │ │ +-rw-r--r-- 0 sbuild (996) sbuild (996) 19 2026-10-30 12:27:00.000000 jtreg-test-output/jdk/0/JTreport/text/tc_fail2pass.txt │ │ │ │ │ +-rw-r--r-- 0 sbuild (996) sbuild (996) 1007 2026-10-30 12:27:00.000000 jtreg-test-output/jdk/0/JTreport/text/timeStats.txt │ │ │ │ │ +-rw-r--r-- 0 sbuild (996) sbuild (996) 21 2026-10-30 12:27:00.000000 jtreg-test-output/jdk/0/JTreport/text/tc_fail2notrun.txt │ │ │ │ │ +-rw-r--r-- 0 sbuild (996) sbuild (996) 19 2026-10-30 12:27:00.000000 jtreg-test-output/jdk/0/JTreport/text/fail2missing.txt │ │ │ │ │ +-rw-r--r-- 0 sbuild (996) sbuild (996) 16 2026-10-30 12:27:00.000000 jtreg-test-output/jdk/0/JTreport/text/fail2fail.txt │ │ │ │ │ +-rw-r--r-- 0 sbuild (996) sbuild (996) 22 2026-10-30 12:27:00.000000 jtreg-test-output/jdk/0/JTreport/text/tc_fail2missing.txt │ │ │ │ │ +-rw-r--r-- 0 sbuild (996) sbuild (996) 16 2026-10-30 12:27:00.000000 jtreg-test-output/jdk/0/JTreport/text/fail2pass.txt │ │ │ │ │ +-rw-r--r-- 0 sbuild (996) sbuild (996) 19 2026-10-30 12:27:00.000000 jtreg-test-output/jdk/0/JTreport/text/other_errors.txt │ │ │ │ │ +-rw-r--r-- 0 sbuild (996) sbuild (996) 17 2026-10-30 12:27:00.000000 jtreg-test-output/jdk/0/JTreport/text/faiL2error.txt │ │ │ │ │ +-rw-r--r-- 0 sbuild (996) sbuild (996) 21 2026-10-30 12:27:00.000000 jtreg-test-output/jdk/0/JTreport/text/tc_newfailures.txt │ │ │ │ │ +-rw-r--r-- 0 sbuild (996) sbuild (996) 172 2026-10-30 12:27:00.000000 jtreg-test-output/jdk/0/JTreport/text/stats.txt │ │ │ │ │ +-rw-r--r-- 0 sbuild (996) sbuild (996) 529 2026-10-30 07:45:19.000000 jtreg-test-output/jdk/0/JTreport/text/cmdArgs.txt │ │ │ │ │ +-rw-r--r-- 0 sbuild (996) sbuild (996) 416 2026-10-30 12:27:00.000000 jtreg-test-output/jdk/0/JTreport/text/newfailures.txt │ │ │ │ │ +-rw-r--r-- 0 sbuild (996) sbuild (996) 131917 2026-10-30 12:27:00.000000 jtreg-test-output/jdk/0/JTreport/text/testng.txt │ │ │ │ │ +-rw-r--r-- 0 sbuild (996) sbuild (996) 26283 2026-10-30 12:27:00.000000 jtreg-test-output/jdk/0/JTreport/text/notRun.txt │ │ │ │ │ +-rw-r--r-- 0 sbuild (996) sbuild (996) 86012 2026-10-30 12:27:00.000000 jtreg-test-output/jdk/0/JTreport/text/junit.txt │ │ │ │ │ +-rw-r--r-- 0 sbuild (996) sbuild (996) 18 2026-10-30 12:27:00.000000 jtreg-test-output/jdk/0/JTreport/text/fail2notrun.txt │ │ │ │ │ +-rw-r--r-- 0 sbuild (996) sbuild (996) 0 2026-10-30 12:27:00.000000 jtreg-test-output/jdk/0/JTreport/reportdir.dat │ │ │ │ │ +drwxr-xr-x 0 sbuild (996) sbuild (996) 0 2026-10-30 12:28:31.000000 jtreg-test-output/jdk/2/JTreport/ │ │ │ │ │ +-rw-r--r-- 0 sbuild (996) sbuild (996) 698 2026-10-30 12:28:31.000000 jtreg-test-output/jdk/2/JTreport/index.html │ │ │ │ │ +drwxr-xr-x 0 sbuild (996) sbuild (996) 0 2026-10-30 12:28:31.000000 jtreg-test-output/jdk/2/JTreport/html/ │ │ │ │ │ +-rw-r--r-- 0 sbuild (996) sbuild (996) 762496 2026-10-30 12:28:31.000000 jtreg-test-output/jdk/2/JTreport/html/notRun.html │ │ │ │ │ +-rw-r--r-- 0 sbuild (996) sbuild (996) 1100893 2026-10-30 12:28:31.000000 jtreg-test-output/jdk/2/JTreport/html/report.html │ │ │ │ │ +-rw-r--r-- 0 sbuild (996) sbuild (996) 83138 2026-10-30 12:28:31.000000 jtreg-test-output/jdk/2/JTreport/html/excluded.html │ │ │ │ │ +-rw-r--r-- 0 sbuild (996) sbuild (996) 462 2026-10-30 12:28:31.000000 jtreg-test-output/jdk/2/JTreport/html/error.html │ │ │ │ │ +-rw-r--r-- 0 sbuild (996) sbuild (996) 510 2026-10-30 12:28:31.000000 jtreg-test-output/jdk/2/JTreport/html/error_gr.html │ │ │ │ │ +-rw-r--r-- 0 sbuild (996) sbuild (996) 1100893 2026-10-30 12:28:31.000000 jtreg-test-output/jdk/2/JTreport/html/index.html │ │ │ │ │ +-rw-r--r-- 0 sbuild (996) sbuild (996) 1251662 2026-10-30 12:28:31.000000 jtreg-test-output/jdk/2/JTreport/html/passed_gr.html │ │ │ │ │ +-rw-r--r-- 0 sbuild (996) sbuild (996) 2739 2026-10-30 12:28:31.000000 jtreg-test-output/jdk/2/JTreport/html/failed_gr.html │ │ │ │ │ +-rw-r--r-- 0 sbuild (996) sbuild (996) 2009 2026-10-30 12:28:31.000000 jtreg-test-output/jdk/2/JTreport/html/failed.html │ │ │ │ │ +-rw-r--r-- 0 sbuild (996) sbuild (996) 4198 2026-10-30 12:28:31.000000 jtreg-test-output/jdk/2/JTreport/html/env.html │ │ │ │ │ +-rw-r--r-- 0 sbuild (996) sbuild (996) 762769 2026-10-30 12:28:31.000000 jtreg-test-output/jdk/2/JTreport/html/notRun_gr.html │ │ │ │ │ +-rw-r--r-- 0 sbuild (996) sbuild (996) 307 2026-10-30 12:28:30.000000 jtreg-test-output/jdk/2/JTreport/html/report.css │ │ │ │ │ +-rw-r--r-- 0 sbuild (996) sbuild (996) 24346 2026-10-30 12:28:31.000000 jtreg-test-output/jdk/2/JTreport/html/config.html │ │ │ │ │ +-rw-r--r-- 0 sbuild (996) sbuild (996) 1250420 2026-10-30 12:28:31.000000 jtreg-test-output/jdk/2/JTreport/html/passed.html │ │ │ │ │ +drwxr-xr-x 0 sbuild (996) sbuild (996) 0 2026-10-30 12:28:31.000000 jtreg-test-output/jdk/2/JTreport/text/ │ │ │ │ │ +-rw-r--r-- 0 sbuild (996) sbuild (996) 890233 2026-10-30 12:28:31.000000 jtreg-test-output/jdk/2/JTreport/text/summary.txt │ │ │ │ │ +-rw-r--r-- 0 sbuild (996) sbuild (996) 20 2026-10-30 12:28:31.000000 jtreg-test-output/jdk/2/JTreport/text/tc_fail2error.txt │ │ │ │ │ +-rw-r--r-- 0 sbuild (996) sbuild (996) 19 2026-10-30 12:28:31.000000 jtreg-test-output/jdk/2/JTreport/text/tc_fail2pass.txt │ │ │ │ │ +-rw-r--r-- 0 sbuild (996) sbuild (996) 128 2026-10-30 12:28:31.000000 jtreg-test-output/jdk/2/JTreport/text/timeStats.txt │ │ │ │ │ +-rw-r--r-- 0 sbuild (996) sbuild (996) 21 2026-10-30 12:28:31.000000 jtreg-test-output/jdk/2/JTreport/text/tc_fail2notrun.txt │ │ │ │ │ +-rw-r--r-- 0 sbuild (996) sbuild (996) 19 2026-10-30 12:28:31.000000 jtreg-test-output/jdk/2/JTreport/text/fail2missing.txt │ │ │ │ │ +-rw-r--r-- 0 sbuild (996) sbuild (996) 16 2026-10-30 12:28:31.000000 jtreg-test-output/jdk/2/JTreport/text/fail2fail.txt │ │ │ │ │ +-rw-r--r-- 0 sbuild (996) sbuild (996) 22 2026-10-30 12:28:31.000000 jtreg-test-output/jdk/2/JTreport/text/tc_fail2missing.txt │ │ │ │ │ +-rw-r--r-- 0 sbuild (996) sbuild (996) 16 2026-10-30 12:28:31.000000 jtreg-test-output/jdk/2/JTreport/text/fail2pass.txt │ │ │ │ │ +-rw-r--r-- 0 sbuild (996) sbuild (996) 19 2026-10-30 12:28:31.000000 jtreg-test-output/jdk/2/JTreport/text/other_errors.txt │ │ │ │ │ +-rw-r--r-- 0 sbuild (996) sbuild (996) 17 2026-10-30 12:28:31.000000 jtreg-test-output/jdk/2/JTreport/text/faiL2error.txt │ │ │ │ │ +-rw-r--r-- 0 sbuild (996) sbuild (996) 21 2026-10-30 12:28:31.000000 jtreg-test-output/jdk/2/JTreport/text/tc_newfailures.txt │ │ │ │ │ +-rw-r--r-- 0 sbuild (996) sbuild (996) 101 2026-10-30 12:28:31.000000 jtreg-test-output/jdk/2/JTreport/text/stats.txt │ │ │ │ │ +-rw-r--r-- 0 sbuild (996) sbuild (996) 548 2026-10-30 12:28:15.000000 jtreg-test-output/jdk/2/JTreport/text/cmdArgs.txt │ │ │ │ │ +-rw-r--r-- 0 sbuild (996) sbuild (996) 416 2026-10-30 12:28:31.000000 jtreg-test-output/jdk/2/JTreport/text/newfailures.txt │ │ │ │ │ +-rw-r--r-- 0 sbuild (996) sbuild (996) 132 2026-10-30 12:28:31.000000 jtreg-test-output/jdk/2/JTreport/text/testng.txt │ │ │ │ │ +-rw-r--r-- 0 sbuild (996) sbuild (996) 1023561 2026-10-30 12:28:31.000000 jtreg-test-output/jdk/2/JTreport/text/notRun.txt │ │ │ │ │ +-rw-r--r-- 0 sbuild (996) sbuild (996) 18 2026-10-30 12:28:31.000000 jtreg-test-output/jdk/2/JTreport/text/fail2notrun.txt │ │ │ │ │ +-rw-r--r-- 0 sbuild (996) sbuild (996) 0 2026-10-30 12:28:31.000000 jtreg-test-output/jdk/2/JTreport/reportdir.dat │ │ │ │ │ +lrwxrwxrwx 0 sbuild (996) sbuild (996) 0 2026-10-30 12:28:46.000000 jtreg-test-output/jdk/JTreport -> 2/JTreport │ │ │ │ │ +drwxr-xr-x 0 sbuild (996) sbuild (996) 0 2026-10-30 07:21:49.000000 jtreg-test-output/langtools/0/JTreport/ │ │ │ │ │ +-rw-r--r-- 0 sbuild (996) sbuild (996) 710 2026-10-30 07:21:49.000000 jtreg-test-output/langtools/0/JTreport/index.html │ │ │ │ │ +drwxr-xr-x 0 sbuild (996) sbuild (996) 0 2026-10-30 07:21:49.000000 jtreg-test-output/langtools/0/JTreport/html/ │ │ │ │ │ +-rw-r--r-- 0 sbuild (996) sbuild (996) 2162 2026-10-30 07:21:49.000000 jtreg-test-output/langtools/0/JTreport/html/notRun.html │ │ │ │ │ +-rw-r--r-- 0 sbuild (996) sbuild (996) 541677 2026-10-30 07:21:49.000000 jtreg-test-output/langtools/0/JTreport/html/report.html │ │ │ │ │ +-rw-r--r-- 0 sbuild (996) sbuild (996) 6158 2026-10-30 07:21:49.000000 jtreg-test-output/langtools/0/JTreport/html/excluded.html │ │ │ │ │ +-rw-r--r-- 0 sbuild (996) sbuild (996) 461 2026-10-30 07:21:49.000000 jtreg-test-output/langtools/0/JTreport/html/error.html │ │ │ │ │ +-rw-r--r-- 0 sbuild (996) sbuild (996) 509 2026-10-30 07:21:49.000000 jtreg-test-output/langtools/0/JTreport/html/error_gr.html │ │ │ │ │ +-rw-r--r-- 0 sbuild (996) sbuild (996) 541677 2026-10-30 07:21:49.000000 jtreg-test-output/langtools/0/JTreport/html/index.html │ │ │ │ │ +-rw-r--r-- 0 sbuild (996) sbuild (996) 885660 2026-10-30 07:21:49.000000 jtreg-test-output/langtools/0/JTreport/html/passed_gr.html │ │ │ │ │ +-rw-r--r-- 0 sbuild (996) sbuild (996) 501 2026-10-30 07:21:49.000000 jtreg-test-output/langtools/0/JTreport/html/failed_gr.html │ │ │ │ │ +-rw-r--r-- 0 sbuild (996) sbuild (996) 453 2026-10-30 07:21:49.000000 jtreg-test-output/langtools/0/JTreport/html/failed.html │ │ │ │ │ +-rw-r--r-- 0 sbuild (996) sbuild (996) 4103 2026-10-30 07:21:49.000000 jtreg-test-output/langtools/0/JTreport/html/env.html │ │ │ │ │ +-rw-r--r-- 0 sbuild (996) sbuild (996) 2451 2026-10-30 07:21:49.000000 jtreg-test-output/langtools/0/JTreport/html/notRun_gr.html │ │ │ │ │ +-rw-r--r-- 0 sbuild (996) sbuild (996) 307 2026-10-30 07:21:49.000000 jtreg-test-output/langtools/0/JTreport/html/report.css │ │ │ │ │ +-rw-r--r-- 0 sbuild (996) sbuild (996) 10773 2026-10-30 07:21:49.000000 jtreg-test-output/langtools/0/JTreport/html/config.html │ │ │ │ │ +-rw-r--r-- 0 sbuild (996) sbuild (996) 885335 2026-10-30 07:21:49.000000 jtreg-test-output/langtools/0/JTreport/html/passed.html │ │ │ │ │ +drwxr-xr-x 0 sbuild (996) sbuild (996) 0 2026-10-30 07:21:49.000000 jtreg-test-output/langtools/0/JTreport/text/ │ │ │ │ │ +-rw-r--r-- 0 sbuild (996) sbuild (996) 643764 2026-10-30 07:21:49.000000 jtreg-test-output/langtools/0/JTreport/text/summary.txt │ │ │ │ │ +-rw-r--r-- 0 sbuild (996) sbuild (996) 20 2026-10-30 07:21:49.000000 jtreg-test-output/langtools/0/JTreport/text/tc_fail2error.txt │ │ │ │ │ +-rw-r--r-- 0 sbuild (996) sbuild (996) 19 2026-10-30 07:21:49.000000 jtreg-test-output/langtools/0/JTreport/text/tc_fail2pass.txt │ │ │ │ │ +-rw-r--r-- 0 sbuild (996) sbuild (996) 478 2026-10-30 07:21:49.000000 jtreg-test-output/langtools/0/JTreport/text/timeStats.txt │ │ │ │ │ +-rw-r--r-- 0 sbuild (996) sbuild (996) 21 2026-10-30 07:21:49.000000 jtreg-test-output/langtools/0/JTreport/text/tc_fail2notrun.txt │ │ │ │ │ +-rw-r--r-- 0 sbuild (996) sbuild (996) 19 2026-10-30 07:21:49.000000 jtreg-test-output/langtools/0/JTreport/text/fail2missing.txt │ │ │ │ │ +-rw-r--r-- 0 sbuild (996) sbuild (996) 16 2026-10-30 07:21:49.000000 jtreg-test-output/langtools/0/JTreport/text/fail2fail.txt │ │ │ │ │ +-rw-r--r-- 0 sbuild (996) sbuild (996) 22 2026-10-30 07:21:49.000000 jtreg-test-output/langtools/0/JTreport/text/tc_fail2missing.txt │ │ │ │ │ +-rw-r--r-- 0 sbuild (996) sbuild (996) 16 2026-10-30 07:21:49.000000 jtreg-test-output/langtools/0/JTreport/text/fail2pass.txt │ │ │ │ │ +-rw-r--r-- 0 sbuild (996) sbuild (996) 19 2026-10-30 07:21:49.000000 jtreg-test-output/langtools/0/JTreport/text/other_errors.txt │ │ │ │ │ +-rw-r--r-- 0 sbuild (996) sbuild (996) 17 2026-10-30 07:21:49.000000 jtreg-test-output/langtools/0/JTreport/text/faiL2error.txt │ │ │ │ │ +-rw-r--r-- 0 sbuild (996) sbuild (996) 21 2026-10-30 07:21:49.000000 jtreg-test-output/langtools/0/JTreport/text/tc_newfailures.txt │ │ │ │ │ +-rw-r--r-- 0 sbuild (996) sbuild (996) 120 2026-10-30 07:21:49.000000 jtreg-test-output/langtools/0/JTreport/text/stats.txt │ │ │ │ │ +-rw-r--r-- 0 sbuild (996) sbuild (996) 454 2026-10-30 06:33:02.000000 jtreg-test-output/langtools/0/JTreport/text/cmdArgs.txt │ │ │ │ │ +-rw-r--r-- 0 sbuild (996) sbuild (996) 18 2026-10-30 07:21:49.000000 jtreg-test-output/langtools/0/JTreport/text/newfailures.txt │ │ │ │ │ +-rw-r--r-- 0 sbuild (996) sbuild (996) 9538 2026-10-30 07:21:49.000000 jtreg-test-output/langtools/0/JTreport/text/testng.txt │ │ │ │ │ +-rw-r--r-- 0 sbuild (996) sbuild (996) 1921 2026-10-30 07:21:49.000000 jtreg-test-output/langtools/0/JTreport/text/notRun.txt │ │ │ │ │ +-rw-r--r-- 0 sbuild (996) sbuild (996) 18737 2026-10-30 07:21:49.000000 jtreg-test-output/langtools/0/JTreport/text/junit.txt │ │ │ │ │ +-rw-r--r-- 0 sbuild (996) sbuild (996) 18 2026-10-30 07:21:49.000000 jtreg-test-output/langtools/0/JTreport/text/fail2notrun.txt │ │ │ │ │ +-rw-r--r-- 0 sbuild (996) sbuild (996) 0 2026-10-30 07:21:49.000000 jtreg-test-output/langtools/0/JTreport/reportdir.dat │ │ │ │ │ +lrwxrwxrwx 0 sbuild (996) sbuild (996) 0 2026-10-30 07:22:06.000000 jtreg-test-output/langtools/JTreport -> 0/JTreport │ │ │ │ │ +drwxr-xr-x 0 sbuild (996) sbuild (996) 0 2026-10-30 07:45:14.000000 jtreg-test-output/jaxp/0/JTreport/ │ │ │ │ │ +-rw-r--r-- 0 sbuild (996) sbuild (996) 700 2026-10-30 07:45:14.000000 jtreg-test-output/jaxp/0/JTreport/index.html │ │ │ │ │ +drwxr-xr-x 0 sbuild (996) sbuild (996) 0 2026-10-30 07:45:14.000000 jtreg-test-output/jaxp/0/JTreport/html/ │ │ │ │ │ +-rw-r--r-- 0 sbuild (996) sbuild (996) 561 2026-10-30 07:45:14.000000 jtreg-test-output/jaxp/0/JTreport/html/notRun.html │ │ │ │ │ +-rw-r--r-- 0 sbuild (996) sbuild (996) 58282 2026-10-30 07:45:14.000000 jtreg-test-output/jaxp/0/JTreport/html/report.html │ │ │ │ │ +-rw-r--r-- 0 sbuild (996) sbuild (996) 3605 2026-10-30 07:45:14.000000 jtreg-test-output/jaxp/0/JTreport/html/excluded.html │ │ │ │ │ +-rw-r--r-- 0 sbuild (996) sbuild (996) 461 2026-10-30 07:45:14.000000 jtreg-test-output/jaxp/0/JTreport/html/error.html │ │ │ │ │ +-rw-r--r-- 0 sbuild (996) sbuild (996) 509 2026-10-30 07:45:14.000000 jtreg-test-output/jaxp/0/JTreport/html/error_gr.html │ │ │ │ │ +-rw-r--r-- 0 sbuild (996) sbuild (996) 58282 2026-10-30 07:45:14.000000 jtreg-test-output/jaxp/0/JTreport/html/index.html │ │ │ │ │ +-rw-r--r-- 0 sbuild (996) sbuild (996) 110050 2026-10-30 07:45:14.000000 jtreg-test-output/jaxp/0/JTreport/html/passed_gr.html │ │ │ │ │ +-rw-r--r-- 0 sbuild (996) sbuild (996) 501 2026-10-30 07:45:14.000000 jtreg-test-output/jaxp/0/JTreport/html/failed_gr.html │ │ │ │ │ +-rw-r--r-- 0 sbuild (996) sbuild (996) 453 2026-10-30 07:45:14.000000 jtreg-test-output/jaxp/0/JTreport/html/failed.html │ │ │ │ │ +-rw-r--r-- 0 sbuild (996) sbuild (996) 4088 2026-10-30 07:45:14.000000 jtreg-test-output/jaxp/0/JTreport/html/env.html │ │ │ │ │ +-rw-r--r-- 0 sbuild (996) sbuild (996) 683 2026-10-30 07:45:14.000000 jtreg-test-output/jaxp/0/JTreport/html/notRun_gr.html │ │ │ │ │ +-rw-r--r-- 0 sbuild (996) sbuild (996) 307 2026-10-30 07:45:14.000000 jtreg-test-output/jaxp/0/JTreport/html/report.css │ │ │ │ │ +-rw-r--r-- 0 sbuild (996) sbuild (996) 4413 2026-10-30 07:45:14.000000 jtreg-test-output/jaxp/0/JTreport/html/config.html │ │ │ │ │ +-rw-r--r-- 0 sbuild (996) sbuild (996) 109961 2026-10-30 07:45:14.000000 jtreg-test-output/jaxp/0/JTreport/html/passed.html │ │ │ │ │ +drwxr-xr-x 0 sbuild (996) sbuild (996) 0 2026-10-30 07:45:14.000000 jtreg-test-output/jaxp/0/JTreport/text/ │ │ │ │ │ +-rw-r--r-- 0 sbuild (996) sbuild (996) 59118 2026-10-30 07:45:14.000000 jtreg-test-output/jaxp/0/JTreport/text/summary.txt │ │ │ │ │ +-rw-r--r-- 0 sbuild (996) sbuild (996) 20 2026-10-30 07:45:14.000000 jtreg-test-output/jaxp/0/JTreport/text/tc_fail2error.txt │ │ │ │ │ +-rw-r--r-- 0 sbuild (996) sbuild (996) 19 2026-10-30 07:45:14.000000 jtreg-test-output/jaxp/0/JTreport/text/tc_fail2pass.txt │ │ │ │ │ +-rw-r--r-- 0 sbuild (996) sbuild (996) 165 2026-10-30 07:45:14.000000 jtreg-test-output/jaxp/0/JTreport/text/timeStats.txt │ │ │ │ │ +-rw-r--r-- 0 sbuild (996) sbuild (996) 21 2026-10-30 07:45:14.000000 jtreg-test-output/jaxp/0/JTreport/text/tc_fail2notrun.txt │ │ │ │ │ +-rw-r--r-- 0 sbuild (996) sbuild (996) 19 2026-10-30 07:45:14.000000 jtreg-test-output/jaxp/0/JTreport/text/fail2missing.txt │ │ │ │ │ +-rw-r--r-- 0 sbuild (996) sbuild (996) 16 2026-10-30 07:45:14.000000 jtreg-test-output/jaxp/0/JTreport/text/fail2fail.txt │ │ │ │ │ +-rw-r--r-- 0 sbuild (996) sbuild (996) 22 2026-10-30 07:45:14.000000 jtreg-test-output/jaxp/0/JTreport/text/tc_fail2missing.txt │ │ │ │ │ +-rw-r--r-- 0 sbuild (996) sbuild (996) 16 2026-10-30 07:45:14.000000 jtreg-test-output/jaxp/0/JTreport/text/fail2pass.txt │ │ │ │ │ +-rw-r--r-- 0 sbuild (996) sbuild (996) 19 2026-10-30 07:45:14.000000 jtreg-test-output/jaxp/0/JTreport/text/other_errors.txt │ │ │ │ │ +-rw-r--r-- 0 sbuild (996) sbuild (996) 17 2026-10-30 07:45:14.000000 jtreg-test-output/jaxp/0/JTreport/text/faiL2error.txt │ │ │ │ │ +-rw-r--r-- 0 sbuild (996) sbuild (996) 21 2026-10-30 07:45:14.000000 jtreg-test-output/jaxp/0/JTreport/text/tc_newfailures.txt │ │ │ │ │ +-rw-r--r-- 0 sbuild (996) sbuild (996) 65 2026-10-30 07:45:14.000000 jtreg-test-output/jaxp/0/JTreport/text/stats.txt │ │ │ │ │ +-rw-r--r-- 0 sbuild (996) sbuild (996) 439 2026-10-30 07:22:07.000000 jtreg-test-output/jaxp/0/JTreport/text/cmdArgs.txt │ │ │ │ │ +-rw-r--r-- 0 sbuild (996) sbuild (996) 18 2026-10-30 07:45:14.000000 jtreg-test-output/jaxp/0/JTreport/text/newfailures.txt │ │ │ │ │ +-rw-r--r-- 0 sbuild (996) sbuild (996) 69461 2026-10-30 07:45:14.000000 jtreg-test-output/jaxp/0/JTreport/text/testng.txt │ │ │ │ │ +-rw-r--r-- 0 sbuild (996) sbuild (996) 116 2026-10-30 07:45:14.000000 jtreg-test-output/jaxp/0/JTreport/text/notRun.txt │ │ │ │ │ +-rw-r--r-- 0 sbuild (996) sbuild (996) 200 2026-10-30 07:45:14.000000 jtreg-test-output/jaxp/0/JTreport/text/junit.txt │ │ │ │ │ +-rw-r--r-- 0 sbuild (996) sbuild (996) 18 2026-10-30 07:45:14.000000 jtreg-test-output/jaxp/0/JTreport/text/fail2notrun.txt │ │ │ │ │ +-rw-r--r-- 0 sbuild (996) sbuild (996) 0 2026-10-30 07:45:14.000000 jtreg-test-output/jaxp/0/JTreport/reportdir.dat │ │ │ │ │ +lrwxrwxrwx 0 sbuild (996) sbuild (996) 0 2026-10-30 07:45:16.000000 jtreg-test-output/jaxp/JTreport -> 0/JTreport │ │ │ │ │ +drwxr-xr-x 0 sbuild (996) sbuild (996) 0 2026-10-30 06:32:49.000000 jtreg-test-output/hotspot/0/JTreport/ │ │ │ │ │ +-rw-r--r-- 0 sbuild (996) sbuild (996) 712 2026-10-30 06:32:49.000000 jtreg-test-output/hotspot/0/JTreport/index.html │ │ │ │ │ +drwxr-xr-x 0 sbuild (996) sbuild (996) 0 2026-10-30 06:32:49.000000 jtreg-test-output/hotspot/0/JTreport/html/ │ │ │ │ │ +-rw-r--r-- 0 sbuild (996) sbuild (996) 37903 2026-10-30 06:32:49.000000 jtreg-test-output/hotspot/0/JTreport/html/notRun.html │ │ │ │ │ +-rw-r--r-- 0 sbuild (996) sbuild (996) 526702 2026-10-30 06:32:49.000000 jtreg-test-output/hotspot/0/JTreport/html/report.html │ │ │ │ │ +-rw-r--r-- 0 sbuild (996) sbuild (996) 18287 2026-10-30 06:32:49.000000 jtreg-test-output/hotspot/0/JTreport/html/excluded.html │ │ │ │ │ +-rw-r--r-- 0 sbuild (996) sbuild (996) 461 2026-10-30 06:32:49.000000 jtreg-test-output/hotspot/0/JTreport/html/error.html │ │ │ │ │ +-rw-r--r-- 0 sbuild (996) sbuild (996) 509 2026-10-30 06:32:49.000000 jtreg-test-output/hotspot/0/JTreport/html/error_gr.html │ │ │ │ │ +-rw-r--r-- 0 sbuild (996) sbuild (996) 526702 2026-10-30 06:32:49.000000 jtreg-test-output/hotspot/0/JTreport/html/index.html │ │ │ │ │ +-rw-r--r-- 0 sbuild (996) sbuild (996) 631550 2026-10-30 06:32:49.000000 jtreg-test-output/hotspot/0/JTreport/html/passed_gr.html │ │ │ │ │ +-rw-r--r-- 0 sbuild (996) sbuild (996) 501 2026-10-30 06:32:49.000000 jtreg-test-output/hotspot/0/JTreport/html/failed_gr.html │ │ │ │ │ +-rw-r--r-- 0 sbuild (996) sbuild (996) 453 2026-10-30 06:32:49.000000 jtreg-test-output/hotspot/0/JTreport/html/failed.html │ │ │ │ │ +-rw-r--r-- 0 sbuild (996) sbuild (996) 4200 2026-10-30 06:32:49.000000 jtreg-test-output/hotspot/0/JTreport/html/env.html │ │ │ │ │ +-rw-r--r-- 0 sbuild (996) sbuild (996) 38192 2026-10-30 06:32:49.000000 jtreg-test-output/hotspot/0/JTreport/html/notRun_gr.html │ │ │ │ │ +-rw-r--r-- 0 sbuild (996) sbuild (996) 307 2026-10-30 06:32:49.000000 jtreg-test-output/hotspot/0/JTreport/html/report.css │ │ │ │ │ +-rw-r--r-- 0 sbuild (996) sbuild (996) 78247 2026-10-30 06:32:49.000000 jtreg-test-output/hotspot/0/JTreport/html/config.html │ │ │ │ │ +-rw-r--r-- 0 sbuild (996) sbuild (996) 631121 2026-10-30 06:32:49.000000 jtreg-test-output/hotspot/0/JTreport/html/passed.html │ │ │ │ │ +drwxr-xr-x 0 sbuild (996) sbuild (996) 0 2026-10-30 06:32:49.000000 jtreg-test-output/hotspot/0/JTreport/text/ │ │ │ │ │ +-rw-r--r-- 0 sbuild (996) sbuild (996) 475555 2026-10-30 06:32:49.000000 jtreg-test-output/hotspot/0/JTreport/text/summary.txt │ │ │ │ │ +-rw-r--r-- 0 sbuild (996) sbuild (996) 20 2026-10-30 06:32:49.000000 jtreg-test-output/hotspot/0/JTreport/text/tc_fail2error.txt │ │ │ │ │ +-rw-r--r-- 0 sbuild (996) sbuild (996) 19 2026-10-30 06:32:49.000000 jtreg-test-output/hotspot/0/JTreport/text/tc_fail2pass.txt │ │ │ │ │ +-rw-r--r-- 0 sbuild (996) sbuild (996) 935 2026-10-30 06:32:49.000000 jtreg-test-output/hotspot/0/JTreport/text/timeStats.txt │ │ │ │ │ +-rw-r--r-- 0 sbuild (996) sbuild (996) 21 2026-10-30 06:32:49.000000 jtreg-test-output/hotspot/0/JTreport/text/tc_fail2notrun.txt │ │ │ │ │ +-rw-r--r-- 0 sbuild (996) sbuild (996) 19 2026-10-30 06:32:49.000000 jtreg-test-output/hotspot/0/JTreport/text/fail2missing.txt │ │ │ │ │ +-rw-r--r-- 0 sbuild (996) sbuild (996) 16 2026-10-30 06:32:49.000000 jtreg-test-output/hotspot/0/JTreport/text/fail2fail.txt │ │ │ │ │ +-rw-r--r-- 0 sbuild (996) sbuild (996) 22 2026-10-30 06:32:49.000000 jtreg-test-output/hotspot/0/JTreport/text/tc_fail2missing.txt │ │ │ │ │ +-rw-r--r-- 0 sbuild (996) sbuild (996) 16 2026-10-30 06:32:49.000000 jtreg-test-output/hotspot/0/JTreport/text/fail2pass.txt │ │ │ │ │ +-rw-r--r-- 0 sbuild (996) sbuild (996) 19 2026-10-30 06:32:49.000000 jtreg-test-output/hotspot/0/JTreport/text/other_errors.txt │ │ │ │ │ +-rw-r--r-- 0 sbuild (996) sbuild (996) 17 2026-10-30 06:32:49.000000 jtreg-test-output/hotspot/0/JTreport/text/faiL2error.txt │ │ │ │ │ +-rw-r--r-- 0 sbuild (996) sbuild (996) 21 2026-10-30 06:32:49.000000 jtreg-test-output/hotspot/0/JTreport/text/tc_newfailures.txt │ │ │ │ │ +-rw-r--r-- 0 sbuild (996) sbuild (996) 123 2026-10-30 06:32:49.000000 jtreg-test-output/hotspot/0/JTreport/text/stats.txt │ │ │ │ │ +-rw-r--r-- 0 sbuild (996) sbuild (996) 551 2026-10-30 03:12:22.000000 jtreg-test-output/hotspot/0/JTreport/text/cmdArgs.txt │ │ │ │ │ +-rw-r--r-- 0 sbuild (996) sbuild (996) 18 2026-10-30 06:32:49.000000 jtreg-test-output/hotspot/0/JTreport/text/newfailures.txt │ │ │ │ │ +-rw-r--r-- 0 sbuild (996) sbuild (996) 9190 2026-10-30 06:32:49.000000 jtreg-test-output/hotspot/0/JTreport/text/testng.txt │ │ │ │ │ +-rw-r--r-- 0 sbuild (996) sbuild (996) 50907 2026-10-30 06:32:49.000000 jtreg-test-output/hotspot/0/JTreport/text/notRun.txt │ │ │ │ │ +-rw-r--r-- 0 sbuild (996) sbuild (996) 9713 2026-10-30 06:32:49.000000 jtreg-test-output/hotspot/0/JTreport/text/junit.txt │ │ │ │ │ +-rw-r--r-- 0 sbuild (996) sbuild (996) 18 2026-10-30 06:32:49.000000 jtreg-test-output/hotspot/0/JTreport/text/fail2notrun.txt │ │ │ │ │ +-rw-r--r-- 0 sbuild (996) sbuild (996) 0 2026-10-30 06:32:49.000000 jtreg-test-output/hotspot/0/JTreport/reportdir.dat │ │ │ │ │ +lrwxrwxrwx 0 sbuild (996) sbuild (996) 0 2026-10-30 06:33:01.000000 jtreg-test-output/hotspot/JTreport -> 0/JTreport │ │ │ │ ├── jtreg-test-output/jdk/2/JTreport/index.html │ │ │ │ │ @@ -3,15 +3,15 @@ │ │ │ │ │ │ │ │ │ │ │ │ │ │ │ │ │ │ │ │ │ │ │ │ │ Report Index │ │ │ │ │ │ │ │ │ │

/build/reproducible-path/openjdk-21-21.0.13+9/test/jdk

│ │ │ │ │ -Date of report : 26 October 2026 01:43:35 │ │ │ │ │ +Date of report : 30 October 2026 12:28:31 │ │ │ │ │ │ │ │ │ │

│ │ │ │ │ HTML Report │ │ │ │ │
Standard JT Harness HTML report. Can show a summary of the results, configuration information, and environment values.

│ │ │ │ │

│ │ │ │ │ Plain Text Report │ │ │ │ │
Standard JT Harness text report showing only test names and their result status string. Suitable for parsing by external program.

│ │ │ │ │ ├── html2text {} │ │ │ │ │ │ @@ -1,8 +1,8 @@ │ │ │ │ │ │ ************ //bbuuiilldd//rreepprroodduucciibbllee--ppaatthh//ooppeennjjddkk--2211--2211..00..1133++99//tteesstt//jjddkk ************ │ │ │ │ │ │ -Date of report : 26 October 2026 01:43:35 │ │ │ │ │ │ +Date of report : 30 October 2026 12:28:31 │ │ │ │ │ │ _H_T_M_L_ _R_e_p_o_r_t │ │ │ │ │ │ Standard JT Harness HTML report. Can show a summary of the results, │ │ │ │ │ │ configuration information, and environment values. │ │ │ │ │ │ _P_l_a_i_n_ _T_e_x_t_ _R_e_p_o_r_t │ │ │ │ │ │ Standard JT Harness text report showing only test names and their result status │ │ │ │ │ │ string. Suitable for parsing by external program. │ │ │ │ ├── jtreg-test-output/jdk/2/JTreport/html/notRun_gr.html │ │ │ │ │ @@ -47657,17 +47657,18 @@ │ │ │ │ │ 000ba280: 3c6c 693e 7375 6e2f 7365 6375 7269 7479
  • sun/security │ │ │ │ │ 000ba290: 2f73 6d61 7274 6361 7264 696f 2f54 6573 /smartcardio/Tes │ │ │ │ │ 000ba2a0: 7454 7261 6e73 6d69 742e 6a61 7661 3a20 tTransmit.java: │ │ │ │ │ 000ba2b0: 7465 7374 2074 7261 6e73 6d69 7428 2920 test transmit() │ │ │ │ │ 000ba2c0: 776f 726b 730a 3c2f 756c 3e0a 3c68 723e works..
    │ │ │ │ │ 000ba2d0: 0a3c 736d 616c 6c3e 5265 706f 7274 2067 .Report g │ │ │ │ │ 000ba2e0: 656e 6572 6174 6564 206f 6e20 4f63 7420 enerated on Oct │ │ │ │ │ -000ba2f0: 3236 2c20 3230 3236 2031 3a34 333a 3335 26, 2026 1:43:35 │ │ │ │ │ -000ba300: e280 af41 4d0a 3c62 723e 5573 696e 6720 ...AM.
    Using │ │ │ │ │ -000ba310: 4a54 2048 6172 6e65 7373 2036 2e30 2062 JT Harness 6.0 b │ │ │ │ │ -000ba320: 3234 3b20 6275 696c 7420 6f6e 204a 616e 24; built on Jan │ │ │ │ │ -000ba330: 7561 7279 2032 352c 2031 3937 302c 2031 uary 25, 1970, 1 │ │ │ │ │ -000ba340: 323a 3030 3a30 30e2 80af 414d 2055 5443 2:00:00...AM UTC │ │ │ │ │ -000ba350: 2077 6974 6820 6f70 656e 6a64 6b20 7665 with openjdk ve │ │ │ │ │ -000ba360: 7273 696f 6e20 2231 312e 302e 3136 2220 rsion "11.0.16" │ │ │ │ │ -000ba370: 3230 3232 2d30 372d 3139 3c2f 736d 616c 2022-07-19 │ │ │ │ │ +000ba2f0: 3330 2c20 3230 3236 2031 323a 3238 3a33 30, 2026 12:28:3 │ │ │ │ │ +000ba300: 31e2 80af 504d 0a3c 6272 3e55 7369 6e67 1...PM.
    Using │ │ │ │ │ +000ba310: 204a 5420 4861 726e 6573 7320 362e 3020 JT Harness 6.0 │ │ │ │ │ +000ba320: 6232 343b 2062 7569 6c74 206f 6e20 4a61 b24; built on Ja │ │ │ │ │ +000ba330: 6e75 6172 7920 3235 2c20 3139 3730 2c20 nuary 25, 1970, │ │ │ │ │ +000ba340: 3132 3a30 303a 3030 e280 af41 4d20 5554 12:00:00...AM UT │ │ │ │ │ +000ba350: 4320 7769 7468 206f 7065 6e6a 646b 2076 C with openjdk v │ │ │ │ │ +000ba360: 6572 7369 6f6e 2022 3131 2e30 2e31 3622 ersion "11.0.16" │ │ │ │ │ +000ba370: 2032 3032 322d 3037 2d31 393c 2f73 6d61 2022-07-19 │ │ │ │ │ ├── html2text {} │ │ │ │ │ │ @@ -13395,10 +13395,10 @@ │ │ │ │ │ │ ()/endExclusive() works │ │ │ │ │ │ * sun/security/smartcardio/TestMultiplePresent.java: test that │ │ │ │ │ │ CardTerminals.waitForCard() works │ │ │ │ │ │ * sun/security/smartcardio/TestPresent.java: test that the isCardPresent()/ │ │ │ │ │ │ waitForX() APIs work correctly │ │ │ │ │ │ * sun/security/smartcardio/TestTransmit.java: test transmit() works │ │ │ │ │ │ =============================================================================== │ │ │ │ │ │ -Report generated on Oct 26, 2026 1:43:35 AM │ │ │ │ │ │ +Report generated on Oct 30, 2026 12:28:31 PM │ │ │ │ │ │ Using JT Harness 6.0 b24; built on January 25, 1970, 12:00:00 AM UTC with │ │ │ │ │ │ openjdk version "11.0.16" 2022-07-19 │ │ │ │ ├── jtreg-test-output/jdk/2/JTreport/html/notRun.html │ │ │ │ │ @@ -47639,18 +47639,18 @@ │ │ │ │ │ 000ba160: 6572 2f6d 6f64 756c 6573 2f76 616c 6964 er/modules/valid │ │ │ │ │ 000ba170: 6174 652f 5661 6c69 6461 7465 4d6f 6475 ate/ValidateModu │ │ │ │ │ 000ba180: 6c65 7354 6573 742e 6a61 7661 3a20 4261 lesTest.java: Ba │ │ │ │ │ 000ba190: 7369 6320 7465 7374 2066 6f72 206a 6176 sic test for jav │ │ │ │ │ 000ba1a0: 6120 2d2d 7661 6c69 6461 7465 2d6d 6f64 a --validate-mod │ │ │ │ │ 000ba1b0: 756c 6573 0a3c 6272 0a3e 0a3c 6872 3e0a ules..
    . │ │ │ │ │ 000ba1c0: 3c73 6d61 6c6c 3e52 6570 6f72 7420 6765 Report ge │ │ │ │ │ -000ba1d0: 6e65 7261 7465 6420 6f6e 204f 6374 2032 nerated on Oct 2 │ │ │ │ │ -000ba1e0: 362c 2032 3032 3620 313a 3433 3a33 35e2 6, 2026 1:43:35. │ │ │ │ │ -000ba1f0: 80af 414d 0a3c 6272 3e55 7369 6e67 204a ..AM.
    Using J │ │ │ │ │ -000ba200: 5420 4861 726e 6573 7320 362e 3020 6232 T Harness 6.0 b2 │ │ │ │ │ -000ba210: 343b 2062 7569 6c74 206f 6e20 4a61 6e75 4; built on Janu │ │ │ │ │ -000ba220: 6172 7920 3235 2c20 3139 3730 2c20 3132 ary 25, 1970, 12 │ │ │ │ │ -000ba230: 3a30 303a 3030 e280 af41 4d20 5554 4320 :00:00...AM UTC │ │ │ │ │ -000ba240: 7769 7468 206f 7065 6e6a 646b 2076 6572 with openjdk ver │ │ │ │ │ -000ba250: 7369 6f6e 2022 3131 2e30 2e31 3622 2032 sion "11.0.16" 2 │ │ │ │ │ -000ba260: 3032 322d 3037 2d31 393c 2f73 6d61 6c6c 022-07-19
    │ │ │ │ │ +000ba1d0: 6e65 7261 7465 6420 6f6e 204f 6374 2033 nerated on Oct 3 │ │ │ │ │ +000ba1e0: 302c 2032 3032 3620 3132 3a32 383a 3331 0, 2026 12:28:31 │ │ │ │ │ +000ba1f0: e280 af50 4d0a 3c62 723e 5573 696e 6720 ...PM.
    Using │ │ │ │ │ +000ba200: 4a54 2048 6172 6e65 7373 2036 2e30 2062 JT Harness 6.0 b │ │ │ │ │ +000ba210: 3234 3b20 6275 696c 7420 6f6e 204a 616e 24; built on Jan │ │ │ │ │ +000ba220: 7561 7279 2032 352c 2031 3937 302c 2031 uary 25, 1970, 1 │ │ │ │ │ +000ba230: 323a 3030 3a30 30e2 80af 414d 2055 5443 2:00:00...AM UTC │ │ │ │ │ +000ba240: 2077 6974 6820 6f70 656e 6a64 6b20 7665 with openjdk ve │ │ │ │ │ +000ba250: 7273 696f 6e20 2231 312e 302e 3136 2220 rsion "11.0.16" │ │ │ │ │ +000ba260: 3230 3232 2d30 372d 3139 3c2f 736d 616c 2022-07-19 │ │ │ │ │ ├── html2text {} │ │ │ │ │ │ @@ -12775,10 +12775,10 @@ │ │ │ │ │ │ tools/launcher/modules/patch/systemmodules/PatchSystemModules.java: Patch │ │ │ │ │ │ java.base and user module with ModuleHashes attribute │ │ │ │ │ │ tools/launcher/modules/showmoduleresolution/ShowModuleResolutionTest.java: │ │ │ │ │ │ Basic test for java --show-module-resolution │ │ │ │ │ │ tools/launcher/modules/validate/ValidateModulesTest.java: Basic test for java - │ │ │ │ │ │ -validate-modules │ │ │ │ │ │ =============================================================================== │ │ │ │ │ │ -Report generated on Oct 26, 2026 1:43:35 AM │ │ │ │ │ │ +Report generated on Oct 30, 2026 12:28:31 PM │ │ │ │ │ │ Using JT Harness 6.0 b24; built on January 25, 1970, 12:00:00 AM UTC with │ │ │ │ │ │ openjdk version "11.0.16" 2022-07-19 │ │ │ │ ├── jtreg-test-output/jdk/2/JTreport/html/error_gr.html │ │ │ │ │ @@ -6,9 +6,9 @@ │ │ │ │ │ │ │ │ │ │ JT Harness : Tests that had errors │ │ │ │ │ │ │ │ │ │ │ │ │ │ │ │ │ │ │ │

    JT Harness : Tests that had errors

    Tests are grouped by their final status message. │ │ │ │ │
    │ │ │ │ │ -Report generated on Oct 26, 2026 1:43:35 AM │ │ │ │ │ +Report generated on Oct 30, 2026 12:28:31 PM │ │ │ │ │
    Using JT Harness 6.0 b24; built on January 25, 1970, 12:00:00 AM UTC with openjdk version "11.0.16" 2022-07-19
    │ │ │ │ │ ├── html2text {} │ │ │ │ │ │ @@ -1,6 +1,6 @@ │ │ │ │ │ │ ************ JJTT HHaarrnneessss :: TTeessttss tthhaatt hhaadd eerrrroorrss ************ │ │ │ │ │ │ Tests are grouped by their final status message. │ │ │ │ │ │ =============================================================================== │ │ │ │ │ │ -Report generated on Oct 26, 2026 1:43:35 AM │ │ │ │ │ │ +Report generated on Oct 30, 2026 12:28:31 PM │ │ │ │ │ │ Using JT Harness 6.0 b24; built on January 25, 1970, 12:00:00 AM UTC with │ │ │ │ │ │ openjdk version "11.0.16" 2022-07-19 │ │ │ │ ├── jtreg-test-output/jdk/2/JTreport/html/error.html │ │ │ │ │ @@ -6,9 +6,9 @@ │ │ │ │ │ │ │ │ │ │ JT Harness : Tests that had errors │ │ │ │ │ │ │ │ │ │ │ │ │ │ │ │ │ │ │ │

    JT Harness : Tests that had errors

    │ │ │ │ │
    │ │ │ │ │ -Report generated on Oct 26, 2026 1:43:35 AM │ │ │ │ │ +Report generated on Oct 30, 2026 12:28:31 PM │ │ │ │ │
    Using JT Harness 6.0 b24; built on January 25, 1970, 12:00:00 AM UTC with openjdk version "11.0.16" 2022-07-19
    │ │ │ │ │ ├── html2text {} │ │ │ │ │ │ @@ -1,5 +1,5 @@ │ │ │ │ │ │ ************ JJTT HHaarrnneessss :: TTeessttss tthhaatt hhaadd eerrrroorrss ************ │ │ │ │ │ │ =============================================================================== │ │ │ │ │ │ -Report generated on Oct 26, 2026 1:43:35 AM │ │ │ │ │ │ +Report generated on Oct 30, 2026 12:28:31 PM │ │ │ │ │ │ Using JT Harness 6.0 b24; built on January 25, 1970, 12:00:00 AM UTC with │ │ │ │ │ │ openjdk version "11.0.16" 2022-07-19 │ │ │ │ ├── jtreg-test-output/jdk/2/JTreport/html/failed_gr.html │ │ │ │ │ @@ -56,9 +56,9 @@ │ │ │ │ │
  • │ │ │ │ │ java/net/MulticastSocket/SetLoopbackMode.java: Test MulticastSocket.setLoopbackMode │ │ │ │ │ │ │ │ │ │
  • │ │ │ │ │ java/net/MulticastSocket/SetLoopbackModeIPv4.java: Test MulticastSocket.setLoopbackMode with IPv4 addresses │ │ │ │ │ │ │ │ │ │
    │ │ │ │ │ -Report generated on Oct 26, 2026 1:43:35 AM │ │ │ │ │ +Report generated on Oct 30, 2026 12:28:31 PM │ │ │ │ │
    Using JT Harness 6.0 b24; built on January 25, 1970, 12:00:00 AM UTC with openjdk version "11.0.16" 2022-07-19
    │ │ │ │ │ ├── html2text {} │ │ │ │ │ │ @@ -25,10 +25,10 @@ │ │ │ │ │ │ * _j_a_v_a_/_n_e_t_/_M_u_l_t_i_c_a_s_t_S_o_c_k_e_t_/_N_o_L_o_o_p_b_a_c_k_P_a_c_k_e_t_s_._j_a_v_a: Re-test IPv6 (and │ │ │ │ │ │ specifically MulticastSocket) with latest Linux & USAGI code │ │ │ │ │ │ * _j_a_v_a_/_n_e_t_/_M_u_l_t_i_c_a_s_t_S_o_c_k_e_t_/_S_e_t_L_o_o_p_b_a_c_k_M_o_d_e_._j_a_v_a: Test │ │ │ │ │ │ MulticastSocket.setLoopbackMode │ │ │ │ │ │ * _j_a_v_a_/_n_e_t_/_M_u_l_t_i_c_a_s_t_S_o_c_k_e_t_/_S_e_t_L_o_o_p_b_a_c_k_M_o_d_e_I_P_v_4_._j_a_v_a: Test │ │ │ │ │ │ MulticastSocket.setLoopbackMode with IPv4 addresses │ │ │ │ │ │ =============================================================================== │ │ │ │ │ │ -Report generated on Oct 26, 2026 1:43:35 AM │ │ │ │ │ │ +Report generated on Oct 30, 2026 12:28:31 PM │ │ │ │ │ │ Using JT Harness 6.0 b24; built on January 25, 1970, 12:00:00 AM UTC with │ │ │ │ │ │ openjdk version "11.0.16" 2022-07-19 │ │ │ │ ├── jtreg-test-output/jdk/2/JTreport/html/failed.html │ │ │ │ │ @@ -33,9 +33,9 @@ │ │ │ │ │ java/net/SocketPermission/SocketPermissionTest.java: SocketPermission tests for legacy socket types. │ │ │ │ │
    │ │ │ │ │ sun/security/krb5/auto/Addresses.java: fix krb5 caddr │ │ │ │ │
    │ │ │ │ │
    │ │ │ │ │ -Report generated on Oct 26, 2026 1:43:35 AM │ │ │ │ │ +Report generated on Oct 30, 2026 12:28:31 PM │ │ │ │ │
    Using JT Harness 6.0 b24; built on January 25, 1970, 12:00:00 AM UTC with openjdk version "11.0.16" 2022-07-19
    │ │ │ │ │ ├── html2text {} │ │ │ │ │ │ @@ -11,10 +11,10 @@ │ │ │ │ │ │ MulticastSocket.setLoopbackMode with IPv4 addresses │ │ │ │ │ │ _j_a_v_a_/_n_e_t_/_M_u_l_t_i_c_a_s_t_S_o_c_k_e_t_/_T_e_s_t_._j_a_v_a: IPv4 and IPv6 multicasting broken on Linux │ │ │ │ │ │ _j_a_v_a_/_n_e_t_/_S_o_c_k_e_t_O_p_t_i_o_n_/_O_p_t_i_o_n_s_T_e_s_t_._j_a_v_a: │ │ │ │ │ │ _j_a_v_a_/_n_e_t_/_S_o_c_k_e_t_P_e_r_m_i_s_s_i_o_n_/_S_o_c_k_e_t_P_e_r_m_i_s_s_i_o_n_T_e_s_t_._j_a_v_a: SocketPermission tests for │ │ │ │ │ │ legacy socket types. │ │ │ │ │ │ _s_u_n_/_s_e_c_u_r_i_t_y_/_k_r_b_5_/_a_u_t_o_/_A_d_d_r_e_s_s_e_s_._j_a_v_a: fix krb5 caddr │ │ │ │ │ │ =============================================================================== │ │ │ │ │ │ -Report generated on Oct 26, 2026 1:43:35 AM │ │ │ │ │ │ +Report generated on Oct 30, 2026 12:28:31 PM │ │ │ │ │ │ Using JT Harness 6.0 b24; built on January 25, 1970, 12:00:00 AM UTC with │ │ │ │ │ │ openjdk version "11.0.16" 2022-07-19 │ │ │ │ ├── jtreg-test-output/jdk/2/JTreport/html/passed_gr.html │ │ │ │ │ @@ -240,77986 +240,77990 @@ │ │ │ │ │ 00000ef0: 7861 6d70 6c65 732e 6a74 7222 3e6a 646b xamples.jtr">jdk │ │ │ │ │ 00000f00: 2f63 6c61 7373 6669 6c65 2f65 7861 6d70 /classfile/examp │ │ │ │ │ 00000f10: 6c65 732f 5472 616e 7366 6f72 6d45 7861 les/TransformExa │ │ │ │ │ 00000f20: 6d70 6c65 732e 6a61 7661 3c2f 613e 3a20 mples.java: │ │ │ │ │ 00000f30: 5465 7374 696e 6720 436c 6173 7366 696c Testing Classfil │ │ │ │ │ 00000f40: 6520 5472 616e 7366 6f72 6d45 7861 6d70 e TransformExamp │ │ │ │ │ 00000f50: 6c65 7320 636f 6d70 696c 6174 696f 6e2e les compilation. │ │ │ │ │ -00000f60: 0a3c 2f75 6c3e 0a0a 3c68 343e 4578 6563 ...

    Exec │ │ │ │ │ -00000f70: 7574 696f 6e20 6661 696c 6564 2061 7320 ution failed as │ │ │ │ │ -00000f80: 6578 7065 6374 6564 3c2f 6834 3e0a 0a3c expected

    ..< │ │ │ │ │ -00000f90: 756c 3e0a 3c6c 693e 0a3c 6120 6872 6566 ul>.
  • .com/ │ │ │ │ │ -00000fe0: 7375 6e2f 7365 6375 7269 7479 2f73 6173 sun/security/sas │ │ │ │ │ -00000ff0: 6c2f 6469 6765 7374 2f55 6e62 6f75 6e64 l/digest/Unbound │ │ │ │ │ -00001000: 2e6a 6176 613c 2f61 3e3a 2053 4153 4c20 .java: SASL │ │ │ │ │ -00001010: 7365 7276 6963 6520 666f 7220 6d75 6c74 service for mult │ │ │ │ │ -00001020: 6970 6c65 2068 6f73 746e 616d 6573 0a0a iple hostnames.. │ │ │ │ │ -00001030: 3c6c 693e 0a3c 6120 6872 6566 3d22 2f74
  • .java │ │ │ │ │ -00001090: 2f6e 696f 2f63 6861 6e6e 656c 732f 4173 /nio/channels/As │ │ │ │ │ -000010a0: 796e 6368 726f 6e6f 7573 4368 616e 6e65 ynchronousChanne │ │ │ │ │ -000010b0: 6c47 726f 7570 2f42 6164 5072 6f70 6572 lGroup/BadProper │ │ │ │ │ -000010c0: 7469 6573 2e6a 6176 613c 2f61 3e3a 2055 ties.java: U │ │ │ │ │ -000010d0: 6e69 7420 7465 7374 2066 6f72 2041 7379 nit test for Asy │ │ │ │ │ -000010e0: 6e63 6872 6f6e 6f75 7343 6861 6e6e 656c nchronousChannel │ │ │ │ │ -000010f0: 4772 6f75 700a 0a3c 6c69 3e0a 3c61 2068 Group..
  • .sun/securi │ │ │ │ │ -00001150: 7479 2f6a 6773 732f 7370 6e65 676f 2f4e ty/jgss/spnego/N │ │ │ │ │ -00001160: 6567 546f 6b65 6e54 6172 6746 6965 6c64 egTokenTargField │ │ │ │ │ -00001170: 732e 6a61 7661 3c2f 613e 3a20 5350 4e45 s.java: SPNE │ │ │ │ │ -00001180: 474f 2047 5353 2063 6f64 6520 646f 6573 GO GSS code does │ │ │ │ │ -00001190: 206e 6f74 2070 6172 7365 2074 6f6b 656e not parse token │ │ │ │ │ -000011a0: 7320 696e 2061 6363 6f72 6461 6e63 6520 s in accordance │ │ │ │ │ -000011b0: 746f 2052 4643 2032 3437 380a 0a3c 6c69 to RFC 2478..
  • .sun/security/ │ │ │ │ │ -00001210: 6b72 6235 2f61 7574 6f2f 4e6f 4164 6472 krb5/auto/NoAddr │ │ │ │ │ -00001220: 6573 7365 732e 6a61 7661 3c2f 613e 3a20 esses.java: │ │ │ │ │ -00001230: 6e6f 2d61 6464 7265 7373 6573 2073 686f no-addresses sho │ │ │ │ │ -00001240: 756c 6420 6e6f 7420 6265 2075 7365 6420 uld not be used │ │ │ │ │ -00001250: 6f6e 2061 6363 6570 746f 7220 7369 6465 on acceptor side │ │ │ │ │ -00001260: 0a0a 3c6c 693e 0a3c 6120 6872 6566 3d22 ..
  • .sun/securit │ │ │ │ │ -000012b0: 792f 6b72 6235 2f61 7574 6f2f 4e6f 6e41 y/krb5/auto/NonA │ │ │ │ │ -000012c0: 7363 6969 2e6a 6176 613c 2f61 3e3a 204b scii.java: K │ │ │ │ │ -000012d0: 6572 6265 726f 7353 7472 696e 6720 7368 erberosString sh │ │ │ │ │ -000012e0: 6f75 6c64 2075 7365 2055 5446 2d38 2062 ould use UTF-8 b │ │ │ │ │ -000012f0: 7920 6465 6661 756c 740a 0a3c 6c69 3e0a y default..
  • . │ │ │ │ │ -00001300: 3c61 2068 7265 663d 222f 746d 702f 6a64 sun/secu │ │ │ │ │ -00001350: 7269 7479 2f6b 7262 352f 6175 746f 2f52 rity/krb5/auto/R │ │ │ │ │ -00001360: 6570 6c61 7943 6163 6865 4578 7075 6e67 eplayCacheExpung │ │ │ │ │ -00001370: 652e 6a61 7661 3c2f 613e 3a20 7768 656e e.java: when │ │ │ │ │ -00001380: 206e 756d 6265 7220 6f66 2065 7870 6972 number of expir │ │ │ │ │ -00001390: 6564 2065 6e74 7269 6573 206d 696e 7573 ed entries minus │ │ │ │ │ -000013a0: 206e 756d 6265 7220 6f66 2067 6f6f 6420 number of good │ │ │ │ │ -000013b0: 656e 7472 6965 7320 6973 206d 6f72 6520 entries is more │ │ │ │ │ -000013c0: 7468 616e 2033 302c 2065 7870 756e 6765 than 30, expunge │ │ │ │ │ -000013d0: 206f 6363 7572 732c 2061 6e64 2065 7870 occurs, and exp │ │ │ │ │ -000013e0: 6972 6564 2065 6e74 7269 6573 2061 7265 ired entries are │ │ │ │ │ -000013f0: 2066 6f72 676f 7474 656e 2e0a 0a3c 6c69 forgotten...
  • .sun/security/ │ │ │ │ │ -00001450: 6b72 6235 2f61 7574 6f2f 5361 736c 556e krb5/auto/SaslUn │ │ │ │ │ -00001460: 626f 756e 642e 6a61 7661 3c2f 613e 3a20 bound.java: │ │ │ │ │ -00001470: 556e 626f 756e 6420 5341 534c 2073 6572 Unbound SASL ser │ │ │ │ │ -00001480: 7669 6365 3a20 7468 6520 4753 5341 5049 vice: the GSSAPI │ │ │ │ │ -00001490: 2f6b 7262 3520 6d65 6368 0a0a 3c6c 693e /krb5 mech..
  • │ │ │ │ │ -000014a0: 0a3c 6120 6872 6566 3d22 2f74 6d70 2f6a .sun/secu │ │ │ │ │ -000014f0: 7269 7479 2f6b 7262 352f 6175 746f 2f53 rity/krb5/auto/S │ │ │ │ │ -00001500: 706e 6567 6f55 6e6b 6e6f 776e 4d65 6368 pnegoUnknownMech │ │ │ │ │ -00001510: 2e6a 6176 613c 2f61 3e3a 2020 0a0a 3c6c .java: ...sun/security/ │ │ │ │ │ -00001570: 6b72 6235 2f61 7574 6f2f 5477 6f4f 7254 krb5/auto/TwoOrT │ │ │ │ │ -00001580: 6872 6565 2e6a 6176 613c 2f61 3e3a 2064 hree.java: d │ │ │ │ │ -00001590: 6566 6175 6c74 2070 7269 6e63 6970 616c efault principal │ │ │ │ │ -000015a0: 2063 616e 2061 6374 2061 7320 616e 796f can act as anyo │ │ │ │ │ -000015b0: 6e65 0a0a 3c6c 693e 0a3c 6120 6872 6566 ne..
  • .sun │ │ │ │ │ -00001600: 2f73 6563 7572 6974 792f 6b72 6235 2f61 /security/krb5/a │ │ │ │ │ -00001610: 7574 6f2f 556e 626f 756e 6453 6572 7669 uto/UnboundServi │ │ │ │ │ -00001620: 6365 2e6a 6176 613c 2f61 3e3a 2055 6e62 ce.java: Unb │ │ │ │ │ -00001630: 6f75 6e64 2053 4153 4c20 7365 7276 6963 ound SASL servic │ │ │ │ │ -00001640: 653a 2074 6865 2047 5353 4150 492f 6b72 e: the GSSAPI/kr │ │ │ │ │ -00001650: 6235 206d 6563 680a 3c2f 756c 3e0a 0a3c b5 mech...< │ │ │ │ │ -00001660: 6834 3e45 7865 6375 7469 6f6e 2073 7563 h4>Execution suc │ │ │ │ │ -00001670: 6365 7373 6675 6c3c 2f68 343e 0a0a 3c75 cessful...
  • .com/ │ │ │ │ │ -000016e0: 7375 6e2f 6372 7970 746f 2f70 726f 7669 sun/crypto/provi │ │ │ │ │ -000016f0: 6465 722f 416c 676f 7269 7468 6d50 6172 der/AlgorithmPar │ │ │ │ │ -00001700: 616d 6574 6572 732f 4f41 4550 4f72 6465 ameters/OAEPOrde │ │ │ │ │ -00001710: 722e 6a61 7661 3c2f 613e 3a20 456e 7375 r.java: Ensu │ │ │ │ │ -00001720: 7265 7320 4f41 4550 5061 7261 6d65 7465 res OAEPParamete │ │ │ │ │ -00001730: 7273 2072 6561 6420 636f 7272 6563 7420 rs read correct │ │ │ │ │ -00001740: 656e 636f 6469 6e67 2061 6e64 2072 656a encoding and rej │ │ │ │ │ -00001750: 6563 7420 656e 636f 6469 6e67 2077 6974 ect encoding wit │ │ │ │ │ -00001760: 6820 696e 7661 6c69 6420 6f72 6465 7269 h invalid orderi │ │ │ │ │ -00001770: 6e67 0a0a 3c6c 693e 0a3c 6120 6872 6566 ng..
  • .com/sun/cry │ │ │ │ │ -000017d0: 7074 6f2f 7072 6f76 6964 6572 2f43 4943 pto/provider/CIC │ │ │ │ │ -000017e0: 4f2f 4349 434f 4368 6169 6e69 6e67 5465 O/CICOChainingTe │ │ │ │ │ -000017f0: 7374 2e6a 6176 613c 2f61 3e3a 2054 6869 st.java: Thi │ │ │ │ │ -00001800: 7320 7465 7374 2076 6572 6966 6965 7320 s test verifies │ │ │ │ │ -00001810: 7468 6520 6173 7365 7274 696f 6e20 2254 the assertion "T │ │ │ │ │ -00001820: 6865 2063 6861 696e 696e 6720 6665 6174 he chaining feat │ │ │ │ │ -00001830: 7572 6520 6f66 2046 696c 7465 7220 7374 ure of Filter st │ │ │ │ │ -00001840: 7265 616d 7320 7368 6f75 6c64 2062 6520 reams should be │ │ │ │ │ -00001850: 7375 7070 6f72 7465 642e 2220 666f 7220 supported." for │ │ │ │ │ -00001860: 6665 6174 7572 6520 2243 6970 6865 7249 feature "CipherI │ │ │ │ │ -00001870: 6e70 7574 5374 7265 616d 2026 616d 703b nputStream & │ │ │ │ │ -00001880: 2043 6970 6865 724f 7574 7075 7453 7472 CipherOutputStr │ │ │ │ │ -00001890: 6561 6d22 0a0a 3c6c 693e 0a3c 6120 6872 eam"..
  • .com/sun/cr │ │ │ │ │ -000018f0: 7970 746f 2f70 726f 7669 6465 722f 4349 ypto/provider/CI │ │ │ │ │ -00001900: 434f 2f43 4943 4f44 4553 4675 6e63 5465 CO/CICODESFuncTe │ │ │ │ │ -00001910: 7374 2e6a 6176 613c 2f61 3e3a 2074 6f20 st.java: to │ │ │ │ │ -00001920: 7665 7269 6679 2063 6970 6865 7249 6e70 verify cipherInp │ │ │ │ │ -00001930: 7574 5374 7265 616d 2061 6e64 2063 6970 utStream and cip │ │ │ │ │ -00001940: 6865 7249 6e70 7574 5374 7265 616d 2063 herInputStream c │ │ │ │ │ -00001950: 6970 6865 7220 6675 6e63 7469 6f6e 0a0a ipher function.. │ │ │ │ │ -00001960: 3c6c 693e 0a3c 6120 6872 6566 3d22 2f74
  • .com │ │ │ │ │ -000019b0: 2f73 756e 2f63 7279 7074 6f2f 7072 6f76 /sun/crypto/prov │ │ │ │ │ -000019c0: 6964 6572 2f43 4943 4f2f 4349 434f 536b ider/CICO/CICOSk │ │ │ │ │ -000019d0: 6970 5465 7374 2e6a 6176 613c 2f61 3e3a ipTest.java: │ │ │ │ │ -000019e0: 2054 6869 7320 7465 7374 2076 6572 6966 This test verif │ │ │ │ │ -000019f0: 6965 7320 7468 6520 6173 7365 7274 696f ies the assertio │ │ │ │ │ -00001a00: 6e20 2254 6865 2073 6b69 7020 6665 6174 n "The skip feat │ │ │ │ │ -00001a10: 7572 6520 6f66 2046 696c 7465 7220 7374 ure of Filter st │ │ │ │ │ -00001a20: 7265 616d 7320 7368 6f75 6c64 2062 6520 reams should be │ │ │ │ │ -00001a30: 7375 7070 6f72 7465 642e 2220 666f 7220 supported." for │ │ │ │ │ -00001a40: 6665 6174 7572 6520 4369 7068 6572 496e feature CipherIn │ │ │ │ │ -00001a50: 7075 7453 7472 6561 6d20 616e 6420 4369 putStream and Ci │ │ │ │ │ -00001a60: 7068 6572 4f75 7470 7574 5374 7265 616d pherOutputStream │ │ │ │ │ -00001a70: 0a0a 3c6c 693e 0a3c 6120 6872 6566 3d22 ..
  • .java/net/httpc │ │ │ │ │ +00001020: 6c69 656e 742f 4874 7470 7354 756e 6e65 lient/HttpsTunne │ │ │ │ │ +00001030: 6c54 6573 742e 6a61 7661 3c2f 613e 3a20 lTest.java: │ │ │ │ │ +00001040: 5468 6973 2074 6573 7420 7665 7269 6669 This test verifi │ │ │ │ │ +00001050: 6573 2074 6861 7420 6966 2061 6e20 6832 es that if an h2 │ │ │ │ │ +00001060: 2063 6f6e 6e65 6374 696f 6e20 676f 696e connection goin │ │ │ │ │ +00001070: 6720 7468 726f 7567 6820 6120 7072 6f78 g through a prox │ │ │ │ │ +00001080: 7920 5020 6973 2064 6f77 6e67 7261 6465 y P is downgrade │ │ │ │ │ +00001090: 6420 746f 2048 5454 502f 312e 312c 2074 d to HTTP/1.1, t │ │ │ │ │ +000010a0: 6865 6e20 6120 6e65 7720 6832 2072 6571 hen a new h2 req │ │ │ │ │ +000010b0: 7565 7374 2067 6f69 6e67 2074 6f20 6120 uest going to a │ │ │ │ │ +000010c0: 6469 6666 6572 656e 7420 686f 7374 2074 different host t │ │ │ │ │ +000010d0: 6872 6f75 6768 2074 6865 2073 616d 6520 hrough the same │ │ │ │ │ +000010e0: 7072 6f78 7920 7769 6c6c 206e 6f74 2062 proxy will not b │ │ │ │ │ +000010f0: 6520 7072 6565 6d70 7469 7665 6c79 2064 e preemptively d │ │ │ │ │ +00001100: 6f77 6e67 7261 6465 642e 0a3c 2f75 6c3e owngraded.. │ │ │ │ │ +00001110: 0a0a 3c68 343e 4578 6563 7574 696f 6e20 ..

    Execution │ │ │ │ │ +00001120: 6661 696c 6564 2061 7320 6578 7065 6374 failed as expect │ │ │ │ │ +00001130: 6564 3c2f 6834 3e0a 0a3c 756c 3e0a 3c6c ed

    ....

    Exe │ │ │ │ │ +00001810: 6375 7469 6f6e 2073 7563 6365 7373 6675 cution successfu │ │ │ │ │ +00001820: 6c3c 2f68 343e 0a0a 3c75 6c3e 0a3c 6c69 l

    ..