--- /srv/rebuilderd/tmp/rebuilderdOg4sus/inputs/openjdk-21-jdk_21.0.13~8ea-1_i386.deb +++ /srv/rebuilderd/tmp/rebuilderdOg4sus/out/openjdk-21-jdk_21.0.13~8ea-1_i386.deb ├── file list │ @@ -1,3 +1,3 @@ │ -rw-r--r-- 0 0 0 4 2026-10-08 06:37:43.000000 debian-binary │ -rw-r--r-- 0 0 0 1828 2026-10-08 06:37:43.000000 control.tar.xz │ --rw-r--r-- 0 0 0 3530776 2026-10-08 06:37:43.000000 data.tar.xz │ +-rw-r--r-- 0 0 0 3611088 2026-10-08 06:37:43.000000 data.tar.xz ├── control.tar.xz │ ├── control.tar │ │ ├── ./control │ │ │ @@ -1,13 +1,13 @@ │ │ │ Package: openjdk-21-jdk │ │ │ Source: openjdk-21 │ │ │ Version: 21.0.13~8ea-1 │ │ │ Architecture: i386 │ │ │ Maintainer: OpenJDK Team │ │ │ -Installed-Size: 3709 │ │ │ +Installed-Size: 3722 │ │ │ Depends: openjdk-21-jre (= 21.0.13~8ea-1), openjdk-21-jdk-headless (= 21.0.13~8ea-1), libc6 (>= 2.34), zlib1g (>= 1:1.1.4) │ │ │ Recommends: libxt-dev │ │ │ Suggests: openjdk-21-demo, openjdk-21-source, visualvm │ │ │ Provides: java-compiler, java-sdk (= 21), java10-sdk, java11-sdk, java12-sdk, java13-sdk, java14-sdk, java15-sdk, java16-sdk, java17-sdk, java18-sdk, java19-sdk, java2-sdk, java20-sdk, java21-sdk, java5-sdk, java6-sdk, java7-sdk, java8-sdk, java9-sdk │ │ │ Section: java │ │ │ Priority: optional │ │ │ Multi-Arch: same │ │ ├── ./md5sums │ │ │ ├── ./md5sums │ │ │ │┄ Files differ ├── data.tar.xz │ ├── data.tar │ │ ├── file list │ │ │ @@ -13,17 +13,17 @@ │ │ │ drwxr-xr-x 0 root (0) root (0) 0 2026-10-08 06:37:43.000000 ./usr/lib/jvm/java-21-openjdk-i386/man/man1/ │ │ │ -rw-r--r-- 0 root (0) root (0) 1723 2026-10-08 06:37:43.000000 ./usr/lib/jvm/java-21-openjdk-i386/man/man1/jconsole.1.gz │ │ │ drwxr-xr-x 0 root (0) root (0) 0 2026-10-08 06:37:43.000000 ./usr/lib/jvm/openjdk-21/ │ │ │ drwxr-xr-x 0 root (0) root (0) 0 2026-10-08 06:37:43.000000 ./usr/share/ │ │ │ drwxr-xr-x 0 root (0) root (0) 0 2026-10-08 06:37:43.000000 ./usr/share/doc/ │ │ │ drwxr-xr-x 0 root (0) root (0) 0 2026-10-08 06:37:43.000000 ./usr/share/doc/openjdk-21-jre-headless/ │ │ │ drwxr-xr-x 0 root (0) root (0) 0 2026-10-08 06:37:43.000000 ./usr/share/doc/openjdk-21-jre-headless/test-i386/ │ │ │ --rw-r--r-- 0 root (0) root (0) 26202 2026-10-08 06:37:43.000000 ./usr/share/doc/openjdk-21-jre-headless/test-i386/check-hotspot-hotspot.log.gz │ │ │ +-rw-r--r-- 0 root (0) root (0) 26128 2026-10-08 06:37:43.000000 ./usr/share/doc/openjdk-21-jre-headless/test-i386/check-hotspot-hotspot.log.gz │ │ │ -rw-r--r-- 0 root (0) root (0) 3921 2026-10-08 06:37:43.000000 ./usr/share/doc/openjdk-21-jre-headless/test-i386/check-jaxp-hotspot.log.gz │ │ │ -rw-r--r-- 0 root (0) root (0) 54986 2026-10-08 06:37:43.000000 ./usr/share/doc/openjdk-21-jre-headless/test-i386/check-jdk-hotspot.log.gz │ │ │ -rw-r--r-- 0 root (0) root (0) 35193 2026-10-08 06:37:43.000000 ./usr/share/doc/openjdk-21-jre-headless/test-i386/check-langtools-hotspot.log.gz │ │ │ --rw-r--r-- 0 root (0) root (0) 8550 2026-10-08 06:37:43.000000 ./usr/share/doc/openjdk-21-jre-headless/test-i386/failed_tests-hotspot.tar.gz │ │ │ +-rw-r--r-- 0 root (0) root (0) 8581 2026-10-08 06:37:43.000000 ./usr/share/doc/openjdk-21-jre-headless/test-i386/failed_tests-hotspot.tar.gz │ │ │ -rw-r--r-- 0 root (0) root (0) 3425 2026-10-08 06:37:43.000000 ./usr/share/doc/openjdk-21-jre-headless/test-i386/jtreg-summary-hotspot.log │ │ │ --rw-r--r-- 0 root (0) root (0) 124611 2026-10-08 06:37:43.000000 ./usr/share/doc/openjdk-21-jre-headless/test-i386/jtreg_output-hotspot.log.gz │ │ │ --rw-r--r-- 0 root (0) root (0) 3484664 2026-10-08 06:37:43.000000 ./usr/share/doc/openjdk-21-jre-headless/test-i386/jtreport-hotspot.tar.gz │ │ │ +-rw-r--r-- 0 root (0) root (0) 124578 2026-10-08 06:37:43.000000 ./usr/share/doc/openjdk-21-jre-headless/test-i386/jtreg_output-hotspot.log.gz │ │ │ +-rw-r--r-- 0 root (0) root (0) 3497159 2026-10-08 06:37:43.000000 ./usr/share/doc/openjdk-21-jre-headless/test-i386/jtreport-hotspot.tar.gz │ │ │ lrwxrwxrwx 0 root (0) root (0) 0 2026-10-08 06:37:43.000000 ./usr/lib/jvm/openjdk-21/src.zip -> lib/src.zip │ │ │ lrwxrwxrwx 0 root (0) root (0) 0 2026-10-08 06:37:43.000000 ./usr/share/doc/openjdk-21-jdk -> openjdk-21-jre │ │ ├── ./usr/share/doc/openjdk-21-jre-headless/test-i386/check-hotspot-hotspot.log.gz │ │ │ ├── check-hotspot-hotspot.log │ │ │ │ @@ -266,16 +266,14 @@ │ │ │ │ Passed: compiler/intrinsics/IntrinsicDisabledTest.java │ │ │ │ Passed: compiler/intrinsics/Test6982370.java │ │ │ │ Passed: compiler/intrinsics/Test8005419.java │ │ │ │ Passed: compiler/intrinsics/Test8215792.java │ │ │ │ Passed: compiler/intrinsics/Test8237524.java │ │ │ │ Passed: compiler/intrinsics/TestArraysHashCode.java │ │ │ │ Passed: compiler/intrinsics/TestCheckIndex.java │ │ │ │ -Passed: compiler/intrinsics/TestDoubleIsInfinite.java │ │ │ │ -Passed: compiler/intrinsics/TestFloatIsInfinite.java │ │ │ │ Passed: compiler/intrinsics/TestReferenceGetWithNull.java │ │ │ │ Passed: compiler/intrinsics/TestReferenceRefersTo.java │ │ │ │ Passed: compiler/intrinsics/TestRotate.java │ │ │ │ Passed: compiler/intrinsics/zip/TestAdler32.java │ │ │ │ Passed: compiler/intrinsics/zip/TestCRC32.java │ │ │ │ Passed: compiler/intrinsics/zip/TestCRC32C.java │ │ │ │ Passed: compiler/intrinsics/zip/TestFpRegsABI.java │ │ │ │ @@ -1441,21 +1439,18 @@ │ │ │ │ Passed: compiler/intrinsics/sha/sanity/TestSHA3Intrinsics.java │ │ │ │ Passed: compiler/intrinsics/sha/sanity/TestSHA3MultiBlockIntrinsics.java │ │ │ │ Passed: compiler/intrinsics/sha/sanity/TestSHA512Intrinsics.java │ │ │ │ Passed: compiler/intrinsics/sha/sanity/TestSHA512MultiBlockIntrinsics.java │ │ │ │ Passed: compiler/intrinsics/sha/TestDigest.java │ │ │ │ Passed: compiler/intrinsics/string/TestCopyValueOf.java │ │ │ │ Passed: compiler/intrinsics/string/TestCountPositives.java#id0 │ │ │ │ -Passed: compiler/intrinsics/string/TestCountPositives.java#id1 │ │ │ │ Passed: compiler/intrinsics/string/TestEncodeIntrinsics.java │ │ │ │ Passed: compiler/intrinsics/string/TestHasNegatives.java#id0 │ │ │ │ -Passed: compiler/intrinsics/string/TestHasNegatives.java#id1 │ │ │ │ Passed: compiler/intrinsics/string/TestStringConstruction.java │ │ │ │ Passed: compiler/intrinsics/string/TestStringConstructionIntrinsics.java#id0 │ │ │ │ -Passed: compiler/intrinsics/string/TestStringConstructionIntrinsics.java#id1 │ │ │ │ Passed: compiler/intrinsics/string/TestStringEqualsBadLength.java │ │ │ │ Passed: compiler/intrinsics/string/TestStringIndexOfCharIntrinsics.java │ │ │ │ Passed: compiler/intrinsics/string/TestStringIntrinsicMemoryFlow.java │ │ │ │ Passed: compiler/intrinsics/string/TestStringIntrinsicRangeChecks.java │ │ │ │ Passed: compiler/intrinsics/string/TestStringIntrinsics.java │ │ │ │ Passed: compiler/intrinsics/string/TestStringIntrinsics2.java │ │ │ │ Passed: compiler/intrinsics/string/TestStringLatin1IndexOfChar.java │ │ │ │ @@ -1529,22 +1524,14 @@ │ │ │ │ Passed: compiler/loopopts/superword/TestDependencyOffsets.java#avx1-v016-U │ │ │ │ Passed: compiler/loopopts/superword/TestDependencyOffsets.java#avx1-v032-A │ │ │ │ Passed: compiler/loopopts/superword/TestDependencyOffsets.java#avx1-v032-U │ │ │ │ Passed: compiler/loopopts/superword/TestDependencyOffsets.java#avx2-v016-A │ │ │ │ Passed: compiler/loopopts/superword/TestDependencyOffsets.java#avx2-v016-U │ │ │ │ Passed: compiler/loopopts/superword/TestDependencyOffsets.java#avx2-v032-A │ │ │ │ Passed: compiler/loopopts/superword/TestDependencyOffsets.java#avx2-v032-U │ │ │ │ -Passed: compiler/loopopts/superword/TestDependencyOffsets.java#avx512bw-v032-A │ │ │ │ -Passed: compiler/loopopts/superword/TestDependencyOffsets.java#avx512bw-v032-U │ │ │ │ -Passed: compiler/loopopts/superword/TestDependencyOffsets.java#avx512bw-v064-A │ │ │ │ -Passed: compiler/loopopts/superword/TestDependencyOffsets.java#avx512bw-v064-U │ │ │ │ -Passed: compiler/loopopts/superword/TestDependencyOffsets.java#avx512-v032-A │ │ │ │ -Passed: compiler/loopopts/superword/TestDependencyOffsets.java#avx512-v032-U │ │ │ │ -Passed: compiler/loopopts/superword/TestDependencyOffsets.java#avx512-v064-A │ │ │ │ -Passed: compiler/loopopts/superword/TestDependencyOffsets.java#avx512-v064-U │ │ │ │ Passed: compiler/loopopts/superword/TestDependencyOffsets.java#sse4-v002-A │ │ │ │ Passed: compiler/loopopts/superword/TestDependencyOffsets.java#sse4-v002-U │ │ │ │ Passed: compiler/loopopts/superword/TestDependencyOffsets.java#sse4-v004-A │ │ │ │ Passed: compiler/loopopts/superword/TestDependencyOffsets.java#sse4-v004-U │ │ │ │ Passed: compiler/loopopts/superword/TestDependencyOffsets.java#sse4-v008-A │ │ │ │ Passed: compiler/loopopts/superword/TestDependencyOffsets.java#sse4-v008-U │ │ │ │ Passed: compiler/loopopts/superword/TestDependencyOffsets.java#sse4-v016-A │ │ │ │ @@ -1820,15 +1807,14 @@ │ │ │ │ Passed: compiler/vectorization/TestMemoryVectorMismatched.java │ │ │ │ Passed: compiler/vectorization/TestNaNVector.java │ │ │ │ Passed: compiler/vectorization/TestNarrowedIntegerReverseBytes.java │ │ │ │ Passed: compiler/vectorization/TestOptionVectorize.java │ │ │ │ Passed: compiler/vectorization/TestOptionVectorizeIR.java │ │ │ │ Passed: compiler/vectorization/TestOverlappingMismatchedAccesses.java │ │ │ │ Passed: compiler/vectorization/TestPopCountVector.java │ │ │ │ -Passed: compiler/vectorization/TestPopCountVectorLong.java │ │ │ │ Passed: compiler/vectorization/TestReplicateLoopIV.java │ │ │ │ Passed: compiler/vectorization/TestRotateByteAndShortVector.java │ │ │ │ Passed: compiler/vectorization/TestSmallVectorPopIndex.java │ │ │ │ Passed: compiler/vectorization/TestSubwordReverseBytes.java │ │ │ │ Passed: compiler/vectorization/TestUnexpectedLoadOrdering.java │ │ │ │ Passed: compiler/vectorization/TestVectorsNotSavedAtSafepoint.java │ │ │ │ Passed: compiler/vectorization/TestVectorUnalignedOffset.java │ │ │ │ @@ -2820,14 +2806,14 @@ │ │ │ │ Passed: serviceability/tmtools/jstat/GcCapacityTest.java │ │ │ │ Passed: serviceability/tmtools/jstat/GcCauseTest01.java │ │ │ │ Passed: serviceability/tmtools/jstat/GcCauseTest02.java │ │ │ │ Passed: serviceability/tmtools/jstat/GcCauseTest03.java │ │ │ │ Passed: serviceability/tmtools/jstat/GcNewTest.java │ │ │ │ Passed: serviceability/tmtools/jstat/GcTest01.java │ │ │ │ Passed: serviceability/tmtools/jstat/GcTest02.java │ │ │ │ -Test results: passed: 2,824; skipped: 7; excluded: 45; did not match keywords: 75; did not meet module requirements: 85; did not meet platform requirements: 415 │ │ │ │ +Test results: passed: 2,810; skipped: 7; excluded: 45; did not match keywords: 75; did not meet module requirements: 85; did not meet platform requirements: 429 │ │ │ │ Framework-based tests: 437 = 408 TestNG + 29 JUnit │ │ │ │ Report written to /build/reproducible-path/openjdk-21-21.0.13~8ea/jtreg-test-output/hotspot/0/JTreport/html/report.html │ │ │ │ Results written to /tmp/hotspot/JTwork │ │ │ │ [debian/tests/jtreg-autopkgtest.sh] nothing to cleanup │ │ │ │ Unable to compare jtreg results: no build jtreport found for hotspot/i386. │ │ │ │ Reason: '/usr/share/doc/openjdk-21-jre-headless//test-i386/jtreport-hotspot.tar.gz' does not exist. │ │ ├── ./usr/share/doc/openjdk-21-jre-headless/test-i386/failed_tests-hotspot.tar.gz │ │ │ ├── failed_tests-hotspot.tar │ │ │ │ ├── file list │ │ │ │ │ @@ -1,9 +1,9 @@ │ │ │ │ │ --rw-r--r-- 0 sbuild (999) sbuild (999) 6795 2026-10-08 18:59:15.000000 jtreg-test-output/jdk/JTwork/java/net/MulticastSocket/B6427403.jtr │ │ │ │ │ --rw-r--r-- 0 sbuild (999) sbuild (999) 7822 2026-10-08 18:59:15.000000 jtreg-test-output/jdk/JTwork/java/net/MulticastSocket/NoLoopbackPackets.jtr │ │ │ │ │ --rw-r--r-- 0 sbuild (999) sbuild (999) 7828 2026-10-08 18:59:15.000000 jtreg-test-output/jdk/JTwork/java/net/MulticastSocket/Promiscuous.jtr │ │ │ │ │ --rw-r--r-- 0 sbuild (999) sbuild (999) 8439 2026-10-08 18:59:16.000000 jtreg-test-output/jdk/JTwork/java/net/MulticastSocket/SetLoopbackMode.jtr │ │ │ │ │ --rw-r--r-- 0 sbuild (999) sbuild (999) 8857 2026-10-08 18:59:16.000000 jtreg-test-output/jdk/JTwork/java/net/MulticastSocket/SetLoopbackModeIPv4.jtr │ │ │ │ │ --rw-r--r-- 0 sbuild (999) sbuild (999) 9716 2026-10-08 18:59:16.000000 jtreg-test-output/jdk/JTwork/java/net/MulticastSocket/Test.jtr │ │ │ │ │ --rw-r--r-- 0 sbuild (999) sbuild (999) 7464 2026-10-08 18:59:16.000000 jtreg-test-output/jdk/JTwork/java/net/SocketOption/OptionsTest.jtr │ │ │ │ │ --rw-r--r-- 0 sbuild (999) sbuild (999) 15144 2026-10-08 18:59:17.000000 jtreg-test-output/jdk/JTwork/java/net/SocketPermission/SocketPermissionTest.jtr │ │ │ │ │ --rw-r--r-- 0 sbuild (999) sbuild (999) 25769 2026-10-08 18:59:20.000000 jtreg-test-output/jdk/JTwork/sun/security/krb5/auto/Addresses.jtr │ │ │ │ │ +-rw-r--r-- 0 sbuild (999) sbuild (999) 6794 2026-10-16 11:27:34.000000 jtreg-test-output/jdk/JTwork/java/net/MulticastSocket/B6427403.jtr │ │ │ │ │ +-rw-r--r-- 0 sbuild (999) sbuild (999) 7818 2026-10-16 11:27:34.000000 jtreg-test-output/jdk/JTwork/java/net/MulticastSocket/NoLoopbackPackets.jtr │ │ │ │ │ +-rw-r--r-- 0 sbuild (999) sbuild (999) 7827 2026-10-16 11:27:34.000000 jtreg-test-output/jdk/JTwork/java/net/MulticastSocket/Promiscuous.jtr │ │ │ │ │ +-rw-r--r-- 0 sbuild (999) sbuild (999) 8441 2026-10-16 11:27:35.000000 jtreg-test-output/jdk/JTwork/java/net/MulticastSocket/SetLoopbackMode.jtr │ │ │ │ │ +-rw-r--r-- 0 sbuild (999) sbuild (999) 8858 2026-10-16 11:27:35.000000 jtreg-test-output/jdk/JTwork/java/net/MulticastSocket/SetLoopbackModeIPv4.jtr │ │ │ │ │ +-rw-r--r-- 0 sbuild (999) sbuild (999) 9713 2026-10-16 11:27:35.000000 jtreg-test-output/jdk/JTwork/java/net/MulticastSocket/Test.jtr │ │ │ │ │ +-rw-r--r-- 0 sbuild (999) sbuild (999) 7465 2026-10-16 11:27:35.000000 jtreg-test-output/jdk/JTwork/java/net/SocketOption/OptionsTest.jtr │ │ │ │ │ +-rw-r--r-- 0 sbuild (999) sbuild (999) 15147 2026-10-16 11:27:37.000000 jtreg-test-output/jdk/JTwork/java/net/SocketPermission/SocketPermissionTest.jtr │ │ │ │ │ +-rw-r--r-- 0 sbuild (999) sbuild (999) 25768 2026-10-16 11:27:41.000000 jtreg-test-output/jdk/JTwork/sun/security/krb5/auto/Addresses.jtr │ │ │ │ ├── jtreg-test-output/jdk/JTwork/java/net/MulticastSocket/B6427403.jtr │ │ │ │ │ @@ -1,70 +1,70 @@ │ │ │ │ │ #Test Results (version 2) │ │ │ │ │ -#Thu Oct 08 18:59:15 UTC 2026 │ │ │ │ │ +#Fri Oct 16 11:27:34 UTC 2026 │ │ │ │ │ #-----testdescription----- │ │ │ │ │ $file=/build/reproducible-path/openjdk-21-21.0.13~8ea/test/jdk/java/net/MulticastSocket/B6427403.java │ │ │ │ │ $root=/build/reproducible-path/openjdk-21-21.0.13~8ea/test/jdk │ │ │ │ │ keywords=bug6427403 │ │ │ │ │ run=USER_SPECIFIED main B6427403\n │ │ │ │ │ source=B6427403.java │ │ │ │ │ title=java.net.MulticastSocket.joinGroup() reports 'socket closed' │ │ │ │ │ │ │ │ │ │ #-----environment----- │ │ │ │ │ │ │ │ │ │ #-----testresult----- │ │ │ │ │ description=file\:/build/reproducible-path/openjdk-21-21.0.13~8ea/test/jdk/java/net/MulticastSocket/B6427403.java │ │ │ │ │ -elapsed=337 0\:00\:00.337 │ │ │ │ │ -end=Thu Oct 08 18\:59\:15 UTC 2026 │ │ │ │ │ +elapsed=627 0\:00\:00.627 │ │ │ │ │ +end=Fri Oct 16 11\:27\:34 UTC 2026 │ │ │ │ │ environment=regtest │ │ │ │ │ execStatus=Failed. Execution failed\: `main' threw exception\: java.net.SocketException\: No such device (setsockopt failed) │ │ │ │ │ harnessLoaderMode=Classpath Loader │ │ │ │ │ harnessVariety=Full Bundle │ │ │ │ │ hostname=sbuild │ │ │ │ │ javatestOS=Linux 6.12.111+deb13-amd64 (i386) │ │ │ │ │ javatestVersion=6.0-ea+b26-2026-03-18-${BUILT_FROM_COMMIT} │ │ │ │ │ jtregVersion=jtreg 8.3 src 1 │ │ │ │ │ script=com.sun.javatest.regtest.exec.RegressionScript │ │ │ │ │ sections=script_messages build main │ │ │ │ │ -start=Thu Oct 08 18\:59\:15 UTC 2026 │ │ │ │ │ +start=Fri Oct 16 11\:27\:34 UTC 2026 │ │ │ │ │ test=java/net/MulticastSocket/B6427403.java │ │ │ │ │ testJDK=/build/reproducible-path/openjdk-21-21.0.13~8ea/build/bootcycle-build/images/jdk │ │ │ │ │ -testJDK_OS=[name\:Linux,arch\:i386,version\:6.12.111+deb13-amd64,family\:linux,simple_arch\:i586,simple_version\:6.12,processors\:6,maxMemory\:16773820416,maxSwap\:182536105984] │ │ │ │ │ +testJDK_OS=[name\:Linux,arch\:i386,version\:6.12.111+deb13-amd64,family\:linux,simple_arch\:i586,simple_version\:6.12,processors\:8,maxMemory\:16775348224,maxSwap\:34358685696] │ │ │ │ │ testJDK_os.arch=i386 │ │ │ │ │ testJDK_os.name=Linux │ │ │ │ │ testJDK_os.version=6.12.111+deb13-amd64 │ │ │ │ │ -totalTime=339 │ │ │ │ │ +totalTime=632 │ │ │ │ │ user.name=sbuild │ │ │ │ │ work=/tmp/jdk/JTwork/java/net/MulticastSocket │ │ │ │ │ │ │ │ │ │ #section:script_messages │ │ │ │ │ ----------messages:(4/264)---------- │ │ │ │ │ JDK under test: /build/reproducible-path/openjdk-21-21.0.13~8ea/build/bootcycle-build/images/jdk │ │ │ │ │ openjdk version "21.0.13-ea" 2026-10-20 │ │ │ │ │ OpenJDK Runtime Environment (build 21.0.13-ea+8-1-Debian) │ │ │ │ │ OpenJDK Server VM (build 21.0.13-ea+8-1-Debian, mixed mode, sharing) │ │ │ │ │ │ │ │ │ │ #section:build │ │ │ │ │ ----------messages:(5/178)---------- │ │ │ │ │ command: build B6427403 │ │ │ │ │ reason: Named class compiled on demand │ │ │ │ │ -started: Thu Oct 08 18:59:15.460 UTC 2026 │ │ │ │ │ -finished: Thu Oct 08 18:59:15.467 UTC 2026 │ │ │ │ │ -elapsed time (seconds): 0.007 │ │ │ │ │ +started: Fri Oct 16 11:27:34.161 UTC 2026 │ │ │ │ │ +finished: Fri Oct 16 11:27:34.175 UTC 2026 │ │ │ │ │ +elapsed time (seconds): 0.014 │ │ │ │ │ result: Passed. All files up to date │ │ │ │ │ │ │ │ │ │ #section:main │ │ │ │ │ ----------messages:(8/234)---------- │ │ │ │ │ command: main B6427403 │ │ │ │ │ reason: User specified action: run main B6427403 │ │ │ │ │ -started: Thu Oct 08 18:59:15.468 UTC 2026 │ │ │ │ │ +started: Fri Oct 16 11:27:34.177 UTC 2026 │ │ │ │ │ Mode: agentvm │ │ │ │ │ Agent id: 1 │ │ │ │ │ -Process id: 1021391 │ │ │ │ │ -finished: Thu Oct 08 18:59:15.734 UTC 2026 │ │ │ │ │ -elapsed time (seconds): 0.266 │ │ │ │ │ +Process id: 3381293 │ │ │ │ │ +finished: Fri Oct 16 11:27:34.671 UTC 2026 │ │ │ │ │ +elapsed time (seconds): 0.494 │ │ │ │ │ ----------configuration:(15/668)---------- │ │ │ │ │ Boot Layer │ │ │ │ │ class path: /usr/share/jtreg/lib/javatest.jar │ │ │ │ │ /usr/share/jtreg/lib/jtreg.jar │ │ │ │ │ /usr/share/jtreg/lib/junit-platform-console-standalone.jar │ │ │ │ │ /usr/share/jtreg/lib/testng.jar │ │ │ │ │ /usr/share/jtreg/lib/guice.jar │ │ │ │ ├── jtreg-test-output/jdk/JTwork/java/net/MulticastSocket/NoLoopbackPackets.jtr │ │ │ │ │ @@ -1,75 +1,75 @@ │ │ │ │ │ #Test Results (version 2) │ │ │ │ │ -#Thu Oct 08 18:59:15 UTC 2026 │ │ │ │ │ +#Fri Oct 16 11:27:34 UTC 2026 │ │ │ │ │ #-----testdescription----- │ │ │ │ │ $file=/build/reproducible-path/openjdk-21-21.0.13~8ea/test/jdk/java/net/MulticastSocket/NoLoopbackPackets.java │ │ │ │ │ $root=/build/reproducible-path/openjdk-21-21.0.13~8ea/test/jdk │ │ │ │ │ keywords=bug4742177 │ │ │ │ │ library=/test/lib │ │ │ │ │ requires=os.family \!\= "windows" │ │ │ │ │ run=ASSUMED_ACTION main NoLoopbackPackets\n │ │ │ │ │ source=NoLoopbackPackets.java │ │ │ │ │ title=Re-test IPv6 (and specifically MulticastSocket) with latest Linux & USAGI code │ │ │ │ │ │ │ │ │ │ #-----environment----- │ │ │ │ │ │ │ │ │ │ #-----testresult----- │ │ │ │ │ description=file\:/build/reproducible-path/openjdk-21-21.0.13~8ea/test/jdk/java/net/MulticastSocket/NoLoopbackPackets.java │ │ │ │ │ -elapsed=67 0\:00\:00.067 │ │ │ │ │ -end=Thu Oct 08 18\:59\:15 UTC 2026 │ │ │ │ │ +elapsed=85 0\:00\:00.085 │ │ │ │ │ +end=Fri Oct 16 11\:27\:34 UTC 2026 │ │ │ │ │ environment=regtest │ │ │ │ │ execStatus=Failed. Execution failed\: `main' threw exception\: java.net.SocketException\: No such device (setsockopt failed) │ │ │ │ │ harnessLoaderMode=Classpath Loader │ │ │ │ │ harnessVariety=Full Bundle │ │ │ │ │ hostname=sbuild │ │ │ │ │ javatestOS=Linux 6.12.111+deb13-amd64 (i386) │ │ │ │ │ javatestVersion=6.0-ea+b26-2026-03-18-${BUILT_FROM_COMMIT} │ │ │ │ │ jtregVersion=jtreg 8.3 src 1 │ │ │ │ │ script=com.sun.javatest.regtest.exec.RegressionScript │ │ │ │ │ sections=script_messages build main │ │ │ │ │ -start=Thu Oct 08 18\:59\:15 UTC 2026 │ │ │ │ │ +start=Fri Oct 16 11\:27\:34 UTC 2026 │ │ │ │ │ test=java/net/MulticastSocket/NoLoopbackPackets.java │ │ │ │ │ testJDK=/build/reproducible-path/openjdk-21-21.0.13~8ea/build/bootcycle-build/images/jdk │ │ │ │ │ -testJDK_OS=[name\:Linux,arch\:i386,version\:6.12.111+deb13-amd64,family\:linux,simple_arch\:i586,simple_version\:6.12,processors\:6,maxMemory\:16773820416,maxSwap\:182536105984] │ │ │ │ │ +testJDK_OS=[name\:Linux,arch\:i386,version\:6.12.111+deb13-amd64,family\:linux,simple_arch\:i586,simple_version\:6.12,processors\:8,maxMemory\:16775348224,maxSwap\:34358685696] │ │ │ │ │ testJDK_os.arch=i386 │ │ │ │ │ testJDK_os.name=Linux │ │ │ │ │ testJDK_os.version=6.12.111+deb13-amd64 │ │ │ │ │ -totalTime=68 │ │ │ │ │ +totalTime=86 │ │ │ │ │ user.name=sbuild │ │ │ │ │ work=/tmp/jdk/JTwork/java/net/MulticastSocket │ │ │ │ │ │ │ │ │ │ #section:script_messages │ │ │ │ │ ----------messages:(7/474)---------- │ │ │ │ │ JDK under test: /build/reproducible-path/openjdk-21-21.0.13~8ea/build/bootcycle-build/images/jdk │ │ │ │ │ openjdk version "21.0.13-ea" 2026-10-20 │ │ │ │ │ OpenJDK Runtime Environment (build 21.0.13-ea+8-1-Debian) │ │ │ │ │ OpenJDK Server VM (build 21.0.13-ea+8-1-Debian, mixed mode, sharing) │ │ │ │ │ Library /test/lib; kind: packages │ │ │ │ │ source directory: /build/reproducible-path/openjdk-21-21.0.13~8ea/test/lib │ │ │ │ │ class directory: /tmp/jdk/JTwork/classes/java/net/MulticastSocket/NoLoopbackPackets.d/test/lib │ │ │ │ │ │ │ │ │ │ #section:build │ │ │ │ │ -----------messages:(5/187)---------- │ │ │ │ │ +----------messages:(5/185)---------- │ │ │ │ │ command: build NoLoopbackPackets │ │ │ │ │ reason: Named class compiled on demand │ │ │ │ │ -started: Thu Oct 08 18:59:15.740 UTC 2026 │ │ │ │ │ -finished: Thu Oct 08 18:59:15.741 UTC 2026 │ │ │ │ │ -elapsed time (seconds): 0.001 │ │ │ │ │ +started: Fri Oct 16 11:27:34.689 UTC 2026 │ │ │ │ │ +finished: Fri Oct 16 11:27:34.689 UTC 2026 │ │ │ │ │ +elapsed time (seconds): 0.0 │ │ │ │ │ result: Passed. All files up to date │ │ │ │ │ │ │ │ │ │ #section:main │ │ │ │ │ -----------messages:(8/264)---------- │ │ │ │ │ +----------messages:(8/263)---------- │ │ │ │ │ command: main NoLoopbackPackets │ │ │ │ │ reason: Assumed action based on file name: run main NoLoopbackPackets │ │ │ │ │ -started: Thu Oct 08 18:59:15.741 UTC 2026 │ │ │ │ │ +started: Fri Oct 16 11:27:34.690 UTC 2026 │ │ │ │ │ Mode: agentvm │ │ │ │ │ Agent id: 1 │ │ │ │ │ -Process id: 1021391 │ │ │ │ │ -finished: Thu Oct 08 18:59:15.806 UTC 2026 │ │ │ │ │ -elapsed time (seconds): 0.065 │ │ │ │ │ +Process id: 3381293 │ │ │ │ │ +finished: Fri Oct 16 11:27:34.770 UTC 2026 │ │ │ │ │ +elapsed time (seconds): 0.08 │ │ │ │ │ ----------configuration:(17/840)---------- │ │ │ │ │ Boot Layer │ │ │ │ │ class path: /usr/share/jtreg/lib/javatest.jar │ │ │ │ │ /usr/share/jtreg/lib/jtreg.jar │ │ │ │ │ /usr/share/jtreg/lib/junit-platform-console-standalone.jar │ │ │ │ │ /usr/share/jtreg/lib/testng.jar │ │ │ │ │ /usr/share/jtreg/lib/guice.jar │ │ │ │ │ @@ -113,15 +113,15 @@ │ │ │ │ │ -Dtest.class.path=/tmp/jdk/JTwork/classes/java/net/MulticastSocket/NoLoopbackPackets.d:/tmp/jdk/JTwork/classes/java/net/MulticastSocket/NoLoopbackPackets.d/test/lib \\ │ │ │ │ │ -Dtest.class.path.prefix=/tmp/jdk/JTwork/classes/java/net/MulticastSocket/NoLoopbackPackets.d:/build/reproducible-path/openjdk-21-21.0.13~8ea/test/jdk/java/net/MulticastSocket:/tmp/jdk/JTwork/classes/java/net/MulticastSocket/NoLoopbackPackets.d/test/lib \\ │ │ │ │ │ -classpath /tmp/jdk/JTwork/classes/java/net/MulticastSocket/NoLoopbackPackets.d:/build/reproducible-path/openjdk-21-21.0.13~8ea/test/jdk/java/net/MulticastSocket:/tmp/jdk/JTwork/classes/java/net/MulticastSocket/NoLoopbackPackets.d/test/lib:/build/reproducible-path/openjdk-21-21.0.13~8ea/test/lib:/usr/share/jtreg/lib/javatest.jar:/usr/share/jtreg/lib/jtreg.jar \\ │ │ │ │ │ NoLoopbackPackets │ │ │ │ │ ----------stdout:(0/0)---------- │ │ │ │ │ ----------stderr:(0/0)---------- │ │ │ │ │ ----------System.out:(1/32)---------- │ │ │ │ │ -joining group: /224.1.1.1:47627 │ │ │ │ │ +joining group: /224.1.1.1:34038 │ │ │ │ │ ----------System.err:(17/1050)---------- │ │ │ │ │ java.net.SocketException: No such device (setsockopt failed) │ │ │ │ │ at java.base/sun.nio.ch.Net.joinOrDrop4(Native Method) │ │ │ │ │ at java.base/sun.nio.ch.Net.join4(Net.java:720) │ │ │ │ │ at java.base/sun.nio.ch.DatagramChannelImpl.innerJoin(DatagramChannelImpl.java:1676) │ │ │ │ │ at java.base/sun.nio.ch.DatagramChannelImpl.join(DatagramChannelImpl.java:1694) │ │ │ │ │ at java.base/sun.nio.ch.DatagramSocketAdaptor.joinGroup(DatagramSocketAdaptor.java:494) │ │ │ │ ├── jtreg-test-output/jdk/JTwork/java/net/MulticastSocket/Promiscuous.jtr │ │ │ │ │ @@ -1,42 +1,42 @@ │ │ │ │ │ #Test Results (version 2) │ │ │ │ │ -#Thu Oct 08 18:59:15 UTC 2026 │ │ │ │ │ +#Fri Oct 16 11:27:34 UTC 2026 │ │ │ │ │ #-----testdescription----- │ │ │ │ │ $file=/build/reproducible-path/openjdk-21-21.0.13~8ea/test/jdk/java/net/MulticastSocket/Promiscuous.java │ │ │ │ │ $root=/build/reproducible-path/openjdk-21-21.0.13~8ea/test/jdk │ │ │ │ │ keywords=bug8014499 bug8219804 othervm │ │ │ │ │ library=/test/lib │ │ │ │ │ run=USER_SPECIFIED main Promiscuous\nUSER_SPECIFIED main/othervm -Djava.net.preferIPv4Stack\=true Promiscuous\n │ │ │ │ │ source=Promiscuous.java │ │ │ │ │ title=Test for interference when two sockets are bound to the same port but joined to different multicast groups │ │ │ │ │ │ │ │ │ │ #-----environment----- │ │ │ │ │ │ │ │ │ │ #-----testresult----- │ │ │ │ │ description=file\:/build/reproducible-path/openjdk-21-21.0.13~8ea/test/jdk/java/net/MulticastSocket/Promiscuous.java │ │ │ │ │ -elapsed=102 0\:00\:00.102 │ │ │ │ │ -end=Thu Oct 08 18\:59\:15 UTC 2026 │ │ │ │ │ +elapsed=117 0\:00\:00.117 │ │ │ │ │ +end=Fri Oct 16 11\:27\:34 UTC 2026 │ │ │ │ │ environment=regtest │ │ │ │ │ execStatus=Failed. Execution failed\: `main' threw exception\: java.net.SocketException\: Network is unreachable │ │ │ │ │ harnessLoaderMode=Classpath Loader │ │ │ │ │ harnessVariety=Full Bundle │ │ │ │ │ hostname=sbuild │ │ │ │ │ javatestOS=Linux 6.12.111+deb13-amd64 (i386) │ │ │ │ │ javatestVersion=6.0-ea+b26-2026-03-18-${BUILT_FROM_COMMIT} │ │ │ │ │ jtregVersion=jtreg 8.3 src 1 │ │ │ │ │ script=com.sun.javatest.regtest.exec.RegressionScript │ │ │ │ │ sections=script_messages build main │ │ │ │ │ -start=Thu Oct 08 18\:59\:15 UTC 2026 │ │ │ │ │ +start=Fri Oct 16 11\:27\:34 UTC 2026 │ │ │ │ │ test=java/net/MulticastSocket/Promiscuous.java │ │ │ │ │ testJDK=/build/reproducible-path/openjdk-21-21.0.13~8ea/build/bootcycle-build/images/jdk │ │ │ │ │ -testJDK_OS=[name\:Linux,arch\:i386,version\:6.12.111+deb13-amd64,family\:linux,simple_arch\:i586,simple_version\:6.12,processors\:6,maxMemory\:16773820416,maxSwap\:182536105984] │ │ │ │ │ +testJDK_OS=[name\:Linux,arch\:i386,version\:6.12.111+deb13-amd64,family\:linux,simple_arch\:i586,simple_version\:6.12,processors\:8,maxMemory\:16775348224,maxSwap\:34358685696] │ │ │ │ │ testJDK_os.arch=i386 │ │ │ │ │ testJDK_os.name=Linux │ │ │ │ │ testJDK_os.version=6.12.111+deb13-amd64 │ │ │ │ │ -totalTime=102 │ │ │ │ │ +totalTime=119 │ │ │ │ │ user.name=sbuild │ │ │ │ │ work=/tmp/jdk/JTwork/java/net/MulticastSocket │ │ │ │ │ │ │ │ │ │ #section:script_messages │ │ │ │ │ ----------messages:(7/468)---------- │ │ │ │ │ JDK under test: /build/reproducible-path/openjdk-21-21.0.13~8ea/build/bootcycle-build/images/jdk │ │ │ │ │ openjdk version "21.0.13-ea" 2026-10-20 │ │ │ │ │ @@ -46,29 +46,29 @@ │ │ │ │ │ source directory: /build/reproducible-path/openjdk-21-21.0.13~8ea/test/lib │ │ │ │ │ class directory: /tmp/jdk/JTwork/classes/java/net/MulticastSocket/Promiscuous.d/test/lib │ │ │ │ │ │ │ │ │ │ #section:build │ │ │ │ │ ----------messages:(5/179)---------- │ │ │ │ │ command: build Promiscuous │ │ │ │ │ reason: Named class compiled on demand │ │ │ │ │ -started: Thu Oct 08 18:59:15.812 UTC 2026 │ │ │ │ │ -finished: Thu Oct 08 18:59:15.812 UTC 2026 │ │ │ │ │ +started: Fri Oct 16 11:27:34.780 UTC 2026 │ │ │ │ │ +finished: Fri Oct 16 11:27:34.780 UTC 2026 │ │ │ │ │ elapsed time (seconds): 0.0 │ │ │ │ │ result: Passed. All files up to date │ │ │ │ │ │ │ │ │ │ #section:main │ │ │ │ │ ----------messages:(8/240)---------- │ │ │ │ │ command: main Promiscuous │ │ │ │ │ reason: User specified action: run main Promiscuous │ │ │ │ │ -started: Thu Oct 08 18:59:15.812 UTC 2026 │ │ │ │ │ +started: Fri Oct 16 11:27:34.780 UTC 2026 │ │ │ │ │ Mode: agentvm │ │ │ │ │ Agent id: 1 │ │ │ │ │ -Process id: 1021391 │ │ │ │ │ -finished: Thu Oct 08 18:59:15.911 UTC 2026 │ │ │ │ │ -elapsed time (seconds): 0.099 │ │ │ │ │ +Process id: 3381293 │ │ │ │ │ +finished: Fri Oct 16 11:27:34.894 UTC 2026 │ │ │ │ │ +elapsed time (seconds): 0.114 │ │ │ │ │ ----------configuration:(17/828)---------- │ │ │ │ │ Boot Layer │ │ │ │ │ class path: /usr/share/jtreg/lib/javatest.jar │ │ │ │ │ /usr/share/jtreg/lib/jtreg.jar │ │ │ │ │ /usr/share/jtreg/lib/junit-platform-console-standalone.jar │ │ │ │ │ /usr/share/jtreg/lib/testng.jar │ │ │ │ │ /usr/share/jtreg/lib/guice.jar │ │ │ │ │ @@ -112,16 +112,16 @@ │ │ │ │ │ -Dtest.class.path=/tmp/jdk/JTwork/classes/java/net/MulticastSocket/Promiscuous.d:/tmp/jdk/JTwork/classes/java/net/MulticastSocket/Promiscuous.d/test/lib \\ │ │ │ │ │ -Dtest.class.path.prefix=/tmp/jdk/JTwork/classes/java/net/MulticastSocket/Promiscuous.d:/build/reproducible-path/openjdk-21-21.0.13~8ea/test/jdk/java/net/MulticastSocket:/tmp/jdk/JTwork/classes/java/net/MulticastSocket/Promiscuous.d/test/lib \\ │ │ │ │ │ -classpath /tmp/jdk/JTwork/classes/java/net/MulticastSocket/Promiscuous.d:/build/reproducible-path/openjdk-21-21.0.13~8ea/test/jdk/java/net/MulticastSocket:/tmp/jdk/JTwork/classes/java/net/MulticastSocket/Promiscuous.d/test/lib:/build/reproducible-path/openjdk-21-21.0.13~8ea/test/lib:/usr/share/jtreg/lib/javatest.jar:/usr/share/jtreg/lib/jtreg.jar \\ │ │ │ │ │ Promiscuous │ │ │ │ │ ----------stdout:(0/0)---------- │ │ │ │ │ ----------stderr:(0/0)---------- │ │ │ │ │ ----------System.out:(2/58)---------- │ │ │ │ │ -Using port: 46478 │ │ │ │ │ -Sending datagram to: /224.1.1.120/46478 │ │ │ │ │ +Using port: 35201 │ │ │ │ │ +Sending datagram to: /224.1.1.120/35201 │ │ │ │ │ ----------System.err:(18/1123)---------- │ │ │ │ │ java.net.SocketException: Network is unreachable │ │ │ │ │ at java.base/sun.nio.ch.DatagramChannelImpl.send0(Native Method) │ │ │ │ │ at java.base/sun.nio.ch.DatagramChannelImpl.sendFromNativeBuffer(DatagramChannelImpl.java:1005) │ │ │ │ │ at java.base/sun.nio.ch.DatagramChannelImpl.send(DatagramChannelImpl.java:966) │ │ │ │ │ at java.base/sun.nio.ch.DatagramChannelImpl.send(DatagramChannelImpl.java:889) │ │ │ │ │ at java.base/sun.nio.ch.DatagramChannelImpl.blockingSend(DatagramChannelImpl.java:952) │ │ │ │ ├── jtreg-test-output/jdk/JTwork/java/net/MulticastSocket/SetLoopbackMode.jtr │ │ │ │ │ @@ -1,85 +1,85 @@ │ │ │ │ │ #Test Results (version 2) │ │ │ │ │ -#Thu Oct 08 18:59:16 UTC 2026 │ │ │ │ │ +#Fri Oct 16 11:27:35 UTC 2026 │ │ │ │ │ #-----testdescription----- │ │ │ │ │ $file=/build/reproducible-path/openjdk-21-21.0.13~8ea/test/jdk/java/net/MulticastSocket/SetLoopbackMode.java │ │ │ │ │ $root=/build/reproducible-path/openjdk-21-21.0.13~8ea/test/jdk │ │ │ │ │ keywords=bug4686717 othervm │ │ │ │ │ library=/test/lib │ │ │ │ │ modules=java.base/java.net\:+open │ │ │ │ │ run=USER_SPECIFIED build jdk.test.lib.NetworkConfiguration jdk.test.lib.Platform\nUSER_SPECIFIED main/othervm SetLoopbackMode\n │ │ │ │ │ source=SetLoopbackMode.java │ │ │ │ │ title=Test MulticastSocket.setLoopbackMode │ │ │ │ │ │ │ │ │ │ #-----environment----- │ │ │ │ │ │ │ │ │ │ #-----testresult----- │ │ │ │ │ description=file\:/build/reproducible-path/openjdk-21-21.0.13~8ea/test/jdk/java/net/MulticastSocket/SetLoopbackMode.java │ │ │ │ │ -elapsed=98 0\:00\:00.098 │ │ │ │ │ -end=Thu Oct 08 18\:59\:16 UTC 2026 │ │ │ │ │ +elapsed=198 0\:00\:00.198 │ │ │ │ │ +end=Fri Oct 16 11\:27\:35 UTC 2026 │ │ │ │ │ environment=regtest │ │ │ │ │ execStatus=Failed. Execution failed\: `main' threw exception\: java.net.SocketException\: No such device (setsockopt failed) │ │ │ │ │ harnessLoaderMode=Classpath Loader │ │ │ │ │ harnessVariety=Full Bundle │ │ │ │ │ hostname=sbuild │ │ │ │ │ javatestOS=Linux 6.12.111+deb13-amd64 (i386) │ │ │ │ │ javatestVersion=6.0-ea+b26-2026-03-18-${BUILT_FROM_COMMIT} │ │ │ │ │ jtregVersion=jtreg 8.3 src 1 │ │ │ │ │ modules=java.base/java.net\:+open │ │ │ │ │ script=com.sun.javatest.regtest.exec.RegressionScript │ │ │ │ │ sections=script_messages build build main │ │ │ │ │ -start=Thu Oct 08 18\:59\:15 UTC 2026 │ │ │ │ │ +start=Fri Oct 16 11\:27\:34 UTC 2026 │ │ │ │ │ test=java/net/MulticastSocket/SetLoopbackMode.java │ │ │ │ │ testJDK=/build/reproducible-path/openjdk-21-21.0.13~8ea/build/bootcycle-build/images/jdk │ │ │ │ │ -testJDK_OS=[name\:Linux,arch\:i386,version\:6.12.111+deb13-amd64,family\:linux,simple_arch\:i586,simple_version\:6.12,processors\:6,maxMemory\:16773820416,maxSwap\:182536105984] │ │ │ │ │ +testJDK_OS=[name\:Linux,arch\:i386,version\:6.12.111+deb13-amd64,family\:linux,simple_arch\:i586,simple_version\:6.12,processors\:8,maxMemory\:16775348224,maxSwap\:34358685696] │ │ │ │ │ testJDK_os.arch=i386 │ │ │ │ │ testJDK_os.name=Linux │ │ │ │ │ testJDK_os.version=6.12.111+deb13-amd64 │ │ │ │ │ -totalTime=102 │ │ │ │ │ +totalTime=199 │ │ │ │ │ user.name=sbuild │ │ │ │ │ work=/tmp/jdk/JTwork/java/net/MulticastSocket │ │ │ │ │ │ │ │ │ │ #section:script_messages │ │ │ │ │ ----------messages:(7/472)---------- │ │ │ │ │ JDK under test: /build/reproducible-path/openjdk-21-21.0.13~8ea/build/bootcycle-build/images/jdk │ │ │ │ │ openjdk version "21.0.13-ea" 2026-10-20 │ │ │ │ │ OpenJDK Runtime Environment (build 21.0.13-ea+8-1-Debian) │ │ │ │ │ OpenJDK Server VM (build 21.0.13-ea+8-1-Debian, mixed mode, sharing) │ │ │ │ │ Library /test/lib; kind: packages │ │ │ │ │ source directory: /build/reproducible-path/openjdk-21-21.0.13~8ea/test/lib │ │ │ │ │ class directory: /tmp/jdk/JTwork/classes/java/net/MulticastSocket/SetLoopbackMode.d/test/lib │ │ │ │ │ │ │ │ │ │ #section:build │ │ │ │ │ -----------messages:(5/282)---------- │ │ │ │ │ +----------messages:(5/284)---------- │ │ │ │ │ command: build jdk.test.lib.NetworkConfiguration jdk.test.lib.Platform │ │ │ │ │ reason: User specified action: run build jdk.test.lib.NetworkConfiguration jdk.test.lib.Platform │ │ │ │ │ -started: Thu Oct 08 18:59:15.919 UTC 2026 │ │ │ │ │ -finished: Thu Oct 08 18:59:15.919 UTC 2026 │ │ │ │ │ -elapsed time (seconds): 0.0 │ │ │ │ │ +started: Fri Oct 16 11:27:34.903 UTC 2026 │ │ │ │ │ +finished: Fri Oct 16 11:27:34.904 UTC 2026 │ │ │ │ │ +elapsed time (seconds): 0.001 │ │ │ │ │ result: Passed. All files up to date │ │ │ │ │ │ │ │ │ │ #section:build │ │ │ │ │ ----------messages:(5/183)---------- │ │ │ │ │ command: build SetLoopbackMode │ │ │ │ │ reason: Named class compiled on demand │ │ │ │ │ -started: Thu Oct 08 18:59:15.919 UTC 2026 │ │ │ │ │ -finished: Thu Oct 08 18:59:15.919 UTC 2026 │ │ │ │ │ +started: Fri Oct 16 11:27:34.904 UTC 2026 │ │ │ │ │ +finished: Fri Oct 16 11:27:34.904 UTC 2026 │ │ │ │ │ elapsed time (seconds): 0.0 │ │ │ │ │ result: Passed. All files up to date │ │ │ │ │ │ │ │ │ │ #section:main │ │ │ │ │ ----------messages:(8/411)---------- │ │ │ │ │ command: main SetLoopbackMode │ │ │ │ │ reason: User specified action: run main/othervm SetLoopbackMode │ │ │ │ │ -started: Thu Oct 08 18:59:15.920 UTC 2026 │ │ │ │ │ +started: Fri Oct 16 11:27:34.904 UTC 2026 │ │ │ │ │ Mode: othervm [/othervm specified] │ │ │ │ │ Additional options from @modules: --add-modules java.base --add-exports java.base/java.net=ALL-UNNAMED --add-opens java.base/java.net=ALL-UNNAMED │ │ │ │ │ -Process id: 1021418 │ │ │ │ │ -finished: Thu Oct 08 18:59:16.015 UTC 2026 │ │ │ │ │ -elapsed time (seconds): 0.095 │ │ │ │ │ +Process id: 3381320 │ │ │ │ │ +finished: Fri Oct 16 11:27:35.097 UTC 2026 │ │ │ │ │ +elapsed time (seconds): 0.193 │ │ │ │ │ ----------configuration:(5/139)---------- │ │ │ │ │ Boot Layer │ │ │ │ │ add modules: java.base │ │ │ │ │ add exports: java.base/java.net ALL-UNNAMED │ │ │ │ │ add opens: java.base/java.net ALL-UNNAMED │ │ │ │ │ │ │ │ │ │ ----------System.out:(5/155)---------- │ │ │ │ ├── jtreg-test-output/jdk/JTwork/java/net/MulticastSocket/SetLoopbackModeIPv4.jtr │ │ │ │ │ @@ -1,44 +1,44 @@ │ │ │ │ │ #Test Results (version 2) │ │ │ │ │ -#Thu Oct 08 18:59:16 UTC 2026 │ │ │ │ │ +#Fri Oct 16 11:27:35 UTC 2026 │ │ │ │ │ #-----testdescription----- │ │ │ │ │ $file=/build/reproducible-path/openjdk-21-21.0.13~8ea/test/jdk/java/net/MulticastSocket/SetLoopbackModeIPv4.java │ │ │ │ │ $root=/build/reproducible-path/openjdk-21-21.0.13~8ea/test/jdk │ │ │ │ │ keywords=bug4686717 bug8241786 othervm │ │ │ │ │ library=/test/lib │ │ │ │ │ modules=java.base/java.net\:+open │ │ │ │ │ run=USER_SPECIFIED build jdk.test.lib.NetworkConfiguration jdk.test.lib.Platform SetLoopbackMode SetLoopbackModeIPv4\nUSER_SPECIFIED main/othervm -Djava.net.preferIPv4Stack\=true SetLoopbackModeIPv4\n │ │ │ │ │ source=SetLoopbackModeIPv4.java │ │ │ │ │ title=Test MulticastSocket.setLoopbackMode with IPv4 addresses │ │ │ │ │ │ │ │ │ │ #-----environment----- │ │ │ │ │ │ │ │ │ │ #-----testresult----- │ │ │ │ │ description=file\:/build/reproducible-path/openjdk-21-21.0.13~8ea/test/jdk/java/net/MulticastSocket/SetLoopbackModeIPv4.java │ │ │ │ │ -elapsed=98 0\:00\:00.098 │ │ │ │ │ -end=Thu Oct 08 18\:59\:16 UTC 2026 │ │ │ │ │ +elapsed=207 0\:00\:00.207 │ │ │ │ │ +end=Fri Oct 16 11\:27\:35 UTC 2026 │ │ │ │ │ environment=regtest │ │ │ │ │ execStatus=Failed. Execution failed\: `main' threw exception\: java.net.SocketException\: No such device (setsockopt failed) │ │ │ │ │ harnessLoaderMode=Classpath Loader │ │ │ │ │ harnessVariety=Full Bundle │ │ │ │ │ hostname=sbuild │ │ │ │ │ javatestOS=Linux 6.12.111+deb13-amd64 (i386) │ │ │ │ │ javatestVersion=6.0-ea+b26-2026-03-18-${BUILT_FROM_COMMIT} │ │ │ │ │ jtregVersion=jtreg 8.3 src 1 │ │ │ │ │ modules=java.base/java.net\:+open │ │ │ │ │ script=com.sun.javatest.regtest.exec.RegressionScript │ │ │ │ │ sections=script_messages build build main │ │ │ │ │ -start=Thu Oct 08 18\:59\:16 UTC 2026 │ │ │ │ │ +start=Fri Oct 16 11\:27\:35 UTC 2026 │ │ │ │ │ test=java/net/MulticastSocket/SetLoopbackModeIPv4.java │ │ │ │ │ testJDK=/build/reproducible-path/openjdk-21-21.0.13~8ea/build/bootcycle-build/images/jdk │ │ │ │ │ -testJDK_OS=[name\:Linux,arch\:i386,version\:6.12.111+deb13-amd64,family\:linux,simple_arch\:i586,simple_version\:6.12,processors\:6,maxMemory\:16773820416,maxSwap\:182536105984] │ │ │ │ │ +testJDK_OS=[name\:Linux,arch\:i386,version\:6.12.111+deb13-amd64,family\:linux,simple_arch\:i586,simple_version\:6.12,processors\:8,maxMemory\:16775348224,maxSwap\:34358685696] │ │ │ │ │ testJDK_os.arch=i386 │ │ │ │ │ testJDK_os.name=Linux │ │ │ │ │ testJDK_os.version=6.12.111+deb13-amd64 │ │ │ │ │ -totalTime=98 │ │ │ │ │ +totalTime=208 │ │ │ │ │ user.name=sbuild │ │ │ │ │ work=/tmp/jdk/JTwork/java/net/MulticastSocket │ │ │ │ │ │ │ │ │ │ #section:script_messages │ │ │ │ │ ----------messages:(7/476)---------- │ │ │ │ │ JDK under test: /build/reproducible-path/openjdk-21-21.0.13~8ea/build/bootcycle-build/images/jdk │ │ │ │ │ openjdk version "21.0.13-ea" 2026-10-20 │ │ │ │ │ @@ -48,38 +48,38 @@ │ │ │ │ │ source directory: /build/reproducible-path/openjdk-21-21.0.13~8ea/test/lib │ │ │ │ │ class directory: /tmp/jdk/JTwork/classes/java/net/MulticastSocket/SetLoopbackModeIPv4.d/test/lib │ │ │ │ │ │ │ │ │ │ #section:build │ │ │ │ │ ----------messages:(5/356)---------- │ │ │ │ │ command: build jdk.test.lib.NetworkConfiguration jdk.test.lib.Platform SetLoopbackMode SetLoopbackModeIPv4 │ │ │ │ │ reason: User specified action: run build jdk.test.lib.NetworkConfiguration jdk.test.lib.Platform SetLoopbackMode SetLoopbackModeIPv4 │ │ │ │ │ -started: Thu Oct 08 18:59:16.019 UTC 2026 │ │ │ │ │ -finished: Thu Oct 08 18:59:16.020 UTC 2026 │ │ │ │ │ +started: Fri Oct 16 11:27:35.104 UTC 2026 │ │ │ │ │ +finished: Fri Oct 16 11:27:35.105 UTC 2026 │ │ │ │ │ elapsed time (seconds): 0.001 │ │ │ │ │ result: Passed. All files up to date │ │ │ │ │ │ │ │ │ │ #section:build │ │ │ │ │ ----------messages:(5/187)---------- │ │ │ │ │ command: build SetLoopbackModeIPv4 │ │ │ │ │ reason: Named class compiled on demand │ │ │ │ │ -started: Thu Oct 08 18:59:16.020 UTC 2026 │ │ │ │ │ -finished: Thu Oct 08 18:59:16.020 UTC 2026 │ │ │ │ │ +started: Fri Oct 16 11:27:35.105 UTC 2026 │ │ │ │ │ +finished: Fri Oct 16 11:27:35.105 UTC 2026 │ │ │ │ │ elapsed time (seconds): 0.0 │ │ │ │ │ result: Passed. All files up to date │ │ │ │ │ │ │ │ │ │ #section:main │ │ │ │ │ ----------messages:(8/483)---------- │ │ │ │ │ command: main -Djava.net.preferIPv4Stack=true SetLoopbackModeIPv4 │ │ │ │ │ reason: User specified action: run main/othervm -Djava.net.preferIPv4Stack=true SetLoopbackModeIPv4 │ │ │ │ │ -started: Thu Oct 08 18:59:16.020 UTC 2026 │ │ │ │ │ +started: Fri Oct 16 11:27:35.105 UTC 2026 │ │ │ │ │ Mode: othervm [/othervm specified] │ │ │ │ │ Additional options from @modules: --add-modules java.base --add-exports java.base/java.net=ALL-UNNAMED --add-opens java.base/java.net=ALL-UNNAMED │ │ │ │ │ -Process id: 1021440 │ │ │ │ │ -finished: Thu Oct 08 18:59:16.116 UTC 2026 │ │ │ │ │ -elapsed time (seconds): 0.096 │ │ │ │ │ +Process id: 3381342 │ │ │ │ │ +finished: Fri Oct 16 11:27:35.309 UTC 2026 │ │ │ │ │ +elapsed time (seconds): 0.204 │ │ │ │ │ ----------configuration:(5/139)---------- │ │ │ │ │ Boot Layer │ │ │ │ │ add modules: java.base │ │ │ │ │ add exports: java.base/java.net ALL-UNNAMED │ │ │ │ │ add opens: java.base/java.net ALL-UNNAMED │ │ │ │ │ │ │ │ │ │ ----------System.out:(5/155)---------- │ │ │ │ ├── jtreg-test-output/jdk/JTwork/java/net/MulticastSocket/Test.jtr │ │ │ │ │ @@ -1,83 +1,83 @@ │ │ │ │ │ #Test Results (version 2) │ │ │ │ │ -#Thu Oct 08 18:59:16 UTC 2026 │ │ │ │ │ +#Fri Oct 16 11:27:35 UTC 2026 │ │ │ │ │ #-----testdescription----- │ │ │ │ │ $file=/build/reproducible-path/openjdk-21-21.0.13~8ea/test/jdk/java/net/MulticastSocket/Test.java │ │ │ │ │ $root=/build/reproducible-path/openjdk-21-21.0.13~8ea/test/jdk │ │ │ │ │ keywords=bug4488458 othervm │ │ │ │ │ library=/test/lib │ │ │ │ │ run=USER_SPECIFIED build jdk.test.lib.NetworkConfiguration jdk.test.lib.Platform\nUSER_SPECIFIED main Test\nUSER_SPECIFIED main/othervm -Djava.net.preferIPv4Stack\=true Test\n │ │ │ │ │ source=Test.java │ │ │ │ │ title=IPv4 and IPv6 multicasting broken on Linux │ │ │ │ │ │ │ │ │ │ #-----environment----- │ │ │ │ │ │ │ │ │ │ #-----testresult----- │ │ │ │ │ description=file\:/build/reproducible-path/openjdk-21-21.0.13~8ea/test/jdk/java/net/MulticastSocket/Test.java │ │ │ │ │ -elapsed=64 0\:00\:00.064 │ │ │ │ │ -end=Thu Oct 08 18\:59\:16 UTC 2026 │ │ │ │ │ +elapsed=84 0\:00\:00.084 │ │ │ │ │ +end=Fri Oct 16 11\:27\:35 UTC 2026 │ │ │ │ │ environment=regtest │ │ │ │ │ execStatus=Failed. Execution failed\: `main' threw exception\: java.lang.Exception\: Test failed - see log file for details │ │ │ │ │ harnessLoaderMode=Classpath Loader │ │ │ │ │ harnessVariety=Full Bundle │ │ │ │ │ hostname=sbuild │ │ │ │ │ javatestOS=Linux 6.12.111+deb13-amd64 (i386) │ │ │ │ │ javatestVersion=6.0-ea+b26-2026-03-18-${BUILT_FROM_COMMIT} │ │ │ │ │ jtregVersion=jtreg 8.3 src 1 │ │ │ │ │ script=com.sun.javatest.regtest.exec.RegressionScript │ │ │ │ │ sections=script_messages build build main │ │ │ │ │ -start=Thu Oct 08 18\:59\:16 UTC 2026 │ │ │ │ │ +start=Fri Oct 16 11\:27\:35 UTC 2026 │ │ │ │ │ test=java/net/MulticastSocket/Test.java │ │ │ │ │ testJDK=/build/reproducible-path/openjdk-21-21.0.13~8ea/build/bootcycle-build/images/jdk │ │ │ │ │ -testJDK_OS=[name\:Linux,arch\:i386,version\:6.12.111+deb13-amd64,family\:linux,simple_arch\:i586,simple_version\:6.12,processors\:6,maxMemory\:16773820416,maxSwap\:182536105984] │ │ │ │ │ +testJDK_OS=[name\:Linux,arch\:i386,version\:6.12.111+deb13-amd64,family\:linux,simple_arch\:i586,simple_version\:6.12,processors\:8,maxMemory\:16775348224,maxSwap\:34358685696] │ │ │ │ │ testJDK_os.arch=i386 │ │ │ │ │ testJDK_os.name=Linux │ │ │ │ │ testJDK_os.version=6.12.111+deb13-amd64 │ │ │ │ │ -totalTime=64 │ │ │ │ │ +totalTime=86 │ │ │ │ │ user.name=sbuild │ │ │ │ │ work=/tmp/jdk/JTwork/java/net/MulticastSocket │ │ │ │ │ │ │ │ │ │ #section:script_messages │ │ │ │ │ ----------messages:(7/461)---------- │ │ │ │ │ JDK under test: /build/reproducible-path/openjdk-21-21.0.13~8ea/build/bootcycle-build/images/jdk │ │ │ │ │ openjdk version "21.0.13-ea" 2026-10-20 │ │ │ │ │ OpenJDK Runtime Environment (build 21.0.13-ea+8-1-Debian) │ │ │ │ │ OpenJDK Server VM (build 21.0.13-ea+8-1-Debian, mixed mode, sharing) │ │ │ │ │ Library /test/lib; kind: packages │ │ │ │ │ source directory: /build/reproducible-path/openjdk-21-21.0.13~8ea/test/lib │ │ │ │ │ class directory: /tmp/jdk/JTwork/classes/java/net/MulticastSocket/Test.d/test/lib │ │ │ │ │ │ │ │ │ │ #section:build │ │ │ │ │ -----------messages:(5/284)---------- │ │ │ │ │ +----------messages:(5/282)---------- │ │ │ │ │ command: build jdk.test.lib.NetworkConfiguration jdk.test.lib.Platform │ │ │ │ │ reason: User specified action: run build jdk.test.lib.NetworkConfiguration jdk.test.lib.Platform │ │ │ │ │ -started: Thu Oct 08 18:59:16.119 UTC 2026 │ │ │ │ │ -finished: Thu Oct 08 18:59:16.120 UTC 2026 │ │ │ │ │ -elapsed time (seconds): 0.001 │ │ │ │ │ +started: Fri Oct 16 11:27:35.316 UTC 2026 │ │ │ │ │ +finished: Fri Oct 16 11:27:35.316 UTC 2026 │ │ │ │ │ +elapsed time (seconds): 0.0 │ │ │ │ │ result: Passed. All files up to date │ │ │ │ │ │ │ │ │ │ #section:build │ │ │ │ │ ----------messages:(5/172)---------- │ │ │ │ │ command: build Test │ │ │ │ │ reason: Named class compiled on demand │ │ │ │ │ -started: Thu Oct 08 18:59:16.120 UTC 2026 │ │ │ │ │ -finished: Thu Oct 08 18:59:16.120 UTC 2026 │ │ │ │ │ +started: Fri Oct 16 11:27:35.317 UTC 2026 │ │ │ │ │ +finished: Fri Oct 16 11:27:35.317 UTC 2026 │ │ │ │ │ elapsed time (seconds): 0.0 │ │ │ │ │ result: Passed. All files up to date │ │ │ │ │ │ │ │ │ │ #section:main │ │ │ │ │ ----------messages:(8/226)---------- │ │ │ │ │ command: main Test │ │ │ │ │ reason: User specified action: run main Test │ │ │ │ │ -started: Thu Oct 08 18:59:16.120 UTC 2026 │ │ │ │ │ +started: Fri Oct 16 11:27:35.317 UTC 2026 │ │ │ │ │ Mode: agentvm │ │ │ │ │ Agent id: 1 │ │ │ │ │ -Process id: 1021391 │ │ │ │ │ -finished: Thu Oct 08 18:59:16.181 UTC 2026 │ │ │ │ │ -elapsed time (seconds): 0.061 │ │ │ │ │ +Process id: 3381293 │ │ │ │ │ +finished: Fri Oct 16 11:27:35.398 UTC 2026 │ │ │ │ │ +elapsed time (seconds): 0.081 │ │ │ │ │ ----------configuration:(17/814)---------- │ │ │ │ │ Boot Layer │ │ │ │ │ class path: /usr/share/jtreg/lib/javatest.jar │ │ │ │ │ /usr/share/jtreg/lib/jtreg.jar │ │ │ │ │ /usr/share/jtreg/lib/junit-platform-console-standalone.jar │ │ │ │ │ /usr/share/jtreg/lib/testng.jar │ │ │ │ │ /usr/share/jtreg/lib/guice.jar │ │ │ │ ├── jtreg-test-output/jdk/JTwork/java/net/SocketOption/OptionsTest.jtr │ │ │ │ │ @@ -1,74 +1,74 @@ │ │ │ │ │ #Test Results (version 2) │ │ │ │ │ -#Thu Oct 08 18:59:16 UTC 2026 │ │ │ │ │ +#Fri Oct 16 11:27:35 UTC 2026 │ │ │ │ │ #-----testdescription----- │ │ │ │ │ $file=/build/reproducible-path/openjdk-21-21.0.13~8ea/test/jdk/java/net/SocketOption/OptionsTest.java │ │ │ │ │ $root=/build/reproducible-path/openjdk-21-21.0.13~8ea/test/jdk │ │ │ │ │ keywords=bug8036979 bug8072384 bug8044773 bug8225214 bug8233296 bug8234083 othervm │ │ │ │ │ library=/test/lib │ │ │ │ │ requires=\!vm.graal.enabled │ │ │ │ │ run=USER_SPECIFIED main/othervm -Xcheck\:jni OptionsTest\nUSER_SPECIFIED main/othervm -Xcheck\:jni -Djava.net.preferIPv4Stack\=true OptionsTest\nUSER_SPECIFIED main/othervm --limit-modules\=java.base OptionsTest\nUSER_SPECIFIED main/othervm/policy\=options.policy OptionsTest\n │ │ │ │ │ source=OptionsTest.java │ │ │ │ │ title=\ │ │ │ │ │ │ │ │ │ │ #-----environment----- │ │ │ │ │ │ │ │ │ │ #-----testresult----- │ │ │ │ │ description=file\:/build/reproducible-path/openjdk-21-21.0.13~8ea/test/jdk/java/net/SocketOption/OptionsTest.java │ │ │ │ │ -elapsed=117 0\:00\:00.117 │ │ │ │ │ -end=Thu Oct 08 18\:59\:16 UTC 2026 │ │ │ │ │ +elapsed=208 0\:00\:00.208 │ │ │ │ │ +end=Fri Oct 16 11\:27\:35 UTC 2026 │ │ │ │ │ environment=regtest │ │ │ │ │ execStatus=Failed. Execution failed\: `main' threw exception\: java.lang.IllegalArgumentException\: Invalid value 'null' │ │ │ │ │ harnessLoaderMode=Classpath Loader │ │ │ │ │ harnessVariety=Full Bundle │ │ │ │ │ hostname=sbuild │ │ │ │ │ javatestOS=Linux 6.12.111+deb13-amd64 (i386) │ │ │ │ │ javatestVersion=6.0-ea+b26-2026-03-18-${BUILT_FROM_COMMIT} │ │ │ │ │ jtregVersion=jtreg 8.3 src 1 │ │ │ │ │ script=com.sun.javatest.regtest.exec.RegressionScript │ │ │ │ │ sections=script_messages build main │ │ │ │ │ -start=Thu Oct 08 18\:59\:16 UTC 2026 │ │ │ │ │ +start=Fri Oct 16 11\:27\:35 UTC 2026 │ │ │ │ │ test=java/net/SocketOption/OptionsTest.java │ │ │ │ │ testJDK=/build/reproducible-path/openjdk-21-21.0.13~8ea/build/bootcycle-build/images/jdk │ │ │ │ │ -testJDK_OS=[name\:Linux,arch\:i386,version\:6.12.111+deb13-amd64,family\:linux,simple_arch\:i586,simple_version\:6.12,processors\:6,maxMemory\:16773820416,maxSwap\:182536105984] │ │ │ │ │ +testJDK_OS=[name\:Linux,arch\:i386,version\:6.12.111+deb13-amd64,family\:linux,simple_arch\:i586,simple_version\:6.12,processors\:8,maxMemory\:16775348224,maxSwap\:34358685696] │ │ │ │ │ testJDK_os.arch=i386 │ │ │ │ │ testJDK_os.name=Linux │ │ │ │ │ testJDK_os.version=6.12.111+deb13-amd64 │ │ │ │ │ -totalTime=118 │ │ │ │ │ +totalTime=209 │ │ │ │ │ user.name=sbuild │ │ │ │ │ work=/tmp/jdk/JTwork/java/net/SocketOption │ │ │ │ │ │ │ │ │ │ #section:script_messages │ │ │ │ │ ----------messages:(7/465)---------- │ │ │ │ │ JDK under test: /build/reproducible-path/openjdk-21-21.0.13~8ea/build/bootcycle-build/images/jdk │ │ │ │ │ openjdk version "21.0.13-ea" 2026-10-20 │ │ │ │ │ OpenJDK Runtime Environment (build 21.0.13-ea+8-1-Debian) │ │ │ │ │ OpenJDK Server VM (build 21.0.13-ea+8-1-Debian, mixed mode, sharing) │ │ │ │ │ Library /test/lib; kind: packages │ │ │ │ │ source directory: /build/reproducible-path/openjdk-21-21.0.13~8ea/test/lib │ │ │ │ │ class directory: /tmp/jdk/JTwork/classes/java/net/SocketOption/OptionsTest.d/test/lib │ │ │ │ │ │ │ │ │ │ #section:build │ │ │ │ │ -----------messages:(5/179)---------- │ │ │ │ │ +----------messages:(5/181)---------- │ │ │ │ │ command: build OptionsTest │ │ │ │ │ reason: Named class compiled on demand │ │ │ │ │ -started: Thu Oct 08 18:59:16.186 UTC 2026 │ │ │ │ │ -finished: Thu Oct 08 18:59:16.186 UTC 2026 │ │ │ │ │ -elapsed time (seconds): 0.0 │ │ │ │ │ +started: Fri Oct 16 11:27:35.405 UTC 2026 │ │ │ │ │ +finished: Fri Oct 16 11:27:35.406 UTC 2026 │ │ │ │ │ +elapsed time (seconds): 0.001 │ │ │ │ │ result: Passed. All files up to date │ │ │ │ │ │ │ │ │ │ #section:main │ │ │ │ │ ----------messages:(7/281)---------- │ │ │ │ │ command: main -Xcheck:jni OptionsTest │ │ │ │ │ reason: User specified action: run main/othervm -Xcheck:jni OptionsTest │ │ │ │ │ -started: Thu Oct 08 18:59:16.186 UTC 2026 │ │ │ │ │ +started: Fri Oct 16 11:27:35.406 UTC 2026 │ │ │ │ │ Mode: othervm [/othervm specified] │ │ │ │ │ -Process id: 1021462 │ │ │ │ │ -finished: Thu Oct 08 18:59:16.301 UTC 2026 │ │ │ │ │ -elapsed time (seconds): 0.115 │ │ │ │ │ +Process id: 3381364 │ │ │ │ │ +finished: Fri Oct 16 11:27:35.610 UTC 2026 │ │ │ │ │ +elapsed time (seconds): 0.204 │ │ │ │ │ ----------configuration:(0/0)---------- │ │ │ │ │ ----------System.out:(7/201)---------- │ │ │ │ │ Testing SO_LINGER with:-1 │ │ │ │ │ Testing SO_LINGER with:-2 │ │ │ │ │ Testing SO_LINGER with:-100 │ │ │ │ │ Testing SO_LINGER with:-65534 │ │ │ │ │ Testing SO_LINGER with:-65535 │ │ │ │ ├── jtreg-test-output/jdk/JTwork/java/net/SocketPermission/SocketPermissionTest.jtr │ │ │ │ │ @@ -1,92 +1,92 @@ │ │ │ │ │ #Test Results (version 2) │ │ │ │ │ -#Thu Oct 08 18:59:17 UTC 2026 │ │ │ │ │ +#Fri Oct 16 11:27:37 UTC 2026 │ │ │ │ │ #-----testdescription----- │ │ │ │ │ $file=/build/reproducible-path/openjdk-21-21.0.13~8ea/test/jdk/java/net/SocketPermission/SocketPermissionTest.java │ │ │ │ │ $root=/build/reproducible-path/openjdk-21-21.0.13~8ea/test/jdk │ │ │ │ │ keywords=bug8047031 intermittent othervm testng │ │ │ │ │ library=/test/lib │ │ │ │ │ run=USER_SPECIFIED build jdk.test.lib.NetworkConfiguration jdk.test.lib.Platform\nUSER_SPECIFIED testng/othervm -Djava.security.manager\=allow SocketPermissionTest\n │ │ │ │ │ source=SocketPermissionTest.java │ │ │ │ │ title=SocketPermission tests for legacy socket types. │ │ │ │ │ │ │ │ │ │ #-----environment----- │ │ │ │ │ │ │ │ │ │ #-----testresult----- │ │ │ │ │ description=file\:/build/reproducible-path/openjdk-21-21.0.13~8ea/test/jdk/java/net/SocketPermission/SocketPermissionTest.java │ │ │ │ │ -elapsed=340 0\:00\:00.340 │ │ │ │ │ -end=Thu Oct 08 18\:59\:17 UTC 2026 │ │ │ │ │ +elapsed=733 0\:00\:00.733 │ │ │ │ │ +end=Fri Oct 16 11\:27\:37 UTC 2026 │ │ │ │ │ environment=regtest │ │ │ │ │ execStatus=Failed. Execution failed\: `main' threw exception\: java.lang.Exception\: config failures\: 0, test failures\: 2 │ │ │ │ │ harnessLoaderMode=Classpath Loader │ │ │ │ │ harnessVariety=Full Bundle │ │ │ │ │ hostname=sbuild │ │ │ │ │ javatestOS=Linux 6.12.111+deb13-amd64 (i386) │ │ │ │ │ javatestVersion=6.0-ea+b26-2026-03-18-${BUILT_FROM_COMMIT} │ │ │ │ │ jtregVersion=jtreg 8.3 src 1 │ │ │ │ │ script=com.sun.javatest.regtest.exec.RegressionScript │ │ │ │ │ sections=script_messages build build testng │ │ │ │ │ -start=Thu Oct 08 18\:59\:16 UTC 2026 │ │ │ │ │ +start=Fri Oct 16 11\:27\:36 UTC 2026 │ │ │ │ │ test=java/net/SocketPermission/SocketPermissionTest.java │ │ │ │ │ testJDK=/build/reproducible-path/openjdk-21-21.0.13~8ea/build/bootcycle-build/images/jdk │ │ │ │ │ -testJDK_OS=[name\:Linux,arch\:i386,version\:6.12.111+deb13-amd64,family\:linux,simple_arch\:i586,simple_version\:6.12,processors\:6,maxMemory\:16773820416,maxSwap\:182536105984] │ │ │ │ │ +testJDK_OS=[name\:Linux,arch\:i386,version\:6.12.111+deb13-amd64,family\:linux,simple_arch\:i586,simple_version\:6.12,processors\:8,maxMemory\:16775348224,maxSwap\:34358685696] │ │ │ │ │ testJDK_os.arch=i386 │ │ │ │ │ testJDK_os.name=Linux │ │ │ │ │ testJDK_os.version=6.12.111+deb13-amd64 │ │ │ │ │ -totalTime=340 │ │ │ │ │ +totalTime=735 │ │ │ │ │ user.name=sbuild │ │ │ │ │ work=/tmp/jdk/JTwork/java/net/SocketPermission │ │ │ │ │ │ │ │ │ │ #section:script_messages │ │ │ │ │ ----------messages:(7/478)---------- │ │ │ │ │ JDK under test: /build/reproducible-path/openjdk-21-21.0.13~8ea/build/bootcycle-build/images/jdk │ │ │ │ │ openjdk version "21.0.13-ea" 2026-10-20 │ │ │ │ │ OpenJDK Runtime Environment (build 21.0.13-ea+8-1-Debian) │ │ │ │ │ OpenJDK Server VM (build 21.0.13-ea+8-1-Debian, mixed mode, sharing) │ │ │ │ │ Library /test/lib; kind: packages │ │ │ │ │ source directory: /build/reproducible-path/openjdk-21-21.0.13~8ea/test/lib │ │ │ │ │ class directory: /tmp/jdk/JTwork/classes/java/net/SocketPermission/SocketPermissionTest.d/test/lib │ │ │ │ │ │ │ │ │ │ #section:build │ │ │ │ │ -----------messages:(5/282)---------- │ │ │ │ │ +----------messages:(5/284)---------- │ │ │ │ │ command: build jdk.test.lib.NetworkConfiguration jdk.test.lib.Platform │ │ │ │ │ reason: User specified action: run build jdk.test.lib.NetworkConfiguration jdk.test.lib.Platform │ │ │ │ │ -started: Thu Oct 08 18:59:16.961 UTC 2026 │ │ │ │ │ -finished: Thu Oct 08 18:59:16.961 UTC 2026 │ │ │ │ │ -elapsed time (seconds): 0.0 │ │ │ │ │ +started: Fri Oct 16 11:27:36.824 UTC 2026 │ │ │ │ │ +finished: Fri Oct 16 11:27:36.825 UTC 2026 │ │ │ │ │ +elapsed time (seconds): 0.001 │ │ │ │ │ result: Passed. All files up to date │ │ │ │ │ │ │ │ │ │ #section:build │ │ │ │ │ ----------messages:(5/188)---------- │ │ │ │ │ command: build SocketPermissionTest │ │ │ │ │ reason: Named class compiled on demand │ │ │ │ │ -started: Thu Oct 08 18:59:16.961 UTC 2026 │ │ │ │ │ -finished: Thu Oct 08 18:59:16.961 UTC 2026 │ │ │ │ │ +started: Fri Oct 16 11:27:36.825 UTC 2026 │ │ │ │ │ +finished: Fri Oct 16 11:27:36.825 UTC 2026 │ │ │ │ │ elapsed time (seconds): 0.0 │ │ │ │ │ result: Passed. All files up to date │ │ │ │ │ │ │ │ │ │ #section:testng │ │ │ │ │ ----------messages:(7/339)---------- │ │ │ │ │ command: testng -Djava.security.manager=allow SocketPermissionTest │ │ │ │ │ reason: User specified action: run testng/othervm -Djava.security.manager=allow SocketPermissionTest │ │ │ │ │ -started: Thu Oct 08 18:59:16.961 UTC 2026 │ │ │ │ │ +started: Fri Oct 16 11:27:36.826 UTC 2026 │ │ │ │ │ Mode: othervm [/othervm specified] │ │ │ │ │ -Process id: 1021483 │ │ │ │ │ -finished: Thu Oct 08 18:59:17.297 UTC 2026 │ │ │ │ │ -elapsed time (seconds): 0.336 │ │ │ │ │ +Process id: 3381385 │ │ │ │ │ +finished: Fri Oct 16 11:27:37.551 UTC 2026 │ │ │ │ │ +elapsed time (seconds): 0.725 │ │ │ │ │ ----------configuration:(0/0)---------- │ │ │ │ │ -----------System.out:(97/6916)---------- │ │ │ │ │ -[18:59:17.203] config SocketPermissionTest.setupSecurityManager(): success [0ms] │ │ │ │ │ -[18:59:17.221] test SocketPermissionTest.acceptServerSocketTest(): success [13ms] │ │ │ │ │ -[18:59:17.221] config SocketPermissionTest.setupSecurityManager(): success [0ms] │ │ │ │ │ -[18:59:17.229] test SocketPermissionTest.connectDatagramSocketTest(): success [7ms] │ │ │ │ │ -[18:59:17.230] config SocketPermissionTest.setupSecurityManager(): success [0ms] │ │ │ │ │ -[18:59:17.231] test SocketPermissionTest.connectSocketTest(): success [0ms] │ │ │ │ │ -[18:59:17.231] config SocketPermissionTest.setupSecurityManager(): success [0ms] │ │ │ │ │ -[18:59:17.235] test SocketPermissionTest.joinGroupMulticastTest(): failure [4ms] │ │ │ │ │ +----------System.out:(97/6918)---------- │ │ │ │ │ +[11:27:37.341] config SocketPermissionTest.setupSecurityManager(): success [0ms] │ │ │ │ │ +[11:27:37.374] test SocketPermissionTest.acceptServerSocketTest(): success [26ms] │ │ │ │ │ +[11:27:37.376] config SocketPermissionTest.setupSecurityManager(): success [0ms] │ │ │ │ │ +[11:27:37.392] test SocketPermissionTest.connectDatagramSocketTest(): success [15ms] │ │ │ │ │ +[11:27:37.393] config SocketPermissionTest.setupSecurityManager(): success [0ms] │ │ │ │ │ +[11:27:37.396] test SocketPermissionTest.connectSocketTest(): success [2ms] │ │ │ │ │ +[11:27:37.397] config SocketPermissionTest.setupSecurityManager(): success [0ms] │ │ │ │ │ +[11:27:37.407] test SocketPermissionTest.joinGroupMulticastTest(): failure [12ms] │ │ │ │ │ java.util.NoSuchElementException: No value present │ │ │ │ │ at java.base/java.util.Optional.get(Optional.java:143) │ │ │ │ │ at SocketPermissionTest.joinGroupMulticastTest(SocketPermissionTest.java:227) │ │ │ │ │ at java.base/jdk.internal.reflect.DirectMethodHandleAccessor.invoke(DirectMethodHandleAccessor.java:103) │ │ │ │ │ at java.base/java.lang.reflect.Method.invoke(Method.java:580) │ │ │ │ │ at org.testng.internal.invokers.MethodInvocationHelper.invokeMethod(MethodInvocationHelper.java:136) │ │ │ │ │ at org.testng.internal.invokers.TestInvoker.invokeMethod(TestInvoker.java:658) │ │ │ │ │ @@ -111,22 +111,22 @@ │ │ │ │ │ at org.testng.TestNG.run(TestNG.java:1060) │ │ │ │ │ at com.sun.javatest.regtest.agent.TestNGRunner.main(TestNGRunner.java:109) │ │ │ │ │ at com.sun.javatest.regtest.agent.TestNGRunner.main(TestNGRunner.java:65) │ │ │ │ │ at java.base/jdk.internal.reflect.DirectMethodHandleAccessor.invoke(DirectMethodHandleAccessor.java:103) │ │ │ │ │ at java.base/java.lang.reflect.Method.invoke(Method.java:580) │ │ │ │ │ at com.sun.javatest.regtest.agent.MainWrapper$MainTask.run(MainWrapper.java:143) │ │ │ │ │ at java.base/java.lang.Thread.run(Thread.java:1583) │ │ │ │ │ -[18:59:17.237] config SocketPermissionTest.setupSecurityManager(): success [0ms] │ │ │ │ │ -[18:59:17.238] test SocketPermissionTest.listenDatagramSocketTest(): success [0ms] │ │ │ │ │ -[18:59:17.238] config SocketPermissionTest.setupSecurityManager(): success [0ms] │ │ │ │ │ -[18:59:17.239] test SocketPermissionTest.listenMulticastSocketTest(): success [0ms] │ │ │ │ │ -[18:59:17.240] config SocketPermissionTest.setupSecurityManager(): success [0ms] │ │ │ │ │ -[18:59:17.240] test SocketPermissionTest.listenServerSocketTest(): success [0ms] │ │ │ │ │ -[18:59:17.241] config SocketPermissionTest.setupSecurityManager(): success [0ms] │ │ │ │ │ -[18:59:17.242] test SocketPermissionTest.sendDatagramPacketTest(): failure [0ms] │ │ │ │ │ +[11:27:37.411] config SocketPermissionTest.setupSecurityManager(): success [0ms] │ │ │ │ │ +[11:27:37.413] test SocketPermissionTest.listenDatagramSocketTest(): success [2ms] │ │ │ │ │ +[11:27:37.415] config SocketPermissionTest.setupSecurityManager(): success [0ms] │ │ │ │ │ +[11:27:37.417] test SocketPermissionTest.listenMulticastSocketTest(): success [1ms] │ │ │ │ │ +[11:27:37.417] config SocketPermissionTest.setupSecurityManager(): success [0ms] │ │ │ │ │ +[11:27:37.419] test SocketPermissionTest.listenServerSocketTest(): success [1ms] │ │ │ │ │ +[11:27:37.420] config SocketPermissionTest.setupSecurityManager(): success [0ms] │ │ │ │ │ +[11:27:37.422] test SocketPermissionTest.sendDatagramPacketTest(): failure [2ms] │ │ │ │ │ java.security.PrivilegedActionException: java.net.SocketException: Network is unreachable │ │ │ │ │ at java.base/java.security.AccessController.doPrivileged(AccessController.java:718) │ │ │ │ │ at SocketPermissionTest.sendDatagramPacketTest(SocketPermissionTest.java:195) │ │ │ │ │ at java.base/jdk.internal.reflect.DirectMethodHandleAccessor.invoke(DirectMethodHandleAccessor.java:103) │ │ │ │ │ at java.base/java.lang.reflect.Method.invoke(Method.java:580) │ │ │ │ │ at org.testng.internal.invokers.MethodInvocationHelper.invokeMethod(MethodInvocationHelper.java:136) │ │ │ │ │ at org.testng.internal.invokers.TestInvoker.invokeMethod(TestInvoker.java:658) │ │ │ │ ├── jtreg-test-output/jdk/JTwork/sun/security/krb5/auto/Addresses.jtr │ │ │ │ │ @@ -1,44 +1,44 @@ │ │ │ │ │ #Test Results (version 2) │ │ │ │ │ -#Thu Oct 08 18:59:20 UTC 2026 │ │ │ │ │ +#Fri Oct 16 11:27:41 UTC 2026 │ │ │ │ │ #-----testdescription----- │ │ │ │ │ $file=/build/reproducible-path/openjdk-21-21.0.13~8ea/test/jdk/sun/security/krb5/auto/Addresses.java │ │ │ │ │ $root=/build/reproducible-path/openjdk-21-21.0.13~8ea/test/jdk │ │ │ │ │ keywords=bug8031111 bug8194486 othervm │ │ │ │ │ library=/test/lib │ │ │ │ │ modules=java.base/jdk.internal.misc java.base/sun.security.util java.security.jgss/sun.security.jgss java.security.jgss/sun.security.jgss.krb5 java.security.jgss/sun.security.krb5\:+open java.security.jgss/sun.security.krb5.internal\:+open java.security.jgss/sun.security.krb5.internal.ccache java.security.jgss/sun.security.krb5.internal.rcache java.security.jgss/sun.security.krb5.internal.crypto java.security.jgss/sun.security.krb5.internal.ktab jdk.security.auth jdk.security.jgss │ │ │ │ │ run=USER_SPECIFIED compile -XDignore.symbol.file Addresses.java\nUSER_SPECIFIED main jdk.test.lib.FileInstaller TestHosts TestHosts\nUSER_SPECIFIED main/othervm -Djdk.net.hosts.file\=TestHosts Addresses\n │ │ │ │ │ source=Addresses.java │ │ │ │ │ title=fix krb5 caddr │ │ │ │ │ │ │ │ │ │ #-----environment----- │ │ │ │ │ │ │ │ │ │ #-----testresult----- │ │ │ │ │ description=file\:/build/reproducible-path/openjdk-21-21.0.13~8ea/test/jdk/sun/security/krb5/auto/Addresses.java │ │ │ │ │ -elapsed=2695 0\:00\:02.695 │ │ │ │ │ -end=Thu Oct 08 18\:59\:20 UTC 2026 │ │ │ │ │ +elapsed=4244 0\:00\:04.244 │ │ │ │ │ +end=Fri Oct 16 11\:27\:41 UTC 2026 │ │ │ │ │ environment=regtest │ │ │ │ │ execStatus=Failed. Execution failed\: `main' threw exception\: java.lang.Exception │ │ │ │ │ harnessLoaderMode=Classpath Loader │ │ │ │ │ harnessVariety=Full Bundle │ │ │ │ │ hostname=sbuild │ │ │ │ │ javatestOS=Linux 6.12.111+deb13-amd64 (i386) │ │ │ │ │ javatestVersion=6.0-ea+b26-2026-03-18-${BUILT_FROM_COMMIT} │ │ │ │ │ jtregVersion=jtreg 8.3 src 1 │ │ │ │ │ modules=java.base/jdk.internal.misc java.base/sun.security.util java.security.jgss/sun.security.jgss java.security.jgss/sun.security.jgss.krb5 java.security.jgss/sun.security.krb5\:+open java.security.jgss/sun.security.krb5.internal\:+open java.security.jgss/sun.security.krb5.internal.ccache java.security.jgss/sun.security.krb5.internal.rcache java.security.jgss/sun.security.krb5.internal.crypto java.security.jgss/sun.security.krb5.internal.ktab jdk.security.auth jdk.security.jgss │ │ │ │ │ script=com.sun.javatest.regtest.exec.RegressionScript │ │ │ │ │ sections=script_messages compile build main build main │ │ │ │ │ -start=Thu Oct 08 18\:59\:17 UTC 2026 │ │ │ │ │ +start=Fri Oct 16 11\:27\:37 UTC 2026 │ │ │ │ │ test=sun/security/krb5/auto/Addresses.java │ │ │ │ │ testJDK=/build/reproducible-path/openjdk-21-21.0.13~8ea/build/bootcycle-build/images/jdk │ │ │ │ │ -testJDK_OS=[name\:Linux,arch\:i386,version\:6.12.111+deb13-amd64,family\:linux,simple_arch\:i586,simple_version\:6.12,processors\:6,maxMemory\:16773820416,maxSwap\:182536105984] │ │ │ │ │ +testJDK_OS=[name\:Linux,arch\:i386,version\:6.12.111+deb13-amd64,family\:linux,simple_arch\:i586,simple_version\:6.12,processors\:8,maxMemory\:16775348224,maxSwap\:34358685696] │ │ │ │ │ testJDK_os.arch=i386 │ │ │ │ │ testJDK_os.name=Linux │ │ │ │ │ testJDK_os.version=6.12.111+deb13-amd64 │ │ │ │ │ -totalTime=2695 │ │ │ │ │ +totalTime=4247 │ │ │ │ │ user.name=sbuild │ │ │ │ │ work=/tmp/jdk/JTwork/sun/security/krb5/auto │ │ │ │ │ │ │ │ │ │ #section:script_messages │ │ │ │ │ ----------messages:(7/464)---------- │ │ │ │ │ JDK under test: /build/reproducible-path/openjdk-21-21.0.13~8ea/build/bootcycle-build/images/jdk │ │ │ │ │ openjdk version "21.0.13-ea" 2026-10-20 │ │ │ │ │ @@ -48,21 +48,21 @@ │ │ │ │ │ source directory: /build/reproducible-path/openjdk-21-21.0.13~8ea/test/lib │ │ │ │ │ class directory: /tmp/jdk/JTwork/classes/sun/security/krb5/auto/Addresses.d/test/lib │ │ │ │ │ │ │ │ │ │ #section:compile │ │ │ │ │ ----------messages:(9/1177)---------- │ │ │ │ │ command: compile -XDignore.symbol.file /build/reproducible-path/openjdk-21-21.0.13~8ea/test/jdk/sun/security/krb5/auto/Addresses.java │ │ │ │ │ reason: User specified action: run compile -XDignore.symbol.file Addresses.java │ │ │ │ │ -started: Thu Oct 08 18:59:17.330 UTC 2026 │ │ │ │ │ +started: Fri Oct 16 11:27:37.562 UTC 2026 │ │ │ │ │ Additional options from @modules: --add-modules java.base,java.security.jgss,jdk.security.auth,jdk.security.jgss --add-exports java.base/jdk.internal.misc=ALL-UNNAMED --add-exports java.base/sun.security.util=ALL-UNNAMED --add-exports java.security.jgss/sun.security.jgss=ALL-UNNAMED --add-exports java.security.jgss/sun.security.jgss.krb5=ALL-UNNAMED --add-exports java.security.jgss/sun.security.krb5=ALL-UNNAMED --add-exports java.security.jgss/sun.security.krb5.internal=ALL-UNNAMED --add-exports java.security.jgss/sun.security.krb5.internal.ccache=ALL-UNNAMED --add-exports java.security.jgss/sun.security.krb5.internal.rcache=ALL-UNNAMED --add-exports java.security.jgss/sun.security.krb5.internal.crypto=ALL-UNNAMED --add-exports java.security.jgss/sun.security.krb5.internal.ktab=ALL-UNNAMED │ │ │ │ │ Mode: agentvm │ │ │ │ │ Agent id: 2 │ │ │ │ │ -Process id: 1021510 │ │ │ │ │ -finished: Thu Oct 08 18:59:17.953 UTC 2026 │ │ │ │ │ -elapsed time (seconds): 0.623 │ │ │ │ │ +Process id: 3381414 │ │ │ │ │ +finished: Fri Oct 16 11:27:38.681 UTC 2026 │ │ │ │ │ +elapsed time (seconds): 1.119 │ │ │ │ │ ----------configuration:(23/1529)---------- │ │ │ │ │ Boot Layer (javac runtime environment) │ │ │ │ │ class path: /usr/share/jtreg/lib/javatest.jar │ │ │ │ │ /usr/share/jtreg/lib/jtreg.jar │ │ │ │ │ patch: java.base /tmp/jdk/JTwork/patches/java.base │ │ │ │ │ │ │ │ │ │ javac compilation environment │ │ │ │ │ @@ -135,31 +135,31 @@ │ │ │ │ │ ----------stderr:(0/0)---------- │ │ │ │ │ result: Passed. Compilation successful │ │ │ │ │ │ │ │ │ │ #section:build │ │ │ │ │ ----------messages:(5/196)---------- │ │ │ │ │ command: build jdk.test.lib.FileInstaller │ │ │ │ │ reason: Named class compiled on demand │ │ │ │ │ -started: Thu Oct 08 18:59:17.953 UTC 2026 │ │ │ │ │ -finished: Thu Oct 08 18:59:17.954 UTC 2026 │ │ │ │ │ +started: Fri Oct 16 11:27:38.681 UTC 2026 │ │ │ │ │ +finished: Fri Oct 16 11:27:38.682 UTC 2026 │ │ │ │ │ elapsed time (seconds): 0.001 │ │ │ │ │ result: Passed. All files up to date │ │ │ │ │ │ │ │ │ │ #section:main │ │ │ │ │ ----------messages:(10/925)---------- │ │ │ │ │ command: main jdk.test.lib.FileInstaller TestHosts TestHosts │ │ │ │ │ reason: User specified action: run main jdk.test.lib.FileInstaller TestHosts TestHosts │ │ │ │ │ -started: Thu Oct 08 18:59:17.954 UTC 2026 │ │ │ │ │ +started: Fri Oct 16 11:27:38.682 UTC 2026 │ │ │ │ │ Mode: agentvm │ │ │ │ │ Agent id: 1 │ │ │ │ │ -Process id: 1021391 │ │ │ │ │ +Process id: 3381293 │ │ │ │ │ Additional exports to unnamed modules from @modules: java.base/jdk.internal.misc java.base/sun.security.util java.security.jgss/sun.security.jgss java.security.jgss/sun.security.jgss.krb5 java.security.jgss/sun.security.krb5 java.security.jgss/sun.security.krb5.internal java.security.jgss/sun.security.krb5.internal.ccache java.security.jgss/sun.security.krb5.internal.rcache java.security.jgss/sun.security.krb5.internal.crypto java.security.jgss/sun.security.krb5.internal.ktab │ │ │ │ │ Additional opens to unnamed modules from @modules: java.security.jgss/sun.security.krb5 java.security.jgss/sun.security.krb5.internal │ │ │ │ │ -finished: Thu Oct 08 18:59:18.008 UTC 2026 │ │ │ │ │ -elapsed time (seconds): 0.054 │ │ │ │ │ +finished: Fri Oct 16 11:27:38.750 UTC 2026 │ │ │ │ │ +elapsed time (seconds): 0.068 │ │ │ │ │ ----------configuration:(29/1786)---------- │ │ │ │ │ Boot Layer │ │ │ │ │ class path: /usr/share/jtreg/lib/javatest.jar │ │ │ │ │ /usr/share/jtreg/lib/jtreg.jar │ │ │ │ │ /usr/share/jtreg/lib/junit-platform-console-standalone.jar │ │ │ │ │ /usr/share/jtreg/lib/testng.jar │ │ │ │ │ /usr/share/jtreg/lib/guice.jar │ │ │ │ │ @@ -227,29 +227,29 @@ │ │ │ │ │ │ │ │ │ │ result: Passed. Execution successful │ │ │ │ │ │ │ │ │ │ #section:build │ │ │ │ │ ----------messages:(5/179)---------- │ │ │ │ │ command: build Addresses │ │ │ │ │ reason: Named class compiled on demand │ │ │ │ │ -started: Thu Oct 08 18:59:18.008 UTC 2026 │ │ │ │ │ -finished: Thu Oct 08 18:59:18.009 UTC 2026 │ │ │ │ │ +started: Fri Oct 16 11:27:38.750 UTC 2026 │ │ │ │ │ +finished: Fri Oct 16 11:27:38.751 UTC 2026 │ │ │ │ │ elapsed time (seconds): 0.001 │ │ │ │ │ result: Passed. All files up to date │ │ │ │ │ │ │ │ │ │ #section:main │ │ │ │ │ ----------messages:(8/1247)---------- │ │ │ │ │ command: main -Djdk.net.hosts.file=TestHosts Addresses │ │ │ │ │ reason: User specified action: run main/othervm -Djdk.net.hosts.file=TestHosts Addresses │ │ │ │ │ -started: Thu Oct 08 18:59:18.009 UTC 2026 │ │ │ │ │ +started: Fri Oct 16 11:27:38.751 UTC 2026 │ │ │ │ │ Mode: othervm [/othervm specified] │ │ │ │ │ Additional options from @modules: --add-modules java.base,java.security.jgss,jdk.security.auth,jdk.security.jgss --add-exports java.base/jdk.internal.misc=ALL-UNNAMED --add-exports java.base/sun.security.util=ALL-UNNAMED --add-exports java.security.jgss/sun.security.jgss=ALL-UNNAMED --add-exports java.security.jgss/sun.security.jgss.krb5=ALL-UNNAMED --add-exports java.security.jgss/sun.security.krb5=ALL-UNNAMED --add-opens java.security.jgss/sun.security.krb5=ALL-UNNAMED --add-exports java.security.jgss/sun.security.krb5.internal=ALL-UNNAMED --add-opens java.security.jgss/sun.security.krb5.internal=ALL-UNNAMED --add-exports java.security.jgss/sun.security.krb5.internal.ccache=ALL-UNNAMED --add-exports java.security.jgss/sun.security.krb5.internal.rcache=ALL-UNNAMED --add-exports java.security.jgss/sun.security.krb5.internal.crypto=ALL-UNNAMED --add-exports java.security.jgss/sun.security.krb5.internal.ktab=ALL-UNNAMED │ │ │ │ │ -Process id: 1021538 │ │ │ │ │ -finished: Thu Oct 08 18:59:20.022 UTC 2026 │ │ │ │ │ -elapsed time (seconds): 2.013 │ │ │ │ │ +Process id: 3381445 │ │ │ │ │ +finished: Fri Oct 16 11:27:41.803 UTC 2026 │ │ │ │ │ +elapsed time (seconds): 3.052 │ │ │ │ │ ----------configuration:(15/1053)---------- │ │ │ │ │ Boot Layer │ │ │ │ │ add modules: java.base java.security.jgss jdk.security.auth jdk.security.jgss │ │ │ │ │ add exports: java.base/jdk.internal.misc ALL-UNNAMED │ │ │ │ │ java.base/sun.security.util ALL-UNNAMED │ │ │ │ │ java.security.jgss/sun.security.jgss ALL-UNNAMED │ │ │ │ │ java.security.jgss/sun.security.jgss.krb5 ALL-UNNAMED │ │ │ │ │ @@ -259,27 +259,27 @@ │ │ │ │ │ java.security.jgss/sun.security.krb5.internal.crypto ALL-UNNAMED │ │ │ │ │ java.security.jgss/sun.security.krb5.internal.ktab ALL-UNNAMED │ │ │ │ │ java.security.jgss/sun.security.krb5.internal.rcache ALL-UNNAMED │ │ │ │ │ add opens: java.security.jgss/sun.security.krb5 ALL-UNNAMED │ │ │ │ │ java.security.jgss/sun.security.krb5.internal ALL-UNNAMED │ │ │ │ │ │ │ │ │ │ ----------System.out:(24/852)---------- │ │ │ │ │ -Start KDC on 11065 │ │ │ │ │ +Start KDC on 14066 │ │ │ │ │ ----------------------------------------------- │ │ │ │ │ >>>>> UDP packet received │ │ │ │ │ -RABBIT.HOLE:11065> dummy@RABBIT.HOLE sends AS-REQ for krbtgt/RABBIT.HOLE@RABBIT.HOLE, KDCOptions: │ │ │ │ │ +RABBIT.HOLE:14066> dummy@RABBIT.HOLE sends AS-REQ for krbtgt/RABBIT.HOLE@RABBIT.HOLE, KDCOptions: │ │ │ │ │ KrbException: Additional pre-authentication required (25) │ │ │ │ │ at KDC.processAsReq(KDC.java:1335) │ │ │ │ │ at KDC.processMessage(KDC.java:809) │ │ │ │ │ at KDC$1.run(KDC.java:1565) │ │ │ │ │ Error 25 Additional pre-authentication required │ │ │ │ │ >>>>> UDP request honored │ │ │ │ │ ----------------------------------------------- │ │ │ │ │ >>>>> UDP packet received │ │ │ │ │ -RABBIT.HOLE:11065> dummy@RABBIT.HOLE sends AS-REQ for krbtgt/RABBIT.HOLE@RABBIT.HOLE, KDCOptions: │ │ │ │ │ +RABBIT.HOLE:14066> dummy@RABBIT.HOLE sends AS-REQ for krbtgt/RABBIT.HOLE@RABBIT.HOLE, KDCOptions: │ │ │ │ │ Return dummy@RABBIT.HOLE ticket for krbtgt/RABBIT.HOLE@RABBIT.HOLE, flags INITIAL;PRE-AUTHENT │ │ │ │ │ >>>>> UDP request honored │ │ │ │ │ /10.0.0.10 │ │ │ │ │ extra1 found │ │ │ │ │ /10.0.0.11 │ │ │ │ │ extra2 found │ │ │ │ │ /10.0.0.12 │ │ ├── ./usr/share/doc/openjdk-21-jre-headless/test-i386/jtreg-summary-hotspot.log │ │ │ @@ -1,9 +1,9 @@ │ │ │ --------------- jtreg console summary for hotspot --------------- │ │ │ -Test results: passed: 2,824; skipped: 7; excluded: 45; did not match keywords: 75; did not meet module requirements: 85; did not meet platform requirements: 415 │ │ │ +Test results: passed: 2,810; skipped: 7; excluded: 45; did not match keywords: 75; did not meet module requirements: 85; did not meet platform requirements: 429 │ │ │ Framework-based tests: 437 = 408 TestNG + 29 JUnit │ │ │ [debian/tests/jtreg-autopkgtest.sh] nothing to cleanup │ │ │ Unable to compare jtreg results: no build jtreport found for hotspot/i386. │ │ │ Reason: '/usr/share/doc/openjdk-21-jre-headless//test-i386/jtreport-hotspot.tar.gz' does not exist. │ │ │ --------------- jtreg console summary for langtools --------------- │ │ │ Test results: passed: 4,428; skipped: 1; excluded: 17; did not match keywords: 1; did not meet platform requirements: 1 │ │ │ Framework-based tests: 4,126 = 3,147 TestNG + 979 JUnit │ │ ├── ./usr/share/doc/openjdk-21-jre-headless/test-i386/jtreg_output-hotspot.log.gz │ │ │ ├── jtreg_output-hotspot.log │ │ │ │ @@ -281,16 +281,14 @@ │ │ │ │ Passed: compiler/intrinsics/IntrinsicDisabledTest.java │ │ │ │ Passed: compiler/intrinsics/Test6982370.java │ │ │ │ Passed: compiler/intrinsics/Test8005419.java │ │ │ │ Passed: compiler/intrinsics/Test8215792.java │ │ │ │ Passed: compiler/intrinsics/Test8237524.java │ │ │ │ Passed: compiler/intrinsics/TestArraysHashCode.java │ │ │ │ Passed: compiler/intrinsics/TestCheckIndex.java │ │ │ │ -Passed: compiler/intrinsics/TestDoubleIsInfinite.java │ │ │ │ -Passed: compiler/intrinsics/TestFloatIsInfinite.java │ │ │ │ Passed: compiler/intrinsics/TestReferenceGetWithNull.java │ │ │ │ Passed: compiler/intrinsics/TestReferenceRefersTo.java │ │ │ │ Passed: compiler/intrinsics/TestRotate.java │ │ │ │ Passed: compiler/intrinsics/zip/TestAdler32.java │ │ │ │ Passed: compiler/intrinsics/zip/TestCRC32.java │ │ │ │ Passed: compiler/intrinsics/zip/TestCRC32C.java │ │ │ │ Passed: compiler/intrinsics/zip/TestFpRegsABI.java │ │ │ │ @@ -1456,21 +1454,18 @@ │ │ │ │ Passed: compiler/intrinsics/sha/sanity/TestSHA3Intrinsics.java │ │ │ │ Passed: compiler/intrinsics/sha/sanity/TestSHA3MultiBlockIntrinsics.java │ │ │ │ Passed: compiler/intrinsics/sha/sanity/TestSHA512Intrinsics.java │ │ │ │ Passed: compiler/intrinsics/sha/sanity/TestSHA512MultiBlockIntrinsics.java │ │ │ │ Passed: compiler/intrinsics/sha/TestDigest.java │ │ │ │ Passed: compiler/intrinsics/string/TestCopyValueOf.java │ │ │ │ Passed: compiler/intrinsics/string/TestCountPositives.java#id0 │ │ │ │ -Passed: compiler/intrinsics/string/TestCountPositives.java#id1 │ │ │ │ Passed: compiler/intrinsics/string/TestEncodeIntrinsics.java │ │ │ │ Passed: compiler/intrinsics/string/TestHasNegatives.java#id0 │ │ │ │ -Passed: compiler/intrinsics/string/TestHasNegatives.java#id1 │ │ │ │ Passed: compiler/intrinsics/string/TestStringConstruction.java │ │ │ │ Passed: compiler/intrinsics/string/TestStringConstructionIntrinsics.java#id0 │ │ │ │ -Passed: compiler/intrinsics/string/TestStringConstructionIntrinsics.java#id1 │ │ │ │ Passed: compiler/intrinsics/string/TestStringEqualsBadLength.java │ │ │ │ Passed: compiler/intrinsics/string/TestStringIndexOfCharIntrinsics.java │ │ │ │ Passed: compiler/intrinsics/string/TestStringIntrinsicMemoryFlow.java │ │ │ │ Passed: compiler/intrinsics/string/TestStringIntrinsicRangeChecks.java │ │ │ │ Passed: compiler/intrinsics/string/TestStringIntrinsics.java │ │ │ │ Passed: compiler/intrinsics/string/TestStringIntrinsics2.java │ │ │ │ Passed: compiler/intrinsics/string/TestStringLatin1IndexOfChar.java │ │ │ │ @@ -1544,22 +1539,14 @@ │ │ │ │ Passed: compiler/loopopts/superword/TestDependencyOffsets.java#avx1-v016-U │ │ │ │ Passed: compiler/loopopts/superword/TestDependencyOffsets.java#avx1-v032-A │ │ │ │ Passed: compiler/loopopts/superword/TestDependencyOffsets.java#avx1-v032-U │ │ │ │ Passed: compiler/loopopts/superword/TestDependencyOffsets.java#avx2-v016-A │ │ │ │ Passed: compiler/loopopts/superword/TestDependencyOffsets.java#avx2-v016-U │ │ │ │ Passed: compiler/loopopts/superword/TestDependencyOffsets.java#avx2-v032-A │ │ │ │ Passed: compiler/loopopts/superword/TestDependencyOffsets.java#avx2-v032-U │ │ │ │ -Passed: compiler/loopopts/superword/TestDependencyOffsets.java#avx512bw-v032-A │ │ │ │ -Passed: compiler/loopopts/superword/TestDependencyOffsets.java#avx512bw-v032-U │ │ │ │ -Passed: compiler/loopopts/superword/TestDependencyOffsets.java#avx512bw-v064-A │ │ │ │ -Passed: compiler/loopopts/superword/TestDependencyOffsets.java#avx512bw-v064-U │ │ │ │ -Passed: compiler/loopopts/superword/TestDependencyOffsets.java#avx512-v032-A │ │ │ │ -Passed: compiler/loopopts/superword/TestDependencyOffsets.java#avx512-v032-U │ │ │ │ -Passed: compiler/loopopts/superword/TestDependencyOffsets.java#avx512-v064-A │ │ │ │ -Passed: compiler/loopopts/superword/TestDependencyOffsets.java#avx512-v064-U │ │ │ │ Passed: compiler/loopopts/superword/TestDependencyOffsets.java#sse4-v002-A │ │ │ │ Passed: compiler/loopopts/superword/TestDependencyOffsets.java#sse4-v002-U │ │ │ │ Passed: compiler/loopopts/superword/TestDependencyOffsets.java#sse4-v004-A │ │ │ │ Passed: compiler/loopopts/superword/TestDependencyOffsets.java#sse4-v004-U │ │ │ │ Passed: compiler/loopopts/superword/TestDependencyOffsets.java#sse4-v008-A │ │ │ │ Passed: compiler/loopopts/superword/TestDependencyOffsets.java#sse4-v008-U │ │ │ │ Passed: compiler/loopopts/superword/TestDependencyOffsets.java#sse4-v016-A │ │ │ │ @@ -1835,15 +1822,14 @@ │ │ │ │ Passed: compiler/vectorization/TestMemoryVectorMismatched.java │ │ │ │ Passed: compiler/vectorization/TestNaNVector.java │ │ │ │ Passed: compiler/vectorization/TestNarrowedIntegerReverseBytes.java │ │ │ │ Passed: compiler/vectorization/TestOptionVectorize.java │ │ │ │ Passed: compiler/vectorization/TestOptionVectorizeIR.java │ │ │ │ Passed: compiler/vectorization/TestOverlappingMismatchedAccesses.java │ │ │ │ Passed: compiler/vectorization/TestPopCountVector.java │ │ │ │ -Passed: compiler/vectorization/TestPopCountVectorLong.java │ │ │ │ Passed: compiler/vectorization/TestReplicateLoopIV.java │ │ │ │ Passed: compiler/vectorization/TestRotateByteAndShortVector.java │ │ │ │ Passed: compiler/vectorization/TestSmallVectorPopIndex.java │ │ │ │ Passed: compiler/vectorization/TestSubwordReverseBytes.java │ │ │ │ Passed: compiler/vectorization/TestUnexpectedLoadOrdering.java │ │ │ │ Passed: compiler/vectorization/TestVectorsNotSavedAtSafepoint.java │ │ │ │ Passed: compiler/vectorization/TestVectorUnalignedOffset.java │ │ │ │ @@ -2835,41 +2821,41 @@ │ │ │ │ Passed: serviceability/tmtools/jstat/GcCapacityTest.java │ │ │ │ Passed: serviceability/tmtools/jstat/GcCauseTest01.java │ │ │ │ Passed: serviceability/tmtools/jstat/GcCauseTest02.java │ │ │ │ Passed: serviceability/tmtools/jstat/GcCauseTest03.java │ │ │ │ Passed: serviceability/tmtools/jstat/GcNewTest.java │ │ │ │ Passed: serviceability/tmtools/jstat/GcTest01.java │ │ │ │ Passed: serviceability/tmtools/jstat/GcTest02.java │ │ │ │ -Test results: passed: 2,824; skipped: 7; excluded: 45; did not match keywords: 75; did not meet module requirements: 85; did not meet platform requirements: 415 │ │ │ │ +Test results: passed: 2,810; skipped: 7; excluded: 45; did not match keywords: 75; did not meet module requirements: 85; did not meet platform requirements: 429 │ │ │ │ Framework-based tests: 437 = 408 TestNG + 29 JUnit │ │ │ │ Report written to /build/reproducible-path/openjdk-21-21.0.13~8ea/jtreg-test-output/hotspot/0/JTreport/html/report.html │ │ │ │ Results written to /tmp/hotspot/JTwork │ │ │ │ [debian/tests/jtreg-autopkgtest.sh] nothing to cleanup │ │ │ │ grep: debian/tests/hotspot-archs: No such file or directory │ │ │ │ Unable to compare jtreg results: no build jtreport found for hotspot/i386. │ │ │ │ Reason: '/usr/share/doc/openjdk-21-jre-headless//test-i386/jtreport-hotspot.tar.gz' does not exist. │ │ │ │ Command exited with non-zero status 77 │ │ │ │ Command being timed: "debian/tests/hotspot" │ │ │ │ - User time (seconds): 7609.51 │ │ │ │ - System time (seconds): 1524.81 │ │ │ │ - Percent of CPU this job got: 124% │ │ │ │ - Elapsed (wall clock) time (h:mm:ss or m:ss): 2:02:40 │ │ │ │ + User time (seconds): 12260.64 │ │ │ │ + System time (seconds): 2106.82 │ │ │ │ + Percent of CPU this job got: 140% │ │ │ │ + Elapsed (wall clock) time (h:mm:ss or m:ss): 2:50:39 │ │ │ │ Average shared text size (kbytes): 0 │ │ │ │ Average unshared data size (kbytes): 0 │ │ │ │ Average stack size (kbytes): 0 │ │ │ │ Average total size (kbytes): 0 │ │ │ │ - Maximum resident set size (kbytes): 1356092 │ │ │ │ + Maximum resident set size (kbytes): 1348044 │ │ │ │ Average resident set size (kbytes): 0 │ │ │ │ - Major (requiring I/O) page faults: 2604 │ │ │ │ - Minor (reclaiming a frame) page faults: 129773906 │ │ │ │ - Voluntary context switches: 63076123 │ │ │ │ - Involuntary context switches: 9687750 │ │ │ │ + Major (requiring I/O) page faults: 284 │ │ │ │ + Minor (reclaiming a frame) page faults: 140614987 │ │ │ │ + Voluntary context switches: 48289316 │ │ │ │ + Involuntary context switches: 3707716 │ │ │ │ Swaps: 0 │ │ │ │ - File system inputs: 370040 │ │ │ │ - File system outputs: 0 │ │ │ │ + File system inputs: 1458320 │ │ │ │ + File system outputs: 15321968 │ │ │ │ Socket messages sent: 0 │ │ │ │ Socket messages received: 0 │ │ │ │ Signals delivered: 0 │ │ │ │ Page size (bytes): 4096 │ │ │ │ Exit status: 77 │ │ │ │ ===== END check-hotspot ===== │ │ │ │ ===== START check-langtools ===== │ │ │ │ @@ -7322,31 +7308,31 @@ │ │ │ │ Results written to /tmp/langtools/JTwork │ │ │ │ [debian/tests/jtreg-autopkgtest.sh] nothing to cleanup │ │ │ │ grep: debian/tests/hotspot-archs: No such file or directory │ │ │ │ Unable to compare jtreg results: no build jtreport found for hotspot/i386. │ │ │ │ Reason: '/usr/share/doc/openjdk-21-jre-headless//test-i386/jtreport-hotspot.tar.gz' does not exist. │ │ │ │ Command exited with non-zero status 77 │ │ │ │ Command being timed: "debian/tests/langtools" │ │ │ │ - User time (seconds): 2112.28 │ │ │ │ - System time (seconds): 202.66 │ │ │ │ - Percent of CPU this job got: 120% │ │ │ │ - Elapsed (wall clock) time (h:mm:ss or m:ss): 32:08.36 │ │ │ │ + User time (seconds): 4215.79 │ │ │ │ + System time (seconds): 376.88 │ │ │ │ + Percent of CPU this job got: 150% │ │ │ │ + Elapsed (wall clock) time (h:mm:ss or m:ss): 50:48.52 │ │ │ │ Average shared text size (kbytes): 0 │ │ │ │ Average unshared data size (kbytes): 0 │ │ │ │ Average stack size (kbytes): 0 │ │ │ │ Average total size (kbytes): 0 │ │ │ │ - Maximum resident set size (kbytes): 1192640 │ │ │ │ + Maximum resident set size (kbytes): 1237792 │ │ │ │ Average resident set size (kbytes): 0 │ │ │ │ - Major (requiring I/O) page faults: 10 │ │ │ │ - Minor (reclaiming a frame) page faults: 13506322 │ │ │ │ - Voluntary context switches: 3925804 │ │ │ │ - Involuntary context switches: 134351 │ │ │ │ + Major (requiring I/O) page faults: 0 │ │ │ │ + Minor (reclaiming a frame) page faults: 17064934 │ │ │ │ + Voluntary context switches: 4206656 │ │ │ │ + Involuntary context switches: 81991 │ │ │ │ Swaps: 0 │ │ │ │ - File system inputs: 206648 │ │ │ │ - File system outputs: 0 │ │ │ │ + File system inputs: 194544 │ │ │ │ + File system outputs: 3215176 │ │ │ │ Socket messages sent: 0 │ │ │ │ Socket messages received: 0 │ │ │ │ Signals delivered: 0 │ │ │ │ Page size (bytes): 4096 │ │ │ │ Exit status: 77 │ │ │ │ ===== END check-langtools ===== │ │ │ │ ===== START check-jaxp ===== │ │ │ │ @@ -7872,62 +7858,62 @@ │ │ │ │ Results written to /tmp/jaxp/JTwork │ │ │ │ [debian/tests/jtreg-autopkgtest.sh] nothing to cleanup │ │ │ │ grep: debian/tests/hotspot-archs: No such file or directory │ │ │ │ Unable to compare jtreg results: no build jtreport found for hotspot/i386. │ │ │ │ Reason: '/usr/share/doc/openjdk-21-jre-headless//test-i386/jtreport-hotspot.tar.gz' does not exist. │ │ │ │ Command exited with non-zero status 77 │ │ │ │ Command being timed: "debian/tests/jaxp" │ │ │ │ - User time (seconds): 1607.39 │ │ │ │ - System time (seconds): 104.93 │ │ │ │ - Percent of CPU this job got: 244% │ │ │ │ - Elapsed (wall clock) time (h:mm:ss or m:ss): 11:38.92 │ │ │ │ + User time (seconds): 3330.93 │ │ │ │ + System time (seconds): 213.23 │ │ │ │ + Percent of CPU this job got: 246% │ │ │ │ + Elapsed (wall clock) time (h:mm:ss or m:ss): 23:59.22 │ │ │ │ Average shared text size (kbytes): 0 │ │ │ │ Average unshared data size (kbytes): 0 │ │ │ │ Average stack size (kbytes): 0 │ │ │ │ Average total size (kbytes): 0 │ │ │ │ - Maximum resident set size (kbytes): 250944 │ │ │ │ + Maximum resident set size (kbytes): 241752 │ │ │ │ Average resident set size (kbytes): 0 │ │ │ │ - Major (requiring I/O) page faults: 54 │ │ │ │ - Minor (reclaiming a frame) page faults: 15961520 │ │ │ │ - Voluntary context switches: 2342152 │ │ │ │ - Involuntary context switches: 24158 │ │ │ │ + Major (requiring I/O) page faults: 0 │ │ │ │ + Minor (reclaiming a frame) page faults: 22309323 │ │ │ │ + Voluntary context switches: 2471138 │ │ │ │ + Involuntary context switches: 23616 │ │ │ │ Swaps: 0 │ │ │ │ - File system inputs: 671440 │ │ │ │ - File system outputs: 0 │ │ │ │ + File system inputs: 859096 │ │ │ │ + File system outputs: 3046632 │ │ │ │ Socket messages sent: 0 │ │ │ │ Socket messages received: 0 │ │ │ │ Signals delivered: 0 │ │ │ │ Page size (bytes): 4096 │ │ │ │ Exit status: 77 │ │ │ │ ===== END check-jaxp ===== │ │ │ │ ===== START check-jdk ===== │ │ │ │ mkdir -p jtreg-test-output/jdk │ │ │ │ BOOTJDK_HOME=/usr/lib/jvm/java-21-openjdk-i386 JTREG_OPTIONS= VMNAME=hotspot JDK_TO_TEST=build/bootcycle-build/images/jdk \ │ │ │ │ AUTOPKGTEST_TMP=/tmp/ AUTOPKGTEST_ARTIFACTS=jtreg-test-output/ \ │ │ │ │ /usr/bin/time -v debian/tests/jdk | tee jtreg-test-output/check-jdk.log │ │ │ │ │ │ │ │ -(xfwm4:486114): atspi-WARNING **: 15:17:52.116: AT-SPI: Error retrieving accessibility bus address: org.freedesktop.DBus.Error.ServiceUnknown: The name org.a11y.Bus was not provided by any .service files │ │ │ │ -dbus-daemon[486103]: [session uid=999 pid=486103 pidfd=5] Activating service name='org.xfce.Xfconf' requested by ':1.1' (uid=999 pid=486114 comm="xfwm4") │ │ │ │ -dbus-daemon[486103]: [session uid=999 pid=486103 pidfd=5] Successfully activated service 'org.xfce.Xfconf' │ │ │ │ +(xfwm4:2838417): atspi-WARNING **: 06:01:00.046: AT-SPI: Error retrieving accessibility bus address: org.freedesktop.DBus.Error.ServiceUnknown: The name org.a11y.Bus was not provided by any .service files │ │ │ │ +dbus-daemon[2838406]: [session uid=999 pid=2838406 pidfd=5] Activating service name='org.xfce.Xfconf' requested by ':1.1' (uid=999 pid=2838417 comm="xfwm4") │ │ │ │ +dbus-daemon[2838406]: [session uid=999 pid=2838406 pidfd=5] Successfully activated service 'org.xfce.Xfconf' │ │ │ │ WARNING: Glycin running without sandbox. Bubblewrap (bwrap) doesn't work in the environment. │ │ │ │ - │ │ │ │ -(xfwm4:486114): xfwm4-WARNING **: 15:17:53.653: Another compositing manager is running on screen 0 │ │ │ │ - │ │ │ │ -(xfwm4:486114): xfwm4-WARNING **: 15:17:53.659: Failed to connect to session manager: Failed to connect to the session manager: SESSION_MANAGER environment variable not defined │ │ │ │ dpkg: error: --compare-versions takes three arguments: │ │ │ │ │ │ │ │ Type dpkg --help for help about installing and deinstalling packages [*]; │ │ │ │ Use 'apt' or 'aptitude' for user-friendly package management; │ │ │ │ Type dpkg -Dhelp for a list of dpkg debug flag values; │ │ │ │ Type dpkg --force-help for a list of forcing options; │ │ │ │ Type dpkg-deb --help for help about manipulating *.deb files; │ │ │ │ │ │ │ │ Options marked [*] produce a lot of output - pipe it through 'less' or 'more' ! │ │ │ │ Directory "/tmp/jdk/JTwork" not found: creating │ │ │ │ Directory "jtreg-test-output/jdk/0/JTreport" not found: creating │ │ │ │ + │ │ │ │ +(xfwm4:2838417): xfwm4-WARNING **: 06:01:03.901: Another compositing manager is running on screen 0 │ │ │ │ + │ │ │ │ +(xfwm4:2838417): xfwm4-WARNING **: 06:01:03.904: Failed to connect to session manager: Failed to connect to the session manager: SESSION_MANAGER environment variable not defined │ │ │ │ Passed: com/sun/jdi/AcceptTimeout.java │ │ │ │ Passed: com/sun/jdi/AccessSpecifierTest.java │ │ │ │ Passed: com/sun/jdi/AfterThreadDeathTest.java │ │ │ │ Passed: com/sun/jdi/ArrayRangeTest.java │ │ │ │ Passed: com/sun/jdi/ConstantPoolInfo.java │ │ │ │ Passed: com/sun/jdi/CountFilterTest.java │ │ │ │ Passed: com/sun/jdi/EarlyReturnNegativeTest.java │ │ │ │ @@ -14371,44 +14357,44 @@ │ │ │ │ Framework-based tests: 8 = 8 TestNG + 0 JUnit │ │ │ │ Report written to /build/reproducible-path/openjdk-21-21.0.13~8ea/jtreg-test-output/jdk/2/JTreport/html/report.html │ │ │ │ Results written to /tmp/jdk/JTwork │ │ │ │ Error: Some tests failed or other problems occurred. │ │ │ │ [debian/tests/jtreg-autopkgtest.sh] nothing to cleanup │ │ │ │ Command exited with non-zero status 2 │ │ │ │ Command being timed: "debian/tests/jdk" │ │ │ │ - User time (seconds): 14563.34 │ │ │ │ - System time (seconds): 1134.75 │ │ │ │ - Percent of CPU this job got: 118% │ │ │ │ - Elapsed (wall clock) time (h:mm:ss or m:ss): 3:41:43 │ │ │ │ + User time (seconds): 27035.26 │ │ │ │ + System time (seconds): 2071.53 │ │ │ │ + Percent of CPU this job got: 148% │ │ │ │ + Elapsed (wall clock) time (h:mm:ss or m:ss): 5:27:07 │ │ │ │ Average shared text size (kbytes): 0 │ │ │ │ Average unshared data size (kbytes): 0 │ │ │ │ Average stack size (kbytes): 0 │ │ │ │ Average total size (kbytes): 0 │ │ │ │ - Maximum resident set size (kbytes): 1440104 │ │ │ │ + Maximum resident set size (kbytes): 1458924 │ │ │ │ Average resident set size (kbytes): 0 │ │ │ │ - Major (requiring I/O) page faults: 1824 │ │ │ │ - Minor (reclaiming a frame) page faults: 99010251 │ │ │ │ - Voluntary context switches: 32308279 │ │ │ │ - Involuntary context switches: 1424792 │ │ │ │ + Major (requiring I/O) page faults: 124 │ │ │ │ + Minor (reclaiming a frame) page faults: 138475375 │ │ │ │ + Voluntary context switches: 34156158 │ │ │ │ + Involuntary context switches: 1534432 │ │ │ │ Swaps: 0 │ │ │ │ - File system inputs: 870520 │ │ │ │ - File system outputs: 0 │ │ │ │ + File system inputs: 3669640 │ │ │ │ + File system outputs: 63131552 │ │ │ │ Socket messages sent: 0 │ │ │ │ Socket messages received: 0 │ │ │ │ Signals delivered: 0 │ │ │ │ Page size (bytes): 4096 │ │ │ │ Exit status: 2 │ │ │ │ Killed │ │ │ │ ===== END check-jdk ===== │ │ │ │ for i in hotspot langtools jaxp jdk; do \ │ │ │ │ echo "--------------- jtreg console summary for $i ---------------"; \ │ │ │ │ egrep -v '^(Passed:|Directory|Re[a-z]+\ written\ to)' jtreg-test-output/check-$i.log; \ │ │ │ │ done | tee jtreg-test-output/jtreg-summary.log │ │ │ │ --------------- jtreg console summary for hotspot --------------- │ │ │ │ -Test results: passed: 2,824; skipped: 7; excluded: 45; did not match keywords: 75; did not meet module requirements: 85; did not meet platform requirements: 415 │ │ │ │ +Test results: passed: 2,810; skipped: 7; excluded: 45; did not match keywords: 75; did not meet module requirements: 85; did not meet platform requirements: 429 │ │ │ │ Framework-based tests: 437 = 408 TestNG + 29 JUnit │ │ │ │ [debian/tests/jtreg-autopkgtest.sh] nothing to cleanup │ │ │ │ Unable to compare jtreg results: no build jtreport found for hotspot/i386. │ │ │ │ Reason: '/usr/share/doc/openjdk-21-jre-headless//test-i386/jtreport-hotspot.tar.gz' does not exist. │ │ │ │ --------------- jtreg console summary for langtools --------------- │ │ │ │ Test results: passed: 4,428; skipped: 1; excluded: 17; did not match keywords: 1; did not meet platform requirements: 1 │ │ │ │ Framework-based tests: 4,126 = 3,147 TestNG + 979 JUnit │ │ │ │ @@ -14454,29 +14440,29 @@ │ │ │ │ FAILED: java/net/SocketPermission/SocketPermissionTest.java │ │ │ │ FAILED: sun/security/krb5/auto/Addresses.java │ │ │ │ Test results: failed: 9; excluded: 48; did not match keywords: 37; did not match prior status: 6,594 │ │ │ │ Framework-based tests: 8 = 8 TestNG + 0 JUnit │ │ │ │ [debian/tests/jtreg-autopkgtest.sh] nothing to cleanup │ │ │ │ make[2]: Leaving directory '/build/reproducible-path/openjdk-21-21.0.13~8ea' │ │ │ │ Command being timed: "/usr/bin/make -f debian/rules -k jtregcheck TEST_SUITES=hotspot langtools jaxp jdk JTREG_OPTIONS=" │ │ │ │ - User time (seconds): 25893.09 │ │ │ │ - System time (seconds): 2967.81 │ │ │ │ - Percent of CPU this job got: 123% │ │ │ │ - Elapsed (wall clock) time (h:mm:ss or m:ss): 6:28:11 │ │ │ │ + User time (seconds): 46843.52 │ │ │ │ + System time (seconds): 4769.77 │ │ │ │ + Percent of CPU this job got: 25% │ │ │ │ + Elapsed (wall clock) time (h:mm:ss or m:ss): 9:32:35 │ │ │ │ Average shared text size (kbytes): 0 │ │ │ │ Average unshared data size (kbytes): 0 │ │ │ │ Average stack size (kbytes): 0 │ │ │ │ Average total size (kbytes): 0 │ │ │ │ - Maximum resident set size (kbytes): 1440104 │ │ │ │ + Maximum resident set size (kbytes): 1458924 │ │ │ │ Average resident set size (kbytes): 0 │ │ │ │ - Major (requiring I/O) page faults: 4496 │ │ │ │ - Minor (reclaiming a frame) page faults: 258275649 │ │ │ │ - Voluntary context switches: 101666905 │ │ │ │ - Involuntary context switches: 11271081 │ │ │ │ + Major (requiring I/O) page faults: 409 │ │ │ │ + Minor (reclaiming a frame) page faults: 318488290 │ │ │ │ + Voluntary context switches: 89137836 │ │ │ │ + Involuntary context switches: 5347808 │ │ │ │ Swaps: 0 │ │ │ │ - File system inputs: 2118680 │ │ │ │ - File system outputs: 0 │ │ │ │ + File system inputs: 6182728 │ │ │ │ + File system outputs: 84732288 │ │ │ │ Socket messages sent: 0 │ │ │ │ Socket messages received: 0 │ │ │ │ Signals delivered: 0 │ │ │ │ Page size (bytes): 4096 │ │ │ │ Exit status: 0 │ │ ├── ./usr/share/doc/openjdk-21-jre-headless/test-i386/jtreport-hotspot.tar.gz │ │ │ ├── jtreport-hotspot.tar │ │ │ │ ├── file list │ │ │ │ │ @@ -1,230 +1,230 @@ │ │ │ │ │ -lrwxrwxrwx 0 sbuild (999) sbuild (999) 0 2026-10-08 18:59:35.000000 jtreg-test-output/jdk/JTreport -> 2/JTreport │ │ │ │ │ -drwxr-xr-x 0 sbuild (999) sbuild (999) 0 2026-10-08 18:59:23.000000 jtreg-test-output/jdk/2/JTreport/ │ │ │ │ │ --rw-r--r-- 0 sbuild (999) sbuild (999) 712 2026-10-08 18:59:23.000000 jtreg-test-output/jdk/2/JTreport/index.html │ │ │ │ │ --rw-r--r-- 0 sbuild (999) sbuild (999) 0 2026-10-08 18:59:23.000000 jtreg-test-output/jdk/2/JTreport/reportdir.dat │ │ │ │ │ -drwxr-xr-x 0 sbuild (999) sbuild (999) 0 2026-10-08 18:59:23.000000 jtreg-test-output/jdk/2/JTreport/html/ │ │ │ │ │ --rw-r--r-- 0 sbuild (999) sbuild (999) 762638 2026-10-08 18:59:23.000000 jtreg-test-output/jdk/2/JTreport/html/notRun_gr.html │ │ │ │ │ --rw-r--r-- 0 sbuild (999) sbuild (999) 762365 2026-10-08 18:59:23.000000 jtreg-test-output/jdk/2/JTreport/html/notRun.html │ │ │ │ │ --rw-r--r-- 0 sbuild (999) sbuild (999) 520 2026-10-08 18:59:23.000000 jtreg-test-output/jdk/2/JTreport/html/error_gr.html │ │ │ │ │ --rw-r--r-- 0 sbuild (999) sbuild (999) 472 2026-10-08 18:59:23.000000 jtreg-test-output/jdk/2/JTreport/html/error.html │ │ │ │ │ --rw-r--r-- 0 sbuild (999) sbuild (999) 2749 2026-10-08 18:59:23.000000 jtreg-test-output/jdk/2/JTreport/html/failed_gr.html │ │ │ │ │ --rw-r--r-- 0 sbuild (999) sbuild (999) 2019 2026-10-08 18:59:23.000000 jtreg-test-output/jdk/2/JTreport/html/failed.html │ │ │ │ │ --rw-r--r-- 0 sbuild (999) sbuild (999) 1233315 2026-10-08 18:59:23.000000 jtreg-test-output/jdk/2/JTreport/html/passed_gr.html │ │ │ │ │ --rw-r--r-- 0 sbuild (999) sbuild (999) 1232167 2026-10-08 18:59:22.000000 jtreg-test-output/jdk/2/JTreport/html/passed.html │ │ │ │ │ --rw-r--r-- 0 sbuild (999) sbuild (999) 85436 2026-10-08 18:59:22.000000 jtreg-test-output/jdk/2/JTreport/html/excluded.html │ │ │ │ │ --rw-r--r-- 0 sbuild (999) sbuild (999) 4142 2026-10-08 18:59:22.000000 jtreg-test-output/jdk/2/JTreport/html/env.html │ │ │ │ │ --rw-r--r-- 0 sbuild (999) sbuild (999) 24358 2026-10-08 18:59:22.000000 jtreg-test-output/jdk/2/JTreport/html/config.html │ │ │ │ │ --rw-r--r-- 0 sbuild (999) sbuild (999) 307 2026-10-08 18:59:22.000000 jtreg-test-output/jdk/2/JTreport/html/report.css │ │ │ │ │ --rw-r--r-- 0 sbuild (999) sbuild (999) 1101871 2026-10-08 18:59:22.000000 jtreg-test-output/jdk/2/JTreport/html/index.html │ │ │ │ │ --rw-r--r-- 0 sbuild (999) sbuild (999) 1101871 2026-10-08 18:59:22.000000 jtreg-test-output/jdk/2/JTreport/html/report.html │ │ │ │ │ -drwxr-xr-x 0 sbuild (999) sbuild (999) 0 2026-10-08 18:59:23.000000 jtreg-test-output/jdk/2/JTreport/text/ │ │ │ │ │ --rw-r--r-- 0 sbuild (999) sbuild (999) 132 2026-10-08 18:59:23.000000 jtreg-test-output/jdk/2/JTreport/text/testng.txt │ │ │ │ │ --rw-r--r-- 0 sbuild (999) sbuild (999) 1023448 2026-10-08 18:59:23.000000 jtreg-test-output/jdk/2/JTreport/text/notRun.txt │ │ │ │ │ --rw-r--r-- 0 sbuild (999) sbuild (999) 101 2026-10-08 18:59:23.000000 jtreg-test-output/jdk/2/JTreport/text/stats.txt │ │ │ │ │ --rw-r--r-- 0 sbuild (999) sbuild (999) 116 2026-10-08 18:59:23.000000 jtreg-test-output/jdk/2/JTreport/text/timeStats.txt │ │ │ │ │ --rw-r--r-- 0 sbuild (999) sbuild (999) 21 2026-10-08 18:59:23.000000 jtreg-test-output/jdk/2/JTreport/text/tc_newfailures.txt │ │ │ │ │ --rw-r--r-- 0 sbuild (999) sbuild (999) 21 2026-10-08 18:59:23.000000 jtreg-test-output/jdk/2/JTreport/text/tc_fail2notrun.txt │ │ │ │ │ --rw-r--r-- 0 sbuild (999) sbuild (999) 20 2026-10-08 18:59:23.000000 jtreg-test-output/jdk/2/JTreport/text/tc_fail2error.txt │ │ │ │ │ --rw-r--r-- 0 sbuild (999) sbuild (999) 19 2026-10-08 18:59:23.000000 jtreg-test-output/jdk/2/JTreport/text/tc_fail2pass.txt │ │ │ │ │ --rw-r--r-- 0 sbuild (999) sbuild (999) 22 2026-10-08 18:59:23.000000 jtreg-test-output/jdk/2/JTreport/text/tc_fail2missing.txt │ │ │ │ │ --rw-r--r-- 0 sbuild (999) sbuild (999) 19 2026-10-08 18:59:23.000000 jtreg-test-output/jdk/2/JTreport/text/other_errors.txt │ │ │ │ │ --rw-r--r-- 0 sbuild (999) sbuild (999) 416 2026-10-08 18:59:23.000000 jtreg-test-output/jdk/2/JTreport/text/newfailures.txt │ │ │ │ │ --rw-r--r-- 0 sbuild (999) sbuild (999) 16 2026-10-08 18:59:23.000000 jtreg-test-output/jdk/2/JTreport/text/fail2fail.txt │ │ │ │ │ --rw-r--r-- 0 sbuild (999) sbuild (999) 18 2026-10-08 18:59:23.000000 jtreg-test-output/jdk/2/JTreport/text/fail2notrun.txt │ │ │ │ │ --rw-r--r-- 0 sbuild (999) sbuild (999) 17 2026-10-08 18:59:23.000000 jtreg-test-output/jdk/2/JTreport/text/faiL2error.txt │ │ │ │ │ --rw-r--r-- 0 sbuild (999) sbuild (999) 16 2026-10-08 18:59:23.000000 jtreg-test-output/jdk/2/JTreport/text/fail2pass.txt │ │ │ │ │ --rw-r--r-- 0 sbuild (999) sbuild (999) 19 2026-10-08 18:59:23.000000 jtreg-test-output/jdk/2/JTreport/text/fail2missing.txt │ │ │ │ │ --rw-r--r-- 0 sbuild (999) sbuild (999) 877861 2026-10-08 18:59:23.000000 jtreg-test-output/jdk/2/JTreport/text/summary.txt │ │ │ │ │ --rw-r--r-- 0 sbuild (999) sbuild (999) 549 2026-10-08 18:59:13.000000 jtreg-test-output/jdk/2/JTreport/text/cmdArgs.txt │ │ │ │ │ -drwxr-xr-x 0 sbuild (999) sbuild (999) 0 2026-10-08 18:59:01.000000 jtreg-test-output/jdk/1/JTreport/ │ │ │ │ │ --rw-r--r-- 0 sbuild (999) sbuild (999) 712 2026-10-08 18:59:01.000000 jtreg-test-output/jdk/1/JTreport/index.html │ │ │ │ │ --rw-r--r-- 0 sbuild (999) sbuild (999) 0 2026-10-08 18:59:01.000000 jtreg-test-output/jdk/1/JTreport/reportdir.dat │ │ │ │ │ -drwxr-xr-x 0 sbuild (999) sbuild (999) 0 2026-10-08 18:59:00.000000 jtreg-test-output/jdk/1/JTreport/html/ │ │ │ │ │ --rw-r--r-- 0 sbuild (999) sbuild (999) 762638 2026-10-08 18:59:01.000000 jtreg-test-output/jdk/1/JTreport/html/notRun_gr.html │ │ │ │ │ --rw-r--r-- 0 sbuild (999) sbuild (999) 762365 2026-10-08 18:59:00.000000 jtreg-test-output/jdk/1/JTreport/html/notRun.html │ │ │ │ │ --rw-r--r-- 0 sbuild (999) sbuild (999) 520 2026-10-08 18:59:00.000000 jtreg-test-output/jdk/1/JTreport/html/error_gr.html │ │ │ │ │ --rw-r--r-- 0 sbuild (999) sbuild (999) 472 2026-10-08 18:59:00.000000 jtreg-test-output/jdk/1/JTreport/html/error.html │ │ │ │ │ --rw-r--r-- 0 sbuild (999) sbuild (999) 2749 2026-10-08 18:59:00.000000 jtreg-test-output/jdk/1/JTreport/html/failed_gr.html │ │ │ │ │ --rw-r--r-- 0 sbuild (999) sbuild (999) 2019 2026-10-08 18:59:00.000000 jtreg-test-output/jdk/1/JTreport/html/failed.html │ │ │ │ │ --rw-r--r-- 0 sbuild (999) sbuild (999) 1233315 2026-10-08 18:59:00.000000 jtreg-test-output/jdk/1/JTreport/html/passed_gr.html │ │ │ │ │ --rw-r--r-- 0 sbuild (999) sbuild (999) 1232167 2026-10-08 18:59:00.000000 jtreg-test-output/jdk/1/JTreport/html/passed.html │ │ │ │ │ --rw-r--r-- 0 sbuild (999) sbuild (999) 85436 2026-10-08 18:59:00.000000 jtreg-test-output/jdk/1/JTreport/html/excluded.html │ │ │ │ │ --rw-r--r-- 0 sbuild (999) sbuild (999) 4142 2026-10-08 18:59:00.000000 jtreg-test-output/jdk/1/JTreport/html/env.html │ │ │ │ │ --rw-r--r-- 0 sbuild (999) sbuild (999) 24358 2026-10-08 18:59:00.000000 jtreg-test-output/jdk/1/JTreport/html/config.html │ │ │ │ │ --rw-r--r-- 0 sbuild (999) sbuild (999) 307 2026-10-08 18:59:00.000000 jtreg-test-output/jdk/1/JTreport/html/report.css │ │ │ │ │ --rw-r--r-- 0 sbuild (999) sbuild (999) 1101871 2026-10-08 18:59:00.000000 jtreg-test-output/jdk/1/JTreport/html/index.html │ │ │ │ │ --rw-r--r-- 0 sbuild (999) sbuild (999) 1101871 2026-10-08 18:59:00.000000 jtreg-test-output/jdk/1/JTreport/html/report.html │ │ │ │ │ -drwxr-xr-x 0 sbuild (999) sbuild (999) 0 2026-10-08 18:59:01.000000 jtreg-test-output/jdk/1/JTreport/text/ │ │ │ │ │ --rw-r--r-- 0 sbuild (999) sbuild (999) 132 2026-10-08 18:59:01.000000 jtreg-test-output/jdk/1/JTreport/text/testng.txt │ │ │ │ │ --rw-r--r-- 0 sbuild (999) sbuild (999) 1023448 2026-10-08 18:59:01.000000 jtreg-test-output/jdk/1/JTreport/text/notRun.txt │ │ │ │ │ --rw-r--r-- 0 sbuild (999) sbuild (999) 101 2026-10-08 18:59:01.000000 jtreg-test-output/jdk/1/JTreport/text/stats.txt │ │ │ │ │ --rw-r--r-- 0 sbuild (999) sbuild (999) 116 2026-10-08 18:59:01.000000 jtreg-test-output/jdk/1/JTreport/text/timeStats.txt │ │ │ │ │ --rw-r--r-- 0 sbuild (999) sbuild (999) 21 2026-10-08 18:59:01.000000 jtreg-test-output/jdk/1/JTreport/text/tc_newfailures.txt │ │ │ │ │ --rw-r--r-- 0 sbuild (999) sbuild (999) 21 2026-10-08 18:59:01.000000 jtreg-test-output/jdk/1/JTreport/text/tc_fail2notrun.txt │ │ │ │ │ --rw-r--r-- 0 sbuild (999) sbuild (999) 20 2026-10-08 18:59:01.000000 jtreg-test-output/jdk/1/JTreport/text/tc_fail2error.txt │ │ │ │ │ --rw-r--r-- 0 sbuild (999) sbuild (999) 19 2026-10-08 18:59:01.000000 jtreg-test-output/jdk/1/JTreport/text/tc_fail2pass.txt │ │ │ │ │ --rw-r--r-- 0 sbuild (999) sbuild (999) 22 2026-10-08 18:59:01.000000 jtreg-test-output/jdk/1/JTreport/text/tc_fail2missing.txt │ │ │ │ │ --rw-r--r-- 0 sbuild (999) sbuild (999) 19 2026-10-08 18:59:01.000000 jtreg-test-output/jdk/1/JTreport/text/other_errors.txt │ │ │ │ │ --rw-r--r-- 0 sbuild (999) sbuild (999) 416 2026-10-08 18:59:01.000000 jtreg-test-output/jdk/1/JTreport/text/newfailures.txt │ │ │ │ │ --rw-r--r-- 0 sbuild (999) sbuild (999) 16 2026-10-08 18:59:01.000000 jtreg-test-output/jdk/1/JTreport/text/fail2fail.txt │ │ │ │ │ --rw-r--r-- 0 sbuild (999) sbuild (999) 18 2026-10-08 18:59:01.000000 jtreg-test-output/jdk/1/JTreport/text/fail2notrun.txt │ │ │ │ │ --rw-r--r-- 0 sbuild (999) sbuild (999) 17 2026-10-08 18:59:01.000000 jtreg-test-output/jdk/1/JTreport/text/faiL2error.txt │ │ │ │ │ --rw-r--r-- 0 sbuild (999) sbuild (999) 16 2026-10-08 18:59:01.000000 jtreg-test-output/jdk/1/JTreport/text/fail2pass.txt │ │ │ │ │ --rw-r--r-- 0 sbuild (999) sbuild (999) 19 2026-10-08 18:59:01.000000 jtreg-test-output/jdk/1/JTreport/text/fail2missing.txt │ │ │ │ │ --rw-r--r-- 0 sbuild (999) sbuild (999) 877861 2026-10-08 18:59:01.000000 jtreg-test-output/jdk/1/JTreport/text/summary.txt │ │ │ │ │ --rw-r--r-- 0 sbuild (999) sbuild (999) 549 2026-10-08 18:58:51.000000 jtreg-test-output/jdk/1/JTreport/text/cmdArgs.txt │ │ │ │ │ -drwxr-xr-x 0 sbuild (999) sbuild (999) 0 2026-10-08 18:58:39.000000 jtreg-test-output/jdk/0/JTreport/ │ │ │ │ │ --rw-r--r-- 0 sbuild (999) sbuild (999) 712 2026-10-08 18:58:39.000000 jtreg-test-output/jdk/0/JTreport/index.html │ │ │ │ │ --rw-r--r-- 0 sbuild (999) sbuild (999) 0 2026-10-08 18:58:39.000000 jtreg-test-output/jdk/0/JTreport/reportdir.dat │ │ │ │ │ -drwxr-xr-x 0 sbuild (999) sbuild (999) 0 2026-10-08 18:58:39.000000 jtreg-test-output/jdk/0/JTreport/html/ │ │ │ │ │ --rw-r--r-- 0 sbuild (999) sbuild (999) 30762 2026-10-08 18:58:39.000000 jtreg-test-output/jdk/0/JTreport/html/notRun_gr.html │ │ │ │ │ --rw-r--r-- 0 sbuild (999) sbuild (999) 30417 2026-10-08 18:58:39.000000 jtreg-test-output/jdk/0/JTreport/html/notRun.html │ │ │ │ │ --rw-r--r-- 0 sbuild (999) sbuild (999) 520 2026-10-08 18:58:39.000000 jtreg-test-output/jdk/0/JTreport/html/error_gr.html │ │ │ │ │ --rw-r--r-- 0 sbuild (999) sbuild (999) 472 2026-10-08 18:58:39.000000 jtreg-test-output/jdk/0/JTreport/html/error.html │ │ │ │ │ --rw-r--r-- 0 sbuild (999) sbuild (999) 2749 2026-10-08 18:58:39.000000 jtreg-test-output/jdk/0/JTreport/html/failed_gr.html │ │ │ │ │ --rw-r--r-- 0 sbuild (999) sbuild (999) 2019 2026-10-08 18:58:39.000000 jtreg-test-output/jdk/0/JTreport/html/failed.html │ │ │ │ │ --rw-r--r-- 0 sbuild (999) sbuild (999) 1233315 2026-10-08 18:58:39.000000 jtreg-test-output/jdk/0/JTreport/html/passed_gr.html │ │ │ │ │ --rw-r--r-- 0 sbuild (999) sbuild (999) 1232167 2026-10-08 18:58:39.000000 jtreg-test-output/jdk/0/JTreport/html/passed.html │ │ │ │ │ --rw-r--r-- 0 sbuild (999) sbuild (999) 85436 2026-10-08 18:58:39.000000 jtreg-test-output/jdk/0/JTreport/html/excluded.html │ │ │ │ │ --rw-r--r-- 0 sbuild (999) sbuild (999) 4123 2026-10-08 18:58:39.000000 jtreg-test-output/jdk/0/JTreport/html/env.html │ │ │ │ │ --rw-r--r-- 0 sbuild (999) sbuild (999) 23926 2026-10-08 18:58:39.000000 jtreg-test-output/jdk/0/JTreport/html/config.html │ │ │ │ │ --rw-r--r-- 0 sbuild (999) sbuild (999) 307 2026-10-08 18:58:38.000000 jtreg-test-output/jdk/0/JTreport/html/report.css │ │ │ │ │ --rw-r--r-- 0 sbuild (999) sbuild (999) 1124308 2026-10-08 18:58:39.000000 jtreg-test-output/jdk/0/JTreport/html/index.html │ │ │ │ │ --rw-r--r-- 0 sbuild (999) sbuild (999) 1124308 2026-10-08 18:58:39.000000 jtreg-test-output/jdk/0/JTreport/html/report.html │ │ │ │ │ -drwxr-xr-x 0 sbuild (999) sbuild (999) 0 2026-10-08 18:58:39.000000 jtreg-test-output/jdk/0/JTreport/text/ │ │ │ │ │ --rw-r--r-- 0 sbuild (999) sbuild (999) 83102 2026-10-08 18:58:39.000000 jtreg-test-output/jdk/0/JTreport/text/junit.txt │ │ │ │ │ --rw-r--r-- 0 sbuild (999) sbuild (999) 129304 2026-10-08 18:58:39.000000 jtreg-test-output/jdk/0/JTreport/text/testng.txt │ │ │ │ │ --rw-r--r-- 0 sbuild (999) sbuild (999) 40569 2026-10-08 18:58:39.000000 jtreg-test-output/jdk/0/JTreport/text/notRun.txt │ │ │ │ │ --rw-r--r-- 0 sbuild (999) sbuild (999) 173 2026-10-08 18:58:39.000000 jtreg-test-output/jdk/0/JTreport/text/stats.txt │ │ │ │ │ --rw-r--r-- 0 sbuild (999) sbuild (999) 947 2026-10-08 18:58:39.000000 jtreg-test-output/jdk/0/JTreport/text/timeStats.txt │ │ │ │ │ --rw-r--r-- 0 sbuild (999) sbuild (999) 21 2026-10-08 18:58:39.000000 jtreg-test-output/jdk/0/JTreport/text/tc_newfailures.txt │ │ │ │ │ --rw-r--r-- 0 sbuild (999) sbuild (999) 21 2026-10-08 18:58:39.000000 jtreg-test-output/jdk/0/JTreport/text/tc_fail2notrun.txt │ │ │ │ │ --rw-r--r-- 0 sbuild (999) sbuild (999) 20 2026-10-08 18:58:39.000000 jtreg-test-output/jdk/0/JTreport/text/tc_fail2error.txt │ │ │ │ │ --rw-r--r-- 0 sbuild (999) sbuild (999) 19 2026-10-08 18:58:39.000000 jtreg-test-output/jdk/0/JTreport/text/tc_fail2pass.txt │ │ │ │ │ --rw-r--r-- 0 sbuild (999) sbuild (999) 22 2026-10-08 18:58:39.000000 jtreg-test-output/jdk/0/JTreport/text/tc_fail2missing.txt │ │ │ │ │ --rw-r--r-- 0 sbuild (999) sbuild (999) 19 2026-10-08 18:58:39.000000 jtreg-test-output/jdk/0/JTreport/text/other_errors.txt │ │ │ │ │ --rw-r--r-- 0 sbuild (999) sbuild (999) 416 2026-10-08 18:58:39.000000 jtreg-test-output/jdk/0/JTreport/text/newfailures.txt │ │ │ │ │ --rw-r--r-- 0 sbuild (999) sbuild (999) 16 2026-10-08 18:58:39.000000 jtreg-test-output/jdk/0/JTreport/text/fail2fail.txt │ │ │ │ │ --rw-r--r-- 0 sbuild (999) sbuild (999) 18 2026-10-08 18:58:39.000000 jtreg-test-output/jdk/0/JTreport/text/fail2notrun.txt │ │ │ │ │ --rw-r--r-- 0 sbuild (999) sbuild (999) 17 2026-10-08 18:58:39.000000 jtreg-test-output/jdk/0/JTreport/text/faiL2error.txt │ │ │ │ │ --rw-r--r-- 0 sbuild (999) sbuild (999) 16 2026-10-08 18:58:39.000000 jtreg-test-output/jdk/0/JTreport/text/fail2pass.txt │ │ │ │ │ --rw-r--r-- 0 sbuild (999) sbuild (999) 19 2026-10-08 18:58:39.000000 jtreg-test-output/jdk/0/JTreport/text/fail2missing.txt │ │ │ │ │ --rw-r--r-- 0 sbuild (999) sbuild (999) 877861 2026-10-08 18:58:39.000000 jtreg-test-output/jdk/0/JTreport/text/summary.txt │ │ │ │ │ --rw-r--r-- 0 sbuild (999) sbuild (999) 530 2026-10-08 15:17:55.000000 jtreg-test-output/jdk/0/JTreport/text/cmdArgs.txt │ │ │ │ │ -lrwxrwxrwx 0 sbuild (999) sbuild (999) 0 2026-10-08 15:17:51.000000 jtreg-test-output/jaxp/JTreport -> 0/JTreport │ │ │ │ │ -drwxr-xr-x 0 sbuild (999) sbuild (999) 0 2026-10-08 15:17:50.000000 jtreg-test-output/jaxp/0/JTreport/ │ │ │ │ │ --rw-r--r-- 0 sbuild (999) sbuild (999) 714 2026-10-08 15:17:50.000000 jtreg-test-output/jaxp/0/JTreport/index.html │ │ │ │ │ --rw-r--r-- 0 sbuild (999) sbuild (999) 0 2026-10-08 15:17:50.000000 jtreg-test-output/jaxp/0/JTreport/reportdir.dat │ │ │ │ │ -drwxr-xr-x 0 sbuild (999) sbuild (999) 0 2026-10-08 15:17:50.000000 jtreg-test-output/jaxp/0/JTreport/html/ │ │ │ │ │ --rw-r--r-- 0 sbuild (999) sbuild (999) 694 2026-10-08 15:17:50.000000 jtreg-test-output/jaxp/0/JTreport/html/notRun_gr.html │ │ │ │ │ --rw-r--r-- 0 sbuild (999) sbuild (999) 572 2026-10-08 15:17:50.000000 jtreg-test-output/jaxp/0/JTreport/html/notRun.html │ │ │ │ │ --rw-r--r-- 0 sbuild (999) sbuild (999) 520 2026-10-08 15:17:50.000000 jtreg-test-output/jaxp/0/JTreport/html/error_gr.html │ │ │ │ │ --rw-r--r-- 0 sbuild (999) sbuild (999) 472 2026-10-08 15:17:50.000000 jtreg-test-output/jaxp/0/JTreport/html/error.html │ │ │ │ │ --rw-r--r-- 0 sbuild (999) sbuild (999) 512 2026-10-08 15:17:50.000000 jtreg-test-output/jaxp/0/JTreport/html/failed_gr.html │ │ │ │ │ --rw-r--r-- 0 sbuild (999) sbuild (999) 464 2026-10-08 15:17:50.000000 jtreg-test-output/jaxp/0/JTreport/html/failed.html │ │ │ │ │ --rw-r--r-- 0 sbuild (999) sbuild (999) 110061 2026-10-08 15:17:50.000000 jtreg-test-output/jaxp/0/JTreport/html/passed_gr.html │ │ │ │ │ --rw-r--r-- 0 sbuild (999) sbuild (999) 109972 2026-10-08 15:17:50.000000 jtreg-test-output/jaxp/0/JTreport/html/passed.html │ │ │ │ │ --rw-r--r-- 0 sbuild (999) sbuild (999) 5904 2026-10-08 15:17:50.000000 jtreg-test-output/jaxp/0/JTreport/html/excluded.html │ │ │ │ │ --rw-r--r-- 0 sbuild (999) sbuild (999) 4031 2026-10-08 15:17:50.000000 jtreg-test-output/jaxp/0/JTreport/html/env.html │ │ │ │ │ --rw-r--r-- 0 sbuild (999) sbuild (999) 4425 2026-10-08 15:17:50.000000 jtreg-test-output/jaxp/0/JTreport/html/config.html │ │ │ │ │ --rw-r--r-- 0 sbuild (999) sbuild (999) 307 2026-10-08 15:17:50.000000 jtreg-test-output/jaxp/0/JTreport/html/report.css │ │ │ │ │ --rw-r--r-- 0 sbuild (999) sbuild (999) 58501 2026-10-08 15:17:50.000000 jtreg-test-output/jaxp/0/JTreport/html/index.html │ │ │ │ │ --rw-r--r-- 0 sbuild (999) sbuild (999) 58501 2026-10-08 15:17:50.000000 jtreg-test-output/jaxp/0/JTreport/html/report.html │ │ │ │ │ -drwxr-xr-x 0 sbuild (999) sbuild (999) 0 2026-10-08 15:17:50.000000 jtreg-test-output/jaxp/0/JTreport/text/ │ │ │ │ │ --rw-r--r-- 0 sbuild (999) sbuild (999) 200 2026-10-08 15:17:50.000000 jtreg-test-output/jaxp/0/JTreport/text/junit.txt │ │ │ │ │ --rw-r--r-- 0 sbuild (999) sbuild (999) 69461 2026-10-08 15:17:50.000000 jtreg-test-output/jaxp/0/JTreport/text/testng.txt │ │ │ │ │ --rw-r--r-- 0 sbuild (999) sbuild (999) 116 2026-10-08 15:17:50.000000 jtreg-test-output/jaxp/0/JTreport/text/notRun.txt │ │ │ │ │ --rw-r--r-- 0 sbuild (999) sbuild (999) 65 2026-10-08 15:17:50.000000 jtreg-test-output/jaxp/0/JTreport/text/stats.txt │ │ │ │ │ --rw-r--r-- 0 sbuild (999) sbuild (999) 142 2026-10-08 15:17:50.000000 jtreg-test-output/jaxp/0/JTreport/text/timeStats.txt │ │ │ │ │ --rw-r--r-- 0 sbuild (999) sbuild (999) 21 2026-10-08 15:17:50.000000 jtreg-test-output/jaxp/0/JTreport/text/tc_newfailures.txt │ │ │ │ │ --rw-r--r-- 0 sbuild (999) sbuild (999) 21 2026-10-08 15:17:50.000000 jtreg-test-output/jaxp/0/JTreport/text/tc_fail2notrun.txt │ │ │ │ │ --rw-r--r-- 0 sbuild (999) sbuild (999) 20 2026-10-08 15:17:50.000000 jtreg-test-output/jaxp/0/JTreport/text/tc_fail2error.txt │ │ │ │ │ --rw-r--r-- 0 sbuild (999) sbuild (999) 19 2026-10-08 15:17:50.000000 jtreg-test-output/jaxp/0/JTreport/text/tc_fail2pass.txt │ │ │ │ │ --rw-r--r-- 0 sbuild (999) sbuild (999) 22 2026-10-08 15:17:50.000000 jtreg-test-output/jaxp/0/JTreport/text/tc_fail2missing.txt │ │ │ │ │ --rw-r--r-- 0 sbuild (999) sbuild (999) 19 2026-10-08 15:17:50.000000 jtreg-test-output/jaxp/0/JTreport/text/other_errors.txt │ │ │ │ │ --rw-r--r-- 0 sbuild (999) sbuild (999) 18 2026-10-08 15:17:50.000000 jtreg-test-output/jaxp/0/JTreport/text/newfailures.txt │ │ │ │ │ --rw-r--r-- 0 sbuild (999) sbuild (999) 16 2026-10-08 15:17:50.000000 jtreg-test-output/jaxp/0/JTreport/text/fail2fail.txt │ │ │ │ │ --rw-r--r-- 0 sbuild (999) sbuild (999) 18 2026-10-08 15:17:50.000000 jtreg-test-output/jaxp/0/JTreport/text/fail2notrun.txt │ │ │ │ │ --rw-r--r-- 0 sbuild (999) sbuild (999) 17 2026-10-08 15:17:50.000000 jtreg-test-output/jaxp/0/JTreport/text/faiL2error.txt │ │ │ │ │ --rw-r--r-- 0 sbuild (999) sbuild (999) 16 2026-10-08 15:17:50.000000 jtreg-test-output/jaxp/0/JTreport/text/fail2pass.txt │ │ │ │ │ --rw-r--r-- 0 sbuild (999) sbuild (999) 19 2026-10-08 15:17:50.000000 jtreg-test-output/jaxp/0/JTreport/text/fail2missing.txt │ │ │ │ │ --rw-r--r-- 0 sbuild (999) sbuild (999) 59118 2026-10-08 15:17:50.000000 jtreg-test-output/jaxp/0/JTreport/text/summary.txt │ │ │ │ │ --rw-r--r-- 0 sbuild (999) sbuild (999) 438 2026-10-08 15:06:13.000000 jtreg-test-output/jaxp/0/JTreport/text/cmdArgs.txt │ │ │ │ │ -lrwxrwxrwx 0 sbuild (999) sbuild (999) 0 2026-10-08 15:06:12.000000 jtreg-test-output/langtools/JTreport -> 0/JTreport │ │ │ │ │ -drwxr-xr-x 0 sbuild (999) sbuild (999) 0 2026-10-08 15:06:04.000000 jtreg-test-output/langtools/0/JTreport/ │ │ │ │ │ --rw-r--r-- 0 sbuild (999) sbuild (999) 724 2026-10-08 15:06:04.000000 jtreg-test-output/langtools/0/JTreport/index.html │ │ │ │ │ --rw-r--r-- 0 sbuild (999) sbuild (999) 0 2026-10-08 15:06:04.000000 jtreg-test-output/langtools/0/JTreport/reportdir.dat │ │ │ │ │ -drwxr-xr-x 0 sbuild (999) sbuild (999) 0 2026-10-08 15:06:04.000000 jtreg-test-output/langtools/0/JTreport/html/ │ │ │ │ │ --rw-r--r-- 0 sbuild (999) sbuild (999) 3089 2026-10-08 15:06:04.000000 jtreg-test-output/langtools/0/JTreport/html/notRun_gr.html │ │ │ │ │ --rw-r--r-- 0 sbuild (999) sbuild (999) 2800 2026-10-08 15:06:04.000000 jtreg-test-output/langtools/0/JTreport/html/notRun.html │ │ │ │ │ --rw-r--r-- 0 sbuild (999) sbuild (999) 520 2026-10-08 15:06:04.000000 jtreg-test-output/langtools/0/JTreport/html/error_gr.html │ │ │ │ │ --rw-r--r-- 0 sbuild (999) sbuild (999) 472 2026-10-08 15:06:04.000000 jtreg-test-output/langtools/0/JTreport/html/error.html │ │ │ │ │ --rw-r--r-- 0 sbuild (999) sbuild (999) 512 2026-10-08 15:06:04.000000 jtreg-test-output/langtools/0/JTreport/html/failed_gr.html │ │ │ │ │ --rw-r--r-- 0 sbuild (999) sbuild (999) 464 2026-10-08 15:06:04.000000 jtreg-test-output/langtools/0/JTreport/html/failed.html │ │ │ │ │ --rw-r--r-- 0 sbuild (999) sbuild (999) 884464 2026-10-08 15:06:04.000000 jtreg-test-output/langtools/0/JTreport/html/passed_gr.html │ │ │ │ │ --rw-r--r-- 0 sbuild (999) sbuild (999) 884139 2026-10-08 15:06:04.000000 jtreg-test-output/langtools/0/JTreport/html/passed.html │ │ │ │ │ --rw-r--r-- 0 sbuild (999) sbuild (999) 8457 2026-10-08 15:06:04.000000 jtreg-test-output/langtools/0/JTreport/html/excluded.html │ │ │ │ │ --rw-r--r-- 0 sbuild (999) sbuild (999) 4046 2026-10-08 15:06:04.000000 jtreg-test-output/langtools/0/JTreport/html/env.html │ │ │ │ │ --rw-r--r-- 0 sbuild (999) sbuild (999) 10727 2026-10-08 15:06:04.000000 jtreg-test-output/langtools/0/JTreport/html/config.html │ │ │ │ │ --rw-r--r-- 0 sbuild (999) sbuild (999) 307 2026-10-08 15:06:04.000000 jtreg-test-output/langtools/0/JTreport/html/report.css │ │ │ │ │ --rw-r--r-- 0 sbuild (999) sbuild (999) 541946 2026-10-08 15:06:04.000000 jtreg-test-output/langtools/0/JTreport/html/index.html │ │ │ │ │ --rw-r--r-- 0 sbuild (999) sbuild (999) 541946 2026-10-08 15:06:04.000000 jtreg-test-output/langtools/0/JTreport/html/report.html │ │ │ │ │ -drwxr-xr-x 0 sbuild (999) sbuild (999) 0 2026-10-08 15:06:04.000000 jtreg-test-output/langtools/0/JTreport/text/ │ │ │ │ │ --rw-r--r-- 0 sbuild (999) sbuild (999) 18550 2026-10-08 15:06:04.000000 jtreg-test-output/langtools/0/JTreport/text/junit.txt │ │ │ │ │ --rw-r--r-- 0 sbuild (999) sbuild (999) 9538 2026-10-08 15:06:04.000000 jtreg-test-output/langtools/0/JTreport/text/testng.txt │ │ │ │ │ --rw-r--r-- 0 sbuild (999) sbuild (999) 2591 2026-10-08 15:06:04.000000 jtreg-test-output/langtools/0/JTreport/text/notRun.txt │ │ │ │ │ --rw-r--r-- 0 sbuild (999) sbuild (999) 120 2026-10-08 15:06:04.000000 jtreg-test-output/langtools/0/JTreport/text/stats.txt │ │ │ │ │ --rw-r--r-- 0 sbuild (999) sbuild (999) 394 2026-10-08 15:06:04.000000 jtreg-test-output/langtools/0/JTreport/text/timeStats.txt │ │ │ │ │ --rw-r--r-- 0 sbuild (999) sbuild (999) 21 2026-10-08 15:06:04.000000 jtreg-test-output/langtools/0/JTreport/text/tc_newfailures.txt │ │ │ │ │ --rw-r--r-- 0 sbuild (999) sbuild (999) 21 2026-10-08 15:06:04.000000 jtreg-test-output/langtools/0/JTreport/text/tc_fail2notrun.txt │ │ │ │ │ --rw-r--r-- 0 sbuild (999) sbuild (999) 20 2026-10-08 15:06:04.000000 jtreg-test-output/langtools/0/JTreport/text/tc_fail2error.txt │ │ │ │ │ --rw-r--r-- 0 sbuild (999) sbuild (999) 19 2026-10-08 15:06:04.000000 jtreg-test-output/langtools/0/JTreport/text/tc_fail2pass.txt │ │ │ │ │ --rw-r--r-- 0 sbuild (999) sbuild (999) 22 2026-10-08 15:06:04.000000 jtreg-test-output/langtools/0/JTreport/text/tc_fail2missing.txt │ │ │ │ │ --rw-r--r-- 0 sbuild (999) sbuild (999) 19 2026-10-08 15:06:04.000000 jtreg-test-output/langtools/0/JTreport/text/other_errors.txt │ │ │ │ │ --rw-r--r-- 0 sbuild (999) sbuild (999) 18 2026-10-08 15:06:04.000000 jtreg-test-output/langtools/0/JTreport/text/newfailures.txt │ │ │ │ │ --rw-r--r-- 0 sbuild (999) sbuild (999) 16 2026-10-08 15:06:04.000000 jtreg-test-output/langtools/0/JTreport/text/fail2fail.txt │ │ │ │ │ --rw-r--r-- 0 sbuild (999) sbuild (999) 18 2026-10-08 15:06:04.000000 jtreg-test-output/langtools/0/JTreport/text/fail2notrun.txt │ │ │ │ │ --rw-r--r-- 0 sbuild (999) sbuild (999) 17 2026-10-08 15:06:04.000000 jtreg-test-output/langtools/0/JTreport/text/faiL2error.txt │ │ │ │ │ --rw-r--r-- 0 sbuild (999) sbuild (999) 16 2026-10-08 15:06:04.000000 jtreg-test-output/langtools/0/JTreport/text/fail2pass.txt │ │ │ │ │ --rw-r--r-- 0 sbuild (999) sbuild (999) 19 2026-10-08 15:06:04.000000 jtreg-test-output/langtools/0/JTreport/text/fail2missing.txt │ │ │ │ │ --rw-r--r-- 0 sbuild (999) sbuild (999) 642910 2026-10-08 15:06:04.000000 jtreg-test-output/langtools/0/JTreport/text/summary.txt │ │ │ │ │ --rw-r--r-- 0 sbuild (999) sbuild (999) 453 2026-10-08 14:34:04.000000 jtreg-test-output/langtools/0/JTreport/text/cmdArgs.txt │ │ │ │ │ -lrwxrwxrwx 0 sbuild (999) sbuild (999) 0 2026-10-08 14:34:04.000000 jtreg-test-output/hotspot/JTreport -> 0/JTreport │ │ │ │ │ -drwxr-xr-x 0 sbuild (999) sbuild (999) 0 2026-10-08 14:33:59.000000 jtreg-test-output/hotspot/0/JTreport/ │ │ │ │ │ --rw-r--r-- 0 sbuild (999) sbuild (999) 726 2026-10-08 14:33:59.000000 jtreg-test-output/hotspot/0/JTreport/index.html │ │ │ │ │ --rw-r--r-- 0 sbuild (999) sbuild (999) 0 2026-10-08 14:33:59.000000 jtreg-test-output/hotspot/0/JTreport/reportdir.dat │ │ │ │ │ -drwxr-xr-x 0 sbuild (999) sbuild (999) 0 2026-10-08 14:33:59.000000 jtreg-test-output/hotspot/0/JTreport/html/ │ │ │ │ │ --rw-r--r-- 0 sbuild (999) sbuild (999) 70696 2026-10-08 14:33:59.000000 jtreg-test-output/hotspot/0/JTreport/html/notRun_gr.html │ │ │ │ │ --rw-r--r-- 0 sbuild (999) sbuild (999) 70351 2026-10-08 14:33:59.000000 jtreg-test-output/hotspot/0/JTreport/html/notRun.html │ │ │ │ │ --rw-r--r-- 0 sbuild (999) sbuild (999) 520 2026-10-08 14:33:59.000000 jtreg-test-output/hotspot/0/JTreport/html/error_gr.html │ │ │ │ │ --rw-r--r-- 0 sbuild (999) sbuild (999) 472 2026-10-08 14:33:59.000000 jtreg-test-output/hotspot/0/JTreport/html/error.html │ │ │ │ │ --rw-r--r-- 0 sbuild (999) sbuild (999) 512 2026-10-08 14:33:59.000000 jtreg-test-output/hotspot/0/JTreport/html/failed_gr.html │ │ │ │ │ --rw-r--r-- 0 sbuild (999) sbuild (999) 464 2026-10-08 14:33:59.000000 jtreg-test-output/hotspot/0/JTreport/html/failed.html │ │ │ │ │ --rw-r--r-- 0 sbuild (999) sbuild (999) 570914 2026-10-08 14:33:59.000000 jtreg-test-output/hotspot/0/JTreport/html/passed_gr.html │ │ │ │ │ --rw-r--r-- 0 sbuild (999) sbuild (999) 570359 2026-10-08 14:33:59.000000 jtreg-test-output/hotspot/0/JTreport/html/passed.html │ │ │ │ │ --rw-r--r-- 0 sbuild (999) sbuild (999) 20586 2026-10-08 14:33:59.000000 jtreg-test-output/hotspot/0/JTreport/html/excluded.html │ │ │ │ │ --rw-r--r-- 0 sbuild (999) sbuild (999) 4145 2026-10-08 14:33:59.000000 jtreg-test-output/hotspot/0/JTreport/html/env.html │ │ │ │ │ --rw-r--r-- 0 sbuild (999) sbuild (999) 78259 2026-10-08 14:33:59.000000 jtreg-test-output/hotspot/0/JTreport/html/config.html │ │ │ │ │ --rw-r--r-- 0 sbuild (999) sbuild (999) 307 2026-10-08 14:33:59.000000 jtreg-test-output/hotspot/0/JTreport/html/report.css │ │ │ │ │ --rw-r--r-- 0 sbuild (999) sbuild (999) 529156 2026-10-08 14:33:59.000000 jtreg-test-output/hotspot/0/JTreport/html/index.html │ │ │ │ │ --rw-r--r-- 0 sbuild (999) sbuild (999) 529156 2026-10-08 14:33:59.000000 jtreg-test-output/hotspot/0/JTreport/html/report.html │ │ │ │ │ -drwxr-xr-x 0 sbuild (999) sbuild (999) 0 2026-10-08 14:33:59.000000 jtreg-test-output/hotspot/0/JTreport/text/ │ │ │ │ │ --rw-r--r-- 0 sbuild (999) sbuild (999) 3273 2026-10-08 14:33:59.000000 jtreg-test-output/hotspot/0/JTreport/text/junit.txt │ │ │ │ │ --rw-r--r-- 0 sbuild (999) sbuild (999) 7594 2026-10-08 14:33:59.000000 jtreg-test-output/hotspot/0/JTreport/text/testng.txt │ │ │ │ │ --rw-r--r-- 0 sbuild (999) sbuild (999) 107920 2026-10-08 14:33:59.000000 jtreg-test-output/hotspot/0/JTreport/text/notRun.txt │ │ │ │ │ --rw-r--r-- 0 sbuild (999) sbuild (999) 161 2026-10-08 14:33:59.000000 jtreg-test-output/hotspot/0/JTreport/text/stats.txt │ │ │ │ │ --rw-r--r-- 0 sbuild (999) sbuild (999) 683 2026-10-08 14:33:59.000000 jtreg-test-output/hotspot/0/JTreport/text/timeStats.txt │ │ │ │ │ --rw-r--r-- 0 sbuild (999) sbuild (999) 21 2026-10-08 14:33:59.000000 jtreg-test-output/hotspot/0/JTreport/text/tc_newfailures.txt │ │ │ │ │ --rw-r--r-- 0 sbuild (999) sbuild (999) 21 2026-10-08 14:33:59.000000 jtreg-test-output/hotspot/0/JTreport/text/tc_fail2notrun.txt │ │ │ │ │ --rw-r--r-- 0 sbuild (999) sbuild (999) 20 2026-10-08 14:33:59.000000 jtreg-test-output/hotspot/0/JTreport/text/tc_fail2error.txt │ │ │ │ │ --rw-r--r-- 0 sbuild (999) sbuild (999) 19 2026-10-08 14:33:59.000000 jtreg-test-output/hotspot/0/JTreport/text/tc_fail2pass.txt │ │ │ │ │ --rw-r--r-- 0 sbuild (999) sbuild (999) 22 2026-10-08 14:33:59.000000 jtreg-test-output/hotspot/0/JTreport/text/tc_fail2missing.txt │ │ │ │ │ --rw-r--r-- 0 sbuild (999) sbuild (999) 19 2026-10-08 14:33:59.000000 jtreg-test-output/hotspot/0/JTreport/text/other_errors.txt │ │ │ │ │ --rw-r--r-- 0 sbuild (999) sbuild (999) 18 2026-10-08 14:33:59.000000 jtreg-test-output/hotspot/0/JTreport/text/newfailures.txt │ │ │ │ │ --rw-r--r-- 0 sbuild (999) sbuild (999) 16 2026-10-08 14:33:59.000000 jtreg-test-output/hotspot/0/JTreport/text/fail2fail.txt │ │ │ │ │ --rw-r--r-- 0 sbuild (999) sbuild (999) 18 2026-10-08 14:33:59.000000 jtreg-test-output/hotspot/0/JTreport/text/fail2notrun.txt │ │ │ │ │ --rw-r--r-- 0 sbuild (999) sbuild (999) 17 2026-10-08 14:33:59.000000 jtreg-test-output/hotspot/0/JTreport/text/faiL2error.txt │ │ │ │ │ --rw-r--r-- 0 sbuild (999) sbuild (999) 16 2026-10-08 14:33:59.000000 jtreg-test-output/hotspot/0/JTreport/text/fail2pass.txt │ │ │ │ │ --rw-r--r-- 0 sbuild (999) sbuild (999) 19 2026-10-08 14:33:59.000000 jtreg-test-output/hotspot/0/JTreport/text/fail2missing.txt │ │ │ │ │ --rw-r--r-- 0 sbuild (999) sbuild (999) 429614 2026-10-08 14:33:59.000000 jtreg-test-output/hotspot/0/JTreport/text/summary.txt │ │ │ │ │ --rw-r--r-- 0 sbuild (999) sbuild (999) 552 2026-10-08 12:31:24.000000 jtreg-test-output/hotspot/0/JTreport/text/cmdArgs.txt │ │ │ │ │ +lrwxrwxrwx 0 sbuild (999) sbuild (999) 0 2026-10-16 05:37:00.000000 jtreg-test-output/langtools/JTreport -> 0/JTreport │ │ │ │ │ +drwxr-xr-x 0 sbuild (999) sbuild (999) 0 2026-10-16 05:36:47.000000 jtreg-test-output/langtools/0/JTreport/ │ │ │ │ │ +drwxr-xr-x 0 sbuild (999) sbuild (999) 0 2026-10-16 05:36:47.000000 jtreg-test-output/langtools/0/JTreport/text/ │ │ │ │ │ +-rw-r--r-- 0 sbuild (999) sbuild (999) 17 2026-10-16 05:36:47.000000 jtreg-test-output/langtools/0/JTreport/text/faiL2error.txt │ │ │ │ │ +-rw-r--r-- 0 sbuild (999) sbuild (999) 16 2026-10-16 05:36:47.000000 jtreg-test-output/langtools/0/JTreport/text/fail2fail.txt │ │ │ │ │ +-rw-r--r-- 0 sbuild (999) sbuild (999) 19 2026-10-16 05:36:47.000000 jtreg-test-output/langtools/0/JTreport/text/other_errors.txt │ │ │ │ │ +-rw-r--r-- 0 sbuild (999) sbuild (999) 19 2026-10-16 05:36:47.000000 jtreg-test-output/langtools/0/JTreport/text/fail2missing.txt │ │ │ │ │ +-rw-r--r-- 0 sbuild (999) sbuild (999) 120 2026-10-16 05:36:47.000000 jtreg-test-output/langtools/0/JTreport/text/stats.txt │ │ │ │ │ +-rw-r--r-- 0 sbuild (999) sbuild (999) 502 2026-10-16 05:36:47.000000 jtreg-test-output/langtools/0/JTreport/text/timeStats.txt │ │ │ │ │ +-rw-r--r-- 0 sbuild (999) sbuild (999) 18550 2026-10-16 05:36:47.000000 jtreg-test-output/langtools/0/JTreport/text/junit.txt │ │ │ │ │ +-rw-r--r-- 0 sbuild (999) sbuild (999) 16 2026-10-16 05:36:47.000000 jtreg-test-output/langtools/0/JTreport/text/fail2pass.txt │ │ │ │ │ +-rw-r--r-- 0 sbuild (999) sbuild (999) 453 2026-10-16 04:46:12.000000 jtreg-test-output/langtools/0/JTreport/text/cmdArgs.txt │ │ │ │ │ +-rw-r--r-- 0 sbuild (999) sbuild (999) 2591 2026-10-16 05:36:47.000000 jtreg-test-output/langtools/0/JTreport/text/notRun.txt │ │ │ │ │ +-rw-r--r-- 0 sbuild (999) sbuild (999) 21 2026-10-16 05:36:47.000000 jtreg-test-output/langtools/0/JTreport/text/tc_fail2notrun.txt │ │ │ │ │ +-rw-r--r-- 0 sbuild (999) sbuild (999) 20 2026-10-16 05:36:47.000000 jtreg-test-output/langtools/0/JTreport/text/tc_fail2error.txt │ │ │ │ │ +-rw-r--r-- 0 sbuild (999) sbuild (999) 22 2026-10-16 05:36:47.000000 jtreg-test-output/langtools/0/JTreport/text/tc_fail2missing.txt │ │ │ │ │ +-rw-r--r-- 0 sbuild (999) sbuild (999) 642910 2026-10-16 05:36:47.000000 jtreg-test-output/langtools/0/JTreport/text/summary.txt │ │ │ │ │ +-rw-r--r-- 0 sbuild (999) sbuild (999) 9538 2026-10-16 05:36:47.000000 jtreg-test-output/langtools/0/JTreport/text/testng.txt │ │ │ │ │ +-rw-r--r-- 0 sbuild (999) sbuild (999) 18 2026-10-16 05:36:47.000000 jtreg-test-output/langtools/0/JTreport/text/newfailures.txt │ │ │ │ │ +-rw-r--r-- 0 sbuild (999) sbuild (999) 18 2026-10-16 05:36:47.000000 jtreg-test-output/langtools/0/JTreport/text/fail2notrun.txt │ │ │ │ │ +-rw-r--r-- 0 sbuild (999) sbuild (999) 19 2026-10-16 05:36:47.000000 jtreg-test-output/langtools/0/JTreport/text/tc_fail2pass.txt │ │ │ │ │ +-rw-r--r-- 0 sbuild (999) sbuild (999) 21 2026-10-16 05:36:47.000000 jtreg-test-output/langtools/0/JTreport/text/tc_newfailures.txt │ │ │ │ │ +-rw-r--r-- 0 sbuild (999) sbuild (999) 724 2026-10-16 05:36:47.000000 jtreg-test-output/langtools/0/JTreport/index.html │ │ │ │ │ +-rw-r--r-- 0 sbuild (999) sbuild (999) 0 2026-10-16 05:36:47.000000 jtreg-test-output/langtools/0/JTreport/reportdir.dat │ │ │ │ │ +drwxr-xr-x 0 sbuild (999) sbuild (999) 0 2026-10-16 05:36:47.000000 jtreg-test-output/langtools/0/JTreport/html/ │ │ │ │ │ +-rw-r--r-- 0 sbuild (999) sbuild (999) 884465 2026-10-16 05:36:47.000000 jtreg-test-output/langtools/0/JTreport/html/passed_gr.html │ │ │ │ │ +-rw-r--r-- 0 sbuild (999) sbuild (999) 541947 2026-10-16 05:36:47.000000 jtreg-test-output/langtools/0/JTreport/html/index.html │ │ │ │ │ +-rw-r--r-- 0 sbuild (999) sbuild (999) 8458 2026-10-16 05:36:47.000000 jtreg-test-output/langtools/0/JTreport/html/excluded.html │ │ │ │ │ +-rw-r--r-- 0 sbuild (999) sbuild (999) 521 2026-10-16 05:36:47.000000 jtreg-test-output/langtools/0/JTreport/html/error_gr.html │ │ │ │ │ +-rw-r--r-- 0 sbuild (999) sbuild (999) 541947 2026-10-16 05:36:47.000000 jtreg-test-output/langtools/0/JTreport/html/report.html │ │ │ │ │ +-rw-r--r-- 0 sbuild (999) sbuild (999) 2801 2026-10-16 05:36:47.000000 jtreg-test-output/langtools/0/JTreport/html/notRun.html │ │ │ │ │ +-rw-r--r-- 0 sbuild (999) sbuild (999) 465 2026-10-16 05:36:47.000000 jtreg-test-output/langtools/0/JTreport/html/failed.html │ │ │ │ │ +-rw-r--r-- 0 sbuild (999) sbuild (999) 473 2026-10-16 05:36:47.000000 jtreg-test-output/langtools/0/JTreport/html/error.html │ │ │ │ │ +-rw-r--r-- 0 sbuild (999) sbuild (999) 3090 2026-10-16 05:36:47.000000 jtreg-test-output/langtools/0/JTreport/html/notRun_gr.html │ │ │ │ │ +-rw-r--r-- 0 sbuild (999) sbuild (999) 4047 2026-10-16 05:36:47.000000 jtreg-test-output/langtools/0/JTreport/html/env.html │ │ │ │ │ +-rw-r--r-- 0 sbuild (999) sbuild (999) 307 2026-10-16 05:36:47.000000 jtreg-test-output/langtools/0/JTreport/html/report.css │ │ │ │ │ +-rw-r--r-- 0 sbuild (999) sbuild (999) 513 2026-10-16 05:36:47.000000 jtreg-test-output/langtools/0/JTreport/html/failed_gr.html │ │ │ │ │ +-rw-r--r-- 0 sbuild (999) sbuild (999) 10727 2026-10-16 05:36:47.000000 jtreg-test-output/langtools/0/JTreport/html/config.html │ │ │ │ │ +-rw-r--r-- 0 sbuild (999) sbuild (999) 884140 2026-10-16 05:36:47.000000 jtreg-test-output/langtools/0/JTreport/html/passed.html │ │ │ │ │ +lrwxrwxrwx 0 sbuild (999) sbuild (999) 0 2026-10-16 06:00:59.000000 jtreg-test-output/jaxp/JTreport -> 0/JTreport │ │ │ │ │ +drwxr-xr-x 0 sbuild (999) sbuild (999) 0 2026-10-16 06:00:57.000000 jtreg-test-output/jaxp/0/JTreport/ │ │ │ │ │ +drwxr-xr-x 0 sbuild (999) sbuild (999) 0 2026-10-16 06:00:57.000000 jtreg-test-output/jaxp/0/JTreport/text/ │ │ │ │ │ +-rw-r--r-- 0 sbuild (999) sbuild (999) 17 2026-10-16 06:00:57.000000 jtreg-test-output/jaxp/0/JTreport/text/faiL2error.txt │ │ │ │ │ +-rw-r--r-- 0 sbuild (999) sbuild (999) 16 2026-10-16 06:00:57.000000 jtreg-test-output/jaxp/0/JTreport/text/fail2fail.txt │ │ │ │ │ +-rw-r--r-- 0 sbuild (999) sbuild (999) 19 2026-10-16 06:00:57.000000 jtreg-test-output/jaxp/0/JTreport/text/other_errors.txt │ │ │ │ │ +-rw-r--r-- 0 sbuild (999) sbuild (999) 19 2026-10-16 06:00:57.000000 jtreg-test-output/jaxp/0/JTreport/text/fail2missing.txt │ │ │ │ │ +-rw-r--r-- 0 sbuild (999) sbuild (999) 65 2026-10-16 06:00:57.000000 jtreg-test-output/jaxp/0/JTreport/text/stats.txt │ │ │ │ │ +-rw-r--r-- 0 sbuild (999) sbuild (999) 178 2026-10-16 06:00:57.000000 jtreg-test-output/jaxp/0/JTreport/text/timeStats.txt │ │ │ │ │ +-rw-r--r-- 0 sbuild (999) sbuild (999) 200 2026-10-16 06:00:57.000000 jtreg-test-output/jaxp/0/JTreport/text/junit.txt │ │ │ │ │ +-rw-r--r-- 0 sbuild (999) sbuild (999) 16 2026-10-16 06:00:57.000000 jtreg-test-output/jaxp/0/JTreport/text/fail2pass.txt │ │ │ │ │ +-rw-r--r-- 0 sbuild (999) sbuild (999) 438 2026-10-16 05:37:00.000000 jtreg-test-output/jaxp/0/JTreport/text/cmdArgs.txt │ │ │ │ │ +-rw-r--r-- 0 sbuild (999) sbuild (999) 116 2026-10-16 06:00:57.000000 jtreg-test-output/jaxp/0/JTreport/text/notRun.txt │ │ │ │ │ +-rw-r--r-- 0 sbuild (999) sbuild (999) 21 2026-10-16 06:00:57.000000 jtreg-test-output/jaxp/0/JTreport/text/tc_fail2notrun.txt │ │ │ │ │ +-rw-r--r-- 0 sbuild (999) sbuild (999) 20 2026-10-16 06:00:57.000000 jtreg-test-output/jaxp/0/JTreport/text/tc_fail2error.txt │ │ │ │ │ +-rw-r--r-- 0 sbuild (999) sbuild (999) 22 2026-10-16 06:00:57.000000 jtreg-test-output/jaxp/0/JTreport/text/tc_fail2missing.txt │ │ │ │ │ +-rw-r--r-- 0 sbuild (999) sbuild (999) 59118 2026-10-16 06:00:57.000000 jtreg-test-output/jaxp/0/JTreport/text/summary.txt │ │ │ │ │ +-rw-r--r-- 0 sbuild (999) sbuild (999) 69461 2026-10-16 06:00:57.000000 jtreg-test-output/jaxp/0/JTreport/text/testng.txt │ │ │ │ │ +-rw-r--r-- 0 sbuild (999) sbuild (999) 18 2026-10-16 06:00:57.000000 jtreg-test-output/jaxp/0/JTreport/text/newfailures.txt │ │ │ │ │ +-rw-r--r-- 0 sbuild (999) sbuild (999) 18 2026-10-16 06:00:57.000000 jtreg-test-output/jaxp/0/JTreport/text/fail2notrun.txt │ │ │ │ │ +-rw-r--r-- 0 sbuild (999) sbuild (999) 19 2026-10-16 06:00:57.000000 jtreg-test-output/jaxp/0/JTreport/text/tc_fail2pass.txt │ │ │ │ │ +-rw-r--r-- 0 sbuild (999) sbuild (999) 21 2026-10-16 06:00:57.000000 jtreg-test-output/jaxp/0/JTreport/text/tc_newfailures.txt │ │ │ │ │ +-rw-r--r-- 0 sbuild (999) sbuild (999) 714 2026-10-16 06:00:57.000000 jtreg-test-output/jaxp/0/JTreport/index.html │ │ │ │ │ +-rw-r--r-- 0 sbuild (999) sbuild (999) 0 2026-10-16 06:00:57.000000 jtreg-test-output/jaxp/0/JTreport/reportdir.dat │ │ │ │ │ +drwxr-xr-x 0 sbuild (999) sbuild (999) 0 2026-10-16 06:00:57.000000 jtreg-test-output/jaxp/0/JTreport/html/ │ │ │ │ │ +-rw-r--r-- 0 sbuild (999) sbuild (999) 110062 2026-10-16 06:00:57.000000 jtreg-test-output/jaxp/0/JTreport/html/passed_gr.html │ │ │ │ │ +-rw-r--r-- 0 sbuild (999) sbuild (999) 58502 2026-10-16 06:00:57.000000 jtreg-test-output/jaxp/0/JTreport/html/index.html │ │ │ │ │ +-rw-r--r-- 0 sbuild (999) sbuild (999) 5905 2026-10-16 06:00:57.000000 jtreg-test-output/jaxp/0/JTreport/html/excluded.html │ │ │ │ │ +-rw-r--r-- 0 sbuild (999) sbuild (999) 521 2026-10-16 06:00:57.000000 jtreg-test-output/jaxp/0/JTreport/html/error_gr.html │ │ │ │ │ +-rw-r--r-- 0 sbuild (999) sbuild (999) 58502 2026-10-16 06:00:57.000000 jtreg-test-output/jaxp/0/JTreport/html/report.html │ │ │ │ │ +-rw-r--r-- 0 sbuild (999) sbuild (999) 573 2026-10-16 06:00:57.000000 jtreg-test-output/jaxp/0/JTreport/html/notRun.html │ │ │ │ │ +-rw-r--r-- 0 sbuild (999) sbuild (999) 465 2026-10-16 06:00:57.000000 jtreg-test-output/jaxp/0/JTreport/html/failed.html │ │ │ │ │ +-rw-r--r-- 0 sbuild (999) sbuild (999) 473 2026-10-16 06:00:57.000000 jtreg-test-output/jaxp/0/JTreport/html/error.html │ │ │ │ │ +-rw-r--r-- 0 sbuild (999) sbuild (999) 695 2026-10-16 06:00:57.000000 jtreg-test-output/jaxp/0/JTreport/html/notRun_gr.html │ │ │ │ │ +-rw-r--r-- 0 sbuild (999) sbuild (999) 4032 2026-10-16 06:00:57.000000 jtreg-test-output/jaxp/0/JTreport/html/env.html │ │ │ │ │ +-rw-r--r-- 0 sbuild (999) sbuild (999) 307 2026-10-16 06:00:57.000000 jtreg-test-output/jaxp/0/JTreport/html/report.css │ │ │ │ │ +-rw-r--r-- 0 sbuild (999) sbuild (999) 513 2026-10-16 06:00:57.000000 jtreg-test-output/jaxp/0/JTreport/html/failed_gr.html │ │ │ │ │ +-rw-r--r-- 0 sbuild (999) sbuild (999) 4425 2026-10-16 06:00:57.000000 jtreg-test-output/jaxp/0/JTreport/html/config.html │ │ │ │ │ +-rw-r--r-- 0 sbuild (999) sbuild (999) 109973 2026-10-16 06:00:57.000000 jtreg-test-output/jaxp/0/JTreport/html/passed.html │ │ │ │ │ +lrwxrwxrwx 0 sbuild (999) sbuild (999) 0 2026-10-16 04:46:11.000000 jtreg-test-output/hotspot/JTreport -> 0/JTreport │ │ │ │ │ +drwxr-xr-x 0 sbuild (999) sbuild (999) 0 2026-10-16 04:46:02.000000 jtreg-test-output/hotspot/0/JTreport/ │ │ │ │ │ +drwxr-xr-x 0 sbuild (999) sbuild (999) 0 2026-10-16 04:46:02.000000 jtreg-test-output/hotspot/0/JTreport/text/ │ │ │ │ │ +-rw-r--r-- 0 sbuild (999) sbuild (999) 17 2026-10-16 04:46:02.000000 jtreg-test-output/hotspot/0/JTreport/text/faiL2error.txt │ │ │ │ │ +-rw-r--r-- 0 sbuild (999) sbuild (999) 16 2026-10-16 04:46:02.000000 jtreg-test-output/hotspot/0/JTreport/text/fail2fail.txt │ │ │ │ │ +-rw-r--r-- 0 sbuild (999) sbuild (999) 19 2026-10-16 04:46:02.000000 jtreg-test-output/hotspot/0/JTreport/text/other_errors.txt │ │ │ │ │ +-rw-r--r-- 0 sbuild (999) sbuild (999) 19 2026-10-16 04:46:02.000000 jtreg-test-output/hotspot/0/JTreport/text/fail2missing.txt │ │ │ │ │ +-rw-r--r-- 0 sbuild (999) sbuild (999) 161 2026-10-16 04:46:02.000000 jtreg-test-output/hotspot/0/JTreport/text/stats.txt │ │ │ │ │ +-rw-r--r-- 0 sbuild (999) sbuild (999) 814 2026-10-16 04:46:02.000000 jtreg-test-output/hotspot/0/JTreport/text/timeStats.txt │ │ │ │ │ +-rw-r--r-- 0 sbuild (999) sbuild (999) 3273 2026-10-16 04:46:02.000000 jtreg-test-output/hotspot/0/JTreport/text/junit.txt │ │ │ │ │ +-rw-r--r-- 0 sbuild (999) sbuild (999) 16 2026-10-16 04:46:02.000000 jtreg-test-output/hotspot/0/JTreport/text/fail2pass.txt │ │ │ │ │ +-rw-r--r-- 0 sbuild (999) sbuild (999) 552 2026-10-16 01:55:33.000000 jtreg-test-output/hotspot/0/JTreport/text/cmdArgs.txt │ │ │ │ │ +-rw-r--r-- 0 sbuild (999) sbuild (999) 110370 2026-10-16 04:46:02.000000 jtreg-test-output/hotspot/0/JTreport/text/notRun.txt │ │ │ │ │ +-rw-r--r-- 0 sbuild (999) sbuild (999) 21 2026-10-16 04:46:02.000000 jtreg-test-output/hotspot/0/JTreport/text/tc_fail2notrun.txt │ │ │ │ │ +-rw-r--r-- 0 sbuild (999) sbuild (999) 20 2026-10-16 04:46:02.000000 jtreg-test-output/hotspot/0/JTreport/text/tc_fail2error.txt │ │ │ │ │ +-rw-r--r-- 0 sbuild (999) sbuild (999) 22 2026-10-16 04:46:02.000000 jtreg-test-output/hotspot/0/JTreport/text/tc_fail2missing.txt │ │ │ │ │ +-rw-r--r-- 0 sbuild (999) sbuild (999) 427486 2026-10-16 04:46:02.000000 jtreg-test-output/hotspot/0/JTreport/text/summary.txt │ │ │ │ │ +-rw-r--r-- 0 sbuild (999) sbuild (999) 7594 2026-10-16 04:46:02.000000 jtreg-test-output/hotspot/0/JTreport/text/testng.txt │ │ │ │ │ +-rw-r--r-- 0 sbuild (999) sbuild (999) 18 2026-10-16 04:46:02.000000 jtreg-test-output/hotspot/0/JTreport/text/newfailures.txt │ │ │ │ │ +-rw-r--r-- 0 sbuild (999) sbuild (999) 18 2026-10-16 04:46:02.000000 jtreg-test-output/hotspot/0/JTreport/text/fail2notrun.txt │ │ │ │ │ +-rw-r--r-- 0 sbuild (999) sbuild (999) 19 2026-10-16 04:46:02.000000 jtreg-test-output/hotspot/0/JTreport/text/tc_fail2pass.txt │ │ │ │ │ +-rw-r--r-- 0 sbuild (999) sbuild (999) 21 2026-10-16 04:46:02.000000 jtreg-test-output/hotspot/0/JTreport/text/tc_newfailures.txt │ │ │ │ │ +-rw-r--r-- 0 sbuild (999) sbuild (999) 726 2026-10-16 04:46:02.000000 jtreg-test-output/hotspot/0/JTreport/index.html │ │ │ │ │ +-rw-r--r-- 0 sbuild (999) sbuild (999) 0 2026-10-16 04:46:02.000000 jtreg-test-output/hotspot/0/JTreport/reportdir.dat │ │ │ │ │ +drwxr-xr-x 0 sbuild (999) sbuild (999) 0 2026-10-16 04:46:02.000000 jtreg-test-output/hotspot/0/JTreport/html/ │ │ │ │ │ +-rw-r--r-- 0 sbuild (999) sbuild (999) 567700 2026-10-16 04:46:02.000000 jtreg-test-output/hotspot/0/JTreport/html/passed_gr.html │ │ │ │ │ +-rw-r--r-- 0 sbuild (999) sbuild (999) 529152 2026-10-16 04:46:02.000000 jtreg-test-output/hotspot/0/JTreport/html/index.html │ │ │ │ │ +-rw-r--r-- 0 sbuild (999) sbuild (999) 20587 2026-10-16 04:46:02.000000 jtreg-test-output/hotspot/0/JTreport/html/excluded.html │ │ │ │ │ +-rw-r--r-- 0 sbuild (999) sbuild (999) 521 2026-10-16 04:46:02.000000 jtreg-test-output/hotspot/0/JTreport/html/error_gr.html │ │ │ │ │ +-rw-r--r-- 0 sbuild (999) sbuild (999) 529152 2026-10-16 04:46:02.000000 jtreg-test-output/hotspot/0/JTreport/html/report.html │ │ │ │ │ +-rw-r--r-- 0 sbuild (999) sbuild (999) 72212 2026-10-16 04:46:02.000000 jtreg-test-output/hotspot/0/JTreport/html/notRun.html │ │ │ │ │ +-rw-r--r-- 0 sbuild (999) sbuild (999) 465 2026-10-16 04:46:02.000000 jtreg-test-output/hotspot/0/JTreport/html/failed.html │ │ │ │ │ +-rw-r--r-- 0 sbuild (999) sbuild (999) 473 2026-10-16 04:46:02.000000 jtreg-test-output/hotspot/0/JTreport/html/error.html │ │ │ │ │ +-rw-r--r-- 0 sbuild (999) sbuild (999) 72557 2026-10-16 04:46:02.000000 jtreg-test-output/hotspot/0/JTreport/html/notRun_gr.html │ │ │ │ │ +-rw-r--r-- 0 sbuild (999) sbuild (999) 4146 2026-10-16 04:46:02.000000 jtreg-test-output/hotspot/0/JTreport/html/env.html │ │ │ │ │ +-rw-r--r-- 0 sbuild (999) sbuild (999) 307 2026-10-16 04:46:02.000000 jtreg-test-output/hotspot/0/JTreport/html/report.css │ │ │ │ │ +-rw-r--r-- 0 sbuild (999) sbuild (999) 513 2026-10-16 04:46:02.000000 jtreg-test-output/hotspot/0/JTreport/html/failed_gr.html │ │ │ │ │ +-rw-r--r-- 0 sbuild (999) sbuild (999) 78259 2026-10-16 04:46:02.000000 jtreg-test-output/hotspot/0/JTreport/html/config.html │ │ │ │ │ +-rw-r--r-- 0 sbuild (999) sbuild (999) 567145 2026-10-16 04:46:02.000000 jtreg-test-output/hotspot/0/JTreport/html/passed.html │ │ │ │ │ +lrwxrwxrwx 0 sbuild (999) sbuild (999) 0 2026-10-16 11:28:06.000000 jtreg-test-output/jdk/JTreport -> 2/JTreport │ │ │ │ │ +drwxr-xr-x 0 sbuild (999) sbuild (999) 0 2026-10-16 11:26:06.000000 jtreg-test-output/jdk/0/JTreport/ │ │ │ │ │ +drwxr-xr-x 0 sbuild (999) sbuild (999) 0 2026-10-16 11:26:06.000000 jtreg-test-output/jdk/0/JTreport/text/ │ │ │ │ │ +-rw-r--r-- 0 sbuild (999) sbuild (999) 17 2026-10-16 11:26:06.000000 jtreg-test-output/jdk/0/JTreport/text/faiL2error.txt │ │ │ │ │ +-rw-r--r-- 0 sbuild (999) sbuild (999) 16 2026-10-16 11:26:06.000000 jtreg-test-output/jdk/0/JTreport/text/fail2fail.txt │ │ │ │ │ +-rw-r--r-- 0 sbuild (999) sbuild (999) 19 2026-10-16 11:26:06.000000 jtreg-test-output/jdk/0/JTreport/text/other_errors.txt │ │ │ │ │ +-rw-r--r-- 0 sbuild (999) sbuild (999) 19 2026-10-16 11:26:06.000000 jtreg-test-output/jdk/0/JTreport/text/fail2missing.txt │ │ │ │ │ +-rw-r--r-- 0 sbuild (999) sbuild (999) 173 2026-10-16 11:26:06.000000 jtreg-test-output/jdk/0/JTreport/text/stats.txt │ │ │ │ │ +-rw-r--r-- 0 sbuild (999) sbuild (999) 1151 2026-10-16 11:26:06.000000 jtreg-test-output/jdk/0/JTreport/text/timeStats.txt │ │ │ │ │ +-rw-r--r-- 0 sbuild (999) sbuild (999) 83102 2026-10-16 11:26:06.000000 jtreg-test-output/jdk/0/JTreport/text/junit.txt │ │ │ │ │ +-rw-r--r-- 0 sbuild (999) sbuild (999) 16 2026-10-16 11:26:06.000000 jtreg-test-output/jdk/0/JTreport/text/fail2pass.txt │ │ │ │ │ +-rw-r--r-- 0 sbuild (999) sbuild (999) 530 2026-10-16 06:01:02.000000 jtreg-test-output/jdk/0/JTreport/text/cmdArgs.txt │ │ │ │ │ +-rw-r--r-- 0 sbuild (999) sbuild (999) 40569 2026-10-16 11:26:06.000000 jtreg-test-output/jdk/0/JTreport/text/notRun.txt │ │ │ │ │ +-rw-r--r-- 0 sbuild (999) sbuild (999) 21 2026-10-16 11:26:06.000000 jtreg-test-output/jdk/0/JTreport/text/tc_fail2notrun.txt │ │ │ │ │ +-rw-r--r-- 0 sbuild (999) sbuild (999) 20 2026-10-16 11:26:06.000000 jtreg-test-output/jdk/0/JTreport/text/tc_fail2error.txt │ │ │ │ │ +-rw-r--r-- 0 sbuild (999) sbuild (999) 22 2026-10-16 11:26:06.000000 jtreg-test-output/jdk/0/JTreport/text/tc_fail2missing.txt │ │ │ │ │ +-rw-r--r-- 0 sbuild (999) sbuild (999) 877980 2026-10-16 11:26:06.000000 jtreg-test-output/jdk/0/JTreport/text/summary.txt │ │ │ │ │ +-rw-r--r-- 0 sbuild (999) sbuild (999) 129304 2026-10-16 11:26:06.000000 jtreg-test-output/jdk/0/JTreport/text/testng.txt │ │ │ │ │ +-rw-r--r-- 0 sbuild (999) sbuild (999) 416 2026-10-16 11:26:06.000000 jtreg-test-output/jdk/0/JTreport/text/newfailures.txt │ │ │ │ │ +-rw-r--r-- 0 sbuild (999) sbuild (999) 18 2026-10-16 11:26:06.000000 jtreg-test-output/jdk/0/JTreport/text/fail2notrun.txt │ │ │ │ │ +-rw-r--r-- 0 sbuild (999) sbuild (999) 19 2026-10-16 11:26:06.000000 jtreg-test-output/jdk/0/JTreport/text/tc_fail2pass.txt │ │ │ │ │ +-rw-r--r-- 0 sbuild (999) sbuild (999) 21 2026-10-16 11:26:06.000000 jtreg-test-output/jdk/0/JTreport/text/tc_newfailures.txt │ │ │ │ │ +-rw-r--r-- 0 sbuild (999) sbuild (999) 712 2026-10-16 11:26:06.000000 jtreg-test-output/jdk/0/JTreport/index.html │ │ │ │ │ +-rw-r--r-- 0 sbuild (999) sbuild (999) 0 2026-10-16 11:26:06.000000 jtreg-test-output/jdk/0/JTreport/reportdir.dat │ │ │ │ │ +drwxr-xr-x 0 sbuild (999) sbuild (999) 0 2026-10-16 11:26:06.000000 jtreg-test-output/jdk/0/JTreport/html/ │ │ │ │ │ +-rw-r--r-- 0 sbuild (999) sbuild (999) 1233478 2026-10-16 11:26:06.000000 jtreg-test-output/jdk/0/JTreport/html/passed_gr.html │ │ │ │ │ +-rw-r--r-- 0 sbuild (999) sbuild (999) 1124310 2026-10-16 11:26:06.000000 jtreg-test-output/jdk/0/JTreport/html/index.html │ │ │ │ │ +-rw-r--r-- 0 sbuild (999) sbuild (999) 85438 2026-10-16 11:26:06.000000 jtreg-test-output/jdk/0/JTreport/html/excluded.html │ │ │ │ │ +-rw-r--r-- 0 sbuild (999) sbuild (999) 522 2026-10-16 11:26:06.000000 jtreg-test-output/jdk/0/JTreport/html/error_gr.html │ │ │ │ │ +-rw-r--r-- 0 sbuild (999) sbuild (999) 1124310 2026-10-16 11:26:06.000000 jtreg-test-output/jdk/0/JTreport/html/report.html │ │ │ │ │ +-rw-r--r-- 0 sbuild (999) sbuild (999) 30419 2026-10-16 11:26:06.000000 jtreg-test-output/jdk/0/JTreport/html/notRun.html │ │ │ │ │ +-rw-r--r-- 0 sbuild (999) sbuild (999) 2021 2026-10-16 11:26:06.000000 jtreg-test-output/jdk/0/JTreport/html/failed.html │ │ │ │ │ +-rw-r--r-- 0 sbuild (999) sbuild (999) 474 2026-10-16 11:26:06.000000 jtreg-test-output/jdk/0/JTreport/html/error.html │ │ │ │ │ +-rw-r--r-- 0 sbuild (999) sbuild (999) 30764 2026-10-16 11:26:06.000000 jtreg-test-output/jdk/0/JTreport/html/notRun_gr.html │ │ │ │ │ +-rw-r--r-- 0 sbuild (999) sbuild (999) 4125 2026-10-16 11:26:06.000000 jtreg-test-output/jdk/0/JTreport/html/env.html │ │ │ │ │ +-rw-r--r-- 0 sbuild (999) sbuild (999) 307 2026-10-16 11:26:05.000000 jtreg-test-output/jdk/0/JTreport/html/report.css │ │ │ │ │ +-rw-r--r-- 0 sbuild (999) sbuild (999) 2751 2026-10-16 11:26:06.000000 jtreg-test-output/jdk/0/JTreport/html/failed_gr.html │ │ │ │ │ +-rw-r--r-- 0 sbuild (999) sbuild (999) 23926 2026-10-16 11:26:06.000000 jtreg-test-output/jdk/0/JTreport/html/config.html │ │ │ │ │ +-rw-r--r-- 0 sbuild (999) sbuild (999) 1232169 2026-10-16 11:26:06.000000 jtreg-test-output/jdk/0/JTreport/html/passed.html │ │ │ │ │ +drwxr-xr-x 0 sbuild (999) sbuild (999) 0 2026-10-16 11:27:10.000000 jtreg-test-output/jdk/1/JTreport/ │ │ │ │ │ +drwxr-xr-x 0 sbuild (999) sbuild (999) 0 2026-10-16 11:27:10.000000 jtreg-test-output/jdk/1/JTreport/text/ │ │ │ │ │ +-rw-r--r-- 0 sbuild (999) sbuild (999) 17 2026-10-16 11:27:10.000000 jtreg-test-output/jdk/1/JTreport/text/faiL2error.txt │ │ │ │ │ +-rw-r--r-- 0 sbuild (999) sbuild (999) 16 2026-10-16 11:27:10.000000 jtreg-test-output/jdk/1/JTreport/text/fail2fail.txt │ │ │ │ │ +-rw-r--r-- 0 sbuild (999) sbuild (999) 19 2026-10-16 11:27:10.000000 jtreg-test-output/jdk/1/JTreport/text/other_errors.txt │ │ │ │ │ +-rw-r--r-- 0 sbuild (999) sbuild (999) 19 2026-10-16 11:27:10.000000 jtreg-test-output/jdk/1/JTreport/text/fail2missing.txt │ │ │ │ │ +-rw-r--r-- 0 sbuild (999) sbuild (999) 101 2026-10-16 11:27:10.000000 jtreg-test-output/jdk/1/JTreport/text/stats.txt │ │ │ │ │ +-rw-r--r-- 0 sbuild (999) sbuild (999) 116 2026-10-16 11:27:10.000000 jtreg-test-output/jdk/1/JTreport/text/timeStats.txt │ │ │ │ │ +-rw-r--r-- 0 sbuild (999) sbuild (999) 16 2026-10-16 11:27:10.000000 jtreg-test-output/jdk/1/JTreport/text/fail2pass.txt │ │ │ │ │ +-rw-r--r-- 0 sbuild (999) sbuild (999) 549 2026-10-16 11:26:48.000000 jtreg-test-output/jdk/1/JTreport/text/cmdArgs.txt │ │ │ │ │ +-rw-r--r-- 0 sbuild (999) sbuild (999) 1023448 2026-10-16 11:27:10.000000 jtreg-test-output/jdk/1/JTreport/text/notRun.txt │ │ │ │ │ +-rw-r--r-- 0 sbuild (999) sbuild (999) 21 2026-10-16 11:27:10.000000 jtreg-test-output/jdk/1/JTreport/text/tc_fail2notrun.txt │ │ │ │ │ +-rw-r--r-- 0 sbuild (999) sbuild (999) 20 2026-10-16 11:27:10.000000 jtreg-test-output/jdk/1/JTreport/text/tc_fail2error.txt │ │ │ │ │ +-rw-r--r-- 0 sbuild (999) sbuild (999) 22 2026-10-16 11:27:10.000000 jtreg-test-output/jdk/1/JTreport/text/tc_fail2missing.txt │ │ │ │ │ +-rw-r--r-- 0 sbuild (999) sbuild (999) 877980 2026-10-16 11:27:10.000000 jtreg-test-output/jdk/1/JTreport/text/summary.txt │ │ │ │ │ +-rw-r--r-- 0 sbuild (999) sbuild (999) 132 2026-10-16 11:27:10.000000 jtreg-test-output/jdk/1/JTreport/text/testng.txt │ │ │ │ │ +-rw-r--r-- 0 sbuild (999) sbuild (999) 416 2026-10-16 11:27:10.000000 jtreg-test-output/jdk/1/JTreport/text/newfailures.txt │ │ │ │ │ +-rw-r--r-- 0 sbuild (999) sbuild (999) 18 2026-10-16 11:27:10.000000 jtreg-test-output/jdk/1/JTreport/text/fail2notrun.txt │ │ │ │ │ +-rw-r--r-- 0 sbuild (999) sbuild (999) 19 2026-10-16 11:27:10.000000 jtreg-test-output/jdk/1/JTreport/text/tc_fail2pass.txt │ │ │ │ │ +-rw-r--r-- 0 sbuild (999) sbuild (999) 21 2026-10-16 11:27:10.000000 jtreg-test-output/jdk/1/JTreport/text/tc_newfailures.txt │ │ │ │ │ +-rw-r--r-- 0 sbuild (999) sbuild (999) 712 2026-10-16 11:27:10.000000 jtreg-test-output/jdk/1/JTreport/index.html │ │ │ │ │ +-rw-r--r-- 0 sbuild (999) sbuild (999) 0 2026-10-16 11:27:10.000000 jtreg-test-output/jdk/1/JTreport/reportdir.dat │ │ │ │ │ +drwxr-xr-x 0 sbuild (999) sbuild (999) 0 2026-10-16 11:27:10.000000 jtreg-test-output/jdk/1/JTreport/html/ │ │ │ │ │ +-rw-r--r-- 0 sbuild (999) sbuild (999) 1233478 2026-10-16 11:27:10.000000 jtreg-test-output/jdk/1/JTreport/html/passed_gr.html │ │ │ │ │ +-rw-r--r-- 0 sbuild (999) sbuild (999) 1101873 2026-10-16 11:27:10.000000 jtreg-test-output/jdk/1/JTreport/html/index.html │ │ │ │ │ +-rw-r--r-- 0 sbuild (999) sbuild (999) 85438 2026-10-16 11:27:10.000000 jtreg-test-output/jdk/1/JTreport/html/excluded.html │ │ │ │ │ +-rw-r--r-- 0 sbuild (999) sbuild (999) 522 2026-10-16 11:27:10.000000 jtreg-test-output/jdk/1/JTreport/html/error_gr.html │ │ │ │ │ +-rw-r--r-- 0 sbuild (999) sbuild (999) 1101873 2026-10-16 11:27:10.000000 jtreg-test-output/jdk/1/JTreport/html/report.html │ │ │ │ │ +-rw-r--r-- 0 sbuild (999) sbuild (999) 762367 2026-10-16 11:27:10.000000 jtreg-test-output/jdk/1/JTreport/html/notRun.html │ │ │ │ │ +-rw-r--r-- 0 sbuild (999) sbuild (999) 2021 2026-10-16 11:27:10.000000 jtreg-test-output/jdk/1/JTreport/html/failed.html │ │ │ │ │ +-rw-r--r-- 0 sbuild (999) sbuild (999) 474 2026-10-16 11:27:10.000000 jtreg-test-output/jdk/1/JTreport/html/error.html │ │ │ │ │ +-rw-r--r-- 0 sbuild (999) sbuild (999) 762640 2026-10-16 11:27:10.000000 jtreg-test-output/jdk/1/JTreport/html/notRun_gr.html │ │ │ │ │ +-rw-r--r-- 0 sbuild (999) sbuild (999) 4144 2026-10-16 11:27:10.000000 jtreg-test-output/jdk/1/JTreport/html/env.html │ │ │ │ │ +-rw-r--r-- 0 sbuild (999) sbuild (999) 307 2026-10-16 11:27:09.000000 jtreg-test-output/jdk/1/JTreport/html/report.css │ │ │ │ │ +-rw-r--r-- 0 sbuild (999) sbuild (999) 2751 2026-10-16 11:27:10.000000 jtreg-test-output/jdk/1/JTreport/html/failed_gr.html │ │ │ │ │ +-rw-r--r-- 0 sbuild (999) sbuild (999) 24358 2026-10-16 11:27:10.000000 jtreg-test-output/jdk/1/JTreport/html/config.html │ │ │ │ │ +-rw-r--r-- 0 sbuild (999) sbuild (999) 1232169 2026-10-16 11:27:10.000000 jtreg-test-output/jdk/1/JTreport/html/passed.html │ │ │ │ │ +drwxr-xr-x 0 sbuild (999) sbuild (999) 0 2026-10-16 11:27:47.000000 jtreg-test-output/jdk/2/JTreport/ │ │ │ │ │ +drwxr-xr-x 0 sbuild (999) sbuild (999) 0 2026-10-16 11:27:47.000000 jtreg-test-output/jdk/2/JTreport/text/ │ │ │ │ │ +-rw-r--r-- 0 sbuild (999) sbuild (999) 17 2026-10-16 11:27:47.000000 jtreg-test-output/jdk/2/JTreport/text/faiL2error.txt │ │ │ │ │ +-rw-r--r-- 0 sbuild (999) sbuild (999) 16 2026-10-16 11:27:47.000000 jtreg-test-output/jdk/2/JTreport/text/fail2fail.txt │ │ │ │ │ +-rw-r--r-- 0 sbuild (999) sbuild (999) 19 2026-10-16 11:27:47.000000 jtreg-test-output/jdk/2/JTreport/text/other_errors.txt │ │ │ │ │ +-rw-r--r-- 0 sbuild (999) sbuild (999) 19 2026-10-16 11:27:47.000000 jtreg-test-output/jdk/2/JTreport/text/fail2missing.txt │ │ │ │ │ +-rw-r--r-- 0 sbuild (999) sbuild (999) 101 2026-10-16 11:27:47.000000 jtreg-test-output/jdk/2/JTreport/text/stats.txt │ │ │ │ │ +-rw-r--r-- 0 sbuild (999) sbuild (999) 116 2026-10-16 11:27:47.000000 jtreg-test-output/jdk/2/JTreport/text/timeStats.txt │ │ │ │ │ +-rw-r--r-- 0 sbuild (999) sbuild (999) 16 2026-10-16 11:27:47.000000 jtreg-test-output/jdk/2/JTreport/text/fail2pass.txt │ │ │ │ │ +-rw-r--r-- 0 sbuild (999) sbuild (999) 549 2026-10-16 11:27:30.000000 jtreg-test-output/jdk/2/JTreport/text/cmdArgs.txt │ │ │ │ │ +-rw-r--r-- 0 sbuild (999) sbuild (999) 1023448 2026-10-16 11:27:47.000000 jtreg-test-output/jdk/2/JTreport/text/notRun.txt │ │ │ │ │ +-rw-r--r-- 0 sbuild (999) sbuild (999) 21 2026-10-16 11:27:47.000000 jtreg-test-output/jdk/2/JTreport/text/tc_fail2notrun.txt │ │ │ │ │ +-rw-r--r-- 0 sbuild (999) sbuild (999) 20 2026-10-16 11:27:47.000000 jtreg-test-output/jdk/2/JTreport/text/tc_fail2error.txt │ │ │ │ │ +-rw-r--r-- 0 sbuild (999) sbuild (999) 22 2026-10-16 11:27:47.000000 jtreg-test-output/jdk/2/JTreport/text/tc_fail2missing.txt │ │ │ │ │ +-rw-r--r-- 0 sbuild (999) sbuild (999) 877980 2026-10-16 11:27:47.000000 jtreg-test-output/jdk/2/JTreport/text/summary.txt │ │ │ │ │ +-rw-r--r-- 0 sbuild (999) sbuild (999) 132 2026-10-16 11:27:47.000000 jtreg-test-output/jdk/2/JTreport/text/testng.txt │ │ │ │ │ +-rw-r--r-- 0 sbuild (999) sbuild (999) 416 2026-10-16 11:27:47.000000 jtreg-test-output/jdk/2/JTreport/text/newfailures.txt │ │ │ │ │ +-rw-r--r-- 0 sbuild (999) sbuild (999) 18 2026-10-16 11:27:47.000000 jtreg-test-output/jdk/2/JTreport/text/fail2notrun.txt │ │ │ │ │ +-rw-r--r-- 0 sbuild (999) sbuild (999) 19 2026-10-16 11:27:47.000000 jtreg-test-output/jdk/2/JTreport/text/tc_fail2pass.txt │ │ │ │ │ +-rw-r--r-- 0 sbuild (999) sbuild (999) 21 2026-10-16 11:27:47.000000 jtreg-test-output/jdk/2/JTreport/text/tc_newfailures.txt │ │ │ │ │ +-rw-r--r-- 0 sbuild (999) sbuild (999) 712 2026-10-16 11:27:47.000000 jtreg-test-output/jdk/2/JTreport/index.html │ │ │ │ │ +-rw-r--r-- 0 sbuild (999) sbuild (999) 0 2026-10-16 11:27:47.000000 jtreg-test-output/jdk/2/JTreport/reportdir.dat │ │ │ │ │ +drwxr-xr-x 0 sbuild (999) sbuild (999) 0 2026-10-16 11:27:47.000000 jtreg-test-output/jdk/2/JTreport/html/ │ │ │ │ │ +-rw-r--r-- 0 sbuild (999) sbuild (999) 1233478 2026-10-16 11:27:47.000000 jtreg-test-output/jdk/2/JTreport/html/passed_gr.html │ │ │ │ │ +-rw-r--r-- 0 sbuild (999) sbuild (999) 1101873 2026-10-16 11:27:47.000000 jtreg-test-output/jdk/2/JTreport/html/index.html │ │ │ │ │ +-rw-r--r-- 0 sbuild (999) sbuild (999) 85438 2026-10-16 11:27:47.000000 jtreg-test-output/jdk/2/JTreport/html/excluded.html │ │ │ │ │ +-rw-r--r-- 0 sbuild (999) sbuild (999) 522 2026-10-16 11:27:47.000000 jtreg-test-output/jdk/2/JTreport/html/error_gr.html │ │ │ │ │ +-rw-r--r-- 0 sbuild (999) sbuild (999) 1101873 2026-10-16 11:27:47.000000 jtreg-test-output/jdk/2/JTreport/html/report.html │ │ │ │ │ +-rw-r--r-- 0 sbuild (999) sbuild (999) 762367 2026-10-16 11:27:47.000000 jtreg-test-output/jdk/2/JTreport/html/notRun.html │ │ │ │ │ +-rw-r--r-- 0 sbuild (999) sbuild (999) 2021 2026-10-16 11:27:47.000000 jtreg-test-output/jdk/2/JTreport/html/failed.html │ │ │ │ │ +-rw-r--r-- 0 sbuild (999) sbuild (999) 474 2026-10-16 11:27:47.000000 jtreg-test-output/jdk/2/JTreport/html/error.html │ │ │ │ │ +-rw-r--r-- 0 sbuild (999) sbuild (999) 762640 2026-10-16 11:27:47.000000 jtreg-test-output/jdk/2/JTreport/html/notRun_gr.html │ │ │ │ │ +-rw-r--r-- 0 sbuild (999) sbuild (999) 4144 2026-10-16 11:27:47.000000 jtreg-test-output/jdk/2/JTreport/html/env.html │ │ │ │ │ +-rw-r--r-- 0 sbuild (999) sbuild (999) 307 2026-10-16 11:27:46.000000 jtreg-test-output/jdk/2/JTreport/html/report.css │ │ │ │ │ +-rw-r--r-- 0 sbuild (999) sbuild (999) 2751 2026-10-16 11:27:47.000000 jtreg-test-output/jdk/2/JTreport/html/failed_gr.html │ │ │ │ │ +-rw-r--r-- 0 sbuild (999) sbuild (999) 24358 2026-10-16 11:27:47.000000 jtreg-test-output/jdk/2/JTreport/html/config.html │ │ │ │ │ +-rw-r--r-- 0 sbuild (999) sbuild (999) 1232169 2026-10-16 11:27:47.000000 jtreg-test-output/jdk/2/JTreport/html/passed.html │ │ │ │ ├── jtreg-test-output/jdk/2/JTreport/index.html │ │ │ │ │ @@ -3,15 +3,15 @@ │ │ │ │ │ │ │ │ │ │ │ │ │ │ │ │ │ │ │ │ │ │ │ │ │ Report Index │ │ │ │ │ │ │ │ │ │

/build/reproducible-path/openjdk-21-21.0.13~8ea/test/jdk

│ │ │ │ │ -Date of report : 08 October 2026 18:59:23 │ │ │ │ │ +Date of report : 16 October 2026 11:27:47 │ │ │ │ │ │ │ │ │ │

│ │ │ │ │ HTML Report │ │ │ │ │
Standard JT Harness HTML report. Can show a summary of the results, configuration information, and environment values.

│ │ │ │ │

│ │ │ │ │ Plain Text Report │ │ │ │ │
Standard JT Harness text report showing only test names and their result status string. Suitable for parsing by external program.

│ │ │ │ │ ├── html2text {} │ │ │ │ │ │ @@ -1,8 +1,8 @@ │ │ │ │ │ │ ************ //bbuuiilldd//rreepprroodduucciibbllee--ppaatthh//ooppeennjjddkk--2211--2211..00..1133~~88eeaa//tteesstt//jjddkk ************ │ │ │ │ │ │ -Date of report : 08 October 2026 18:59:23 │ │ │ │ │ │ +Date of report : 16 October 2026 11:27:47 │ │ │ │ │ │ _H_T_M_L_ _R_e_p_o_r_t │ │ │ │ │ │ Standard JT Harness HTML report. Can show a summary of the results, │ │ │ │ │ │ configuration information, and environment values. │ │ │ │ │ │ _P_l_a_i_n_ _T_e_x_t_ _R_e_p_o_r_t │ │ │ │ │ │ Standard JT Harness text report showing only test names and their result status │ │ │ │ │ │ string. Suitable for parsing by external program. │ │ │ │ ├── jtreg-test-output/jdk/2/JTreport/html/notRun_gr.html │ │ │ │ │ @@ -47648,18 +47648,18 @@ │ │ │ │ │ 000ba1f0: 6e20 696e 206a 6176 612e 7365 6375 7269 n in java.securi │ │ │ │ │ 000ba200: 7479 2e64 6562 7567 206f 7574 7075 740a ty.debug output. │ │ │ │ │ 000ba210: 0a3c 6c69 3e74 6f6f 6c73 2f6a 6c69 6e6b .
  • tools/jlink │ │ │ │ │ 000ba220: 2f4a 4c69 6e6b 5465 7374 2e6a 6176 613a /JLinkTest.java: │ │ │ │ │ 000ba230: 2054 6573 7420 696d 6167 6520 6372 6561 Test image crea │ │ │ │ │ 000ba240: 7469 6f6e 0a3c 2f75 6c3e 0a3c 6872 3e0a tion..
    . │ │ │ │ │ 000ba250: 3c73 6d61 6c6c 3e52 6570 6f72 7420 6765 Report ge │ │ │ │ │ -000ba260: 6e65 7261 7465 6420 6f6e 204f 6374 2038 nerated on Oct 8 │ │ │ │ │ -000ba270: 2c20 3230 3236 2036 3a35 393a 3233 e280 , 2026 6:59:23.. │ │ │ │ │ -000ba280: af50 4d0a 3c62 723e 5573 696e 6720 4a54 .PM.
    Using JT │ │ │ │ │ -000ba290: 2048 6172 6e65 7373 2036 2e30 2062 3236 Harness 6.0 b26 │ │ │ │ │ -000ba2a0: 3b20 6275 696c 7420 6f6e 204d 6172 6368 ; built on March │ │ │ │ │ -000ba2b0: 2031 382c 2032 3032 362c 2031 323a 3030 18, 2026, 12:00 │ │ │ │ │ -000ba2c0: 3a30 30e2 80af 414d 2055 5443 2077 6974 :00...AM UTC wit │ │ │ │ │ -000ba2d0: 6820 6f70 656e 6a64 6b20 7665 7273 696f h openjdk versio │ │ │ │ │ -000ba2e0: 6e20 2232 352e 302e 332d 6561 2220 3230 n "25.0.3-ea" 20 │ │ │ │ │ -000ba2f0: 3236 2d30 342d 3231 3c2f 736d 616c 6c3e 26-04-21
    │ │ │ │ │ -000ba300: 3c2f 626f 6479 3e3c 2f68 746d 6c3e │ │ │ │ │ +000ba260: 6e65 7261 7465 6420 6f6e 204f 6374 2031 nerated on Oct 1 │ │ │ │ │ +000ba270: 362c 2032 3032 3620 3131 3a32 373a 3437 6, 2026 11:27:47 │ │ │ │ │ +000ba280: e280 af41 4d0a 3c62 723e 5573 696e 6720 ...AM.
    Using │ │ │ │ │ +000ba290: 4a54 2048 6172 6e65 7373 2036 2e30 2062 JT Harness 6.0 b │ │ │ │ │ +000ba2a0: 3236 3b20 6275 696c 7420 6f6e 204d 6172 26; built on Mar │ │ │ │ │ +000ba2b0: 6368 2031 382c 2032 3032 362c 2031 323a ch 18, 2026, 12: │ │ │ │ │ +000ba2c0: 3030 3a30 30e2 80af 414d 2055 5443 2077 00:00...AM UTC w │ │ │ │ │ +000ba2d0: 6974 6820 6f70 656e 6a64 6b20 7665 7273 ith openjdk vers │ │ │ │ │ +000ba2e0: 696f 6e20 2232 352e 302e 332d 6561 2220 ion "25.0.3-ea" │ │ │ │ │ +000ba2f0: 3230 3236 2d30 342d 3231 3c2f 736d 616c 2026-04-21 │ │ │ │ │ ├── html2text {} │ │ │ │ │ │ @@ -13393,10 +13393,10 @@ │ │ │ │ │ │ * sun/security/smartcardio/TestPresent.java: test that the isCardPresent()/ │ │ │ │ │ │ waitForX() APIs work correctly │ │ │ │ │ │ * sun/security/smartcardio/TestTransmit.java: test transmit() works │ │ │ │ │ │ * sun/security/util/Debug/DebugOptions.java: Option to print extra │ │ │ │ │ │ information in java.security.debug output │ │ │ │ │ │ * tools/jlink/JLinkTest.java: Test image creation │ │ │ │ │ │ =============================================================================== │ │ │ │ │ │ -Report generated on Oct 8, 2026 6:59:23 PM │ │ │ │ │ │ +Report generated on Oct 16, 2026 11:27:47 AM │ │ │ │ │ │ Using JT Harness 6.0 b26; built on March 18, 2026, 12:00:00 AM UTC with openjdk │ │ │ │ │ │ version "25.0.3-ea" 2026-04-21 │ │ │ │ ├── jtreg-test-output/jdk/2/JTreport/html/notRun.html │ │ │ │ │ @@ -47631,18 +47631,18 @@ │ │ │ │ │ 000ba0e0: 722f 6d6f 6475 6c65 732f 7661 6c69 6461 r/modules/valida │ │ │ │ │ 000ba0f0: 7465 2f56 616c 6964 6174 654d 6f64 756c te/ValidateModul │ │ │ │ │ 000ba100: 6573 5465 7374 2e6a 6176 613a 2042 6173 esTest.java: Bas │ │ │ │ │ 000ba110: 6963 2074 6573 7420 666f 7220 6a61 7661 ic test for java │ │ │ │ │ 000ba120: 202d 2d76 616c 6964 6174 652d 6d6f 6475 --validate-modu │ │ │ │ │ 000ba130: 6c65 730a 3c62 720a 3e0a 3c68 723e 0a3c les..
    .< │ │ │ │ │ 000ba140: 736d 616c 6c3e 5265 706f 7274 2067 656e small>Report gen │ │ │ │ │ -000ba150: 6572 6174 6564 206f 6e20 4f63 7420 382c erated on Oct 8, │ │ │ │ │ -000ba160: 2032 3032 3620 363a 3539 3a32 33e2 80af 2026 6:59:23... │ │ │ │ │ -000ba170: 504d 0a3c 6272 3e55 7369 6e67 204a 5420 PM.
    Using JT │ │ │ │ │ -000ba180: 4861 726e 6573 7320 362e 3020 6232 363b Harness 6.0 b26; │ │ │ │ │ -000ba190: 2062 7569 6c74 206f 6e20 4d61 7263 6820 built on March │ │ │ │ │ -000ba1a0: 3138 2c20 3230 3236 2c20 3132 3a30 303a 18, 2026, 12:00: │ │ │ │ │ -000ba1b0: 3030 e280 af41 4d20 5554 4320 7769 7468 00...AM UTC with │ │ │ │ │ -000ba1c0: 206f 7065 6e6a 646b 2076 6572 7369 6f6e openjdk version │ │ │ │ │ -000ba1d0: 2022 3235 2e30 2e33 2d65 6122 2032 3032 "25.0.3-ea" 202 │ │ │ │ │ -000ba1e0: 362d 3034 2d32 313c 2f73 6d61 6c6c 3e3c 6-04-21< │ │ │ │ │ -000ba1f0: 2f62 6f64 793e 3c2f 6874 6d6c 3e /body> │ │ │ │ │ +000ba150: 6572 6174 6564 206f 6e20 4f63 7420 3136 erated on Oct 16 │ │ │ │ │ +000ba160: 2c20 3230 3236 2031 313a 3237 3a34 37e2 , 2026 11:27:47. │ │ │ │ │ +000ba170: 80af 414d 0a3c 6272 3e55 7369 6e67 204a ..AM.
    Using J │ │ │ │ │ +000ba180: 5420 4861 726e 6573 7320 362e 3020 6232 T Harness 6.0 b2 │ │ │ │ │ +000ba190: 363b 2062 7569 6c74 206f 6e20 4d61 7263 6; built on Marc │ │ │ │ │ +000ba1a0: 6820 3138 2c20 3230 3236 2c20 3132 3a30 h 18, 2026, 12:0 │ │ │ │ │ +000ba1b0: 303a 3030 e280 af41 4d20 5554 4320 7769 0:00...AM UTC wi │ │ │ │ │ +000ba1c0: 7468 206f 7065 6e6a 646b 2076 6572 7369 th openjdk versi │ │ │ │ │ +000ba1d0: 6f6e 2022 3235 2e30 2e33 2d65 6122 2032 on "25.0.3-ea" 2 │ │ │ │ │ +000ba1e0: 3032 362d 3034 2d32 313c 2f73 6d61 6c6c 026-04-21 │ │ │ │ │ ├── html2text {} │ │ │ │ │ │ @@ -12773,10 +12773,10 @@ │ │ │ │ │ │ tools/launcher/modules/patch/systemmodules/PatchSystemModules.java: Patch │ │ │ │ │ │ java.base and user module with ModuleHashes attribute │ │ │ │ │ │ tools/launcher/modules/showmoduleresolution/ShowModuleResolutionTest.java: │ │ │ │ │ │ Basic test for java --show-module-resolution │ │ │ │ │ │ tools/launcher/modules/validate/ValidateModulesTest.java: Basic test for java - │ │ │ │ │ │ -validate-modules │ │ │ │ │ │ =============================================================================== │ │ │ │ │ │ -Report generated on Oct 8, 2026 6:59:23 PM │ │ │ │ │ │ +Report generated on Oct 16, 2026 11:27:47 AM │ │ │ │ │ │ Using JT Harness 6.0 b26; built on March 18, 2026, 12:00:00 AM UTC with openjdk │ │ │ │ │ │ version "25.0.3-ea" 2026-04-21 │ │ │ │ ├── jtreg-test-output/jdk/2/JTreport/html/error_gr.html │ │ │ │ │ @@ -6,9 +6,9 @@ │ │ │ │ │ │ │ │ │ │ JT Harness : Tests that had errors │ │ │ │ │ │ │ │ │ │ │ │ │ │ │ │ │ │ │ │

    JT Harness : Tests that had errors

    Tests are grouped by their final status message. │ │ │ │ │
    │ │ │ │ │ -Report generated on Oct 8, 2026 6:59:23 PM │ │ │ │ │ +Report generated on Oct 16, 2026 11:27:47 AM │ │ │ │ │
    Using JT Harness 6.0 b26; built on March 18, 2026, 12:00:00 AM UTC with openjdk version "25.0.3-ea" 2026-04-21
    │ │ │ │ │ ├── html2text {} │ │ │ │ │ │ @@ -1,6 +1,6 @@ │ │ │ │ │ │ ************ JJTT HHaarrnneessss :: TTeessttss tthhaatt hhaadd eerrrroorrss ************ │ │ │ │ │ │ Tests are grouped by their final status message. │ │ │ │ │ │ =============================================================================== │ │ │ │ │ │ -Report generated on Oct 8, 2026 6:59:23 PM │ │ │ │ │ │ +Report generated on Oct 16, 2026 11:27:47 AM │ │ │ │ │ │ Using JT Harness 6.0 b26; built on March 18, 2026, 12:00:00 AM UTC with openjdk │ │ │ │ │ │ version "25.0.3-ea" 2026-04-21 │ │ │ │ ├── jtreg-test-output/jdk/2/JTreport/html/error.html │ │ │ │ │ @@ -6,9 +6,9 @@ │ │ │ │ │ │ │ │ │ │ JT Harness : Tests that had errors │ │ │ │ │ │ │ │ │ │ │ │ │ │ │ │ │ │ │ │

    JT Harness : Tests that had errors

    │ │ │ │ │
    │ │ │ │ │ -Report generated on Oct 8, 2026 6:59:23 PM │ │ │ │ │ +Report generated on Oct 16, 2026 11:27:47 AM │ │ │ │ │
    Using JT Harness 6.0 b26; built on March 18, 2026, 12:00:00 AM UTC with openjdk version "25.0.3-ea" 2026-04-21
    │ │ │ │ │ ├── html2text {} │ │ │ │ │ │ @@ -1,5 +1,5 @@ │ │ │ │ │ │ ************ JJTT HHaarrnneessss :: TTeessttss tthhaatt hhaadd eerrrroorrss ************ │ │ │ │ │ │ =============================================================================== │ │ │ │ │ │ -Report generated on Oct 8, 2026 6:59:23 PM │ │ │ │ │ │ +Report generated on Oct 16, 2026 11:27:47 AM │ │ │ │ │ │ Using JT Harness 6.0 b26; built on March 18, 2026, 12:00:00 AM UTC with openjdk │ │ │ │ │ │ version "25.0.3-ea" 2026-04-21 │ │ │ │ ├── jtreg-test-output/jdk/2/JTreport/html/failed_gr.html │ │ │ │ │ @@ -56,9 +56,9 @@ │ │ │ │ │
  • │ │ │ │ │ java/net/MulticastSocket/SetLoopbackMode.java: Test MulticastSocket.setLoopbackMode │ │ │ │ │ │ │ │ │ │
  • │ │ │ │ │ java/net/MulticastSocket/SetLoopbackModeIPv4.java: Test MulticastSocket.setLoopbackMode with IPv4 addresses │ │ │ │ │ │ │ │ │ │
    │ │ │ │ │ -Report generated on Oct 8, 2026 6:59:23 PM │ │ │ │ │ +Report generated on Oct 16, 2026 11:27:47 AM │ │ │ │ │
    Using JT Harness 6.0 b26; built on March 18, 2026, 12:00:00 AM UTC with openjdk version "25.0.3-ea" 2026-04-21
    │ │ │ │ │ ├── html2text {} │ │ │ │ │ │ @@ -25,10 +25,10 @@ │ │ │ │ │ │ * _j_a_v_a_/_n_e_t_/_M_u_l_t_i_c_a_s_t_S_o_c_k_e_t_/_N_o_L_o_o_p_b_a_c_k_P_a_c_k_e_t_s_._j_a_v_a: Re-test IPv6 (and │ │ │ │ │ │ specifically MulticastSocket) with latest Linux & USAGI code │ │ │ │ │ │ * _j_a_v_a_/_n_e_t_/_M_u_l_t_i_c_a_s_t_S_o_c_k_e_t_/_S_e_t_L_o_o_p_b_a_c_k_M_o_d_e_._j_a_v_a: Test │ │ │ │ │ │ MulticastSocket.setLoopbackMode │ │ │ │ │ │ * _j_a_v_a_/_n_e_t_/_M_u_l_t_i_c_a_s_t_S_o_c_k_e_t_/_S_e_t_L_o_o_p_b_a_c_k_M_o_d_e_I_P_v_4_._j_a_v_a: Test │ │ │ │ │ │ MulticastSocket.setLoopbackMode with IPv4 addresses │ │ │ │ │ │ =============================================================================== │ │ │ │ │ │ -Report generated on Oct 8, 2026 6:59:23 PM │ │ │ │ │ │ +Report generated on Oct 16, 2026 11:27:47 AM │ │ │ │ │ │ Using JT Harness 6.0 b26; built on March 18, 2026, 12:00:00 AM UTC with openjdk │ │ │ │ │ │ version "25.0.3-ea" 2026-04-21 │ │ │ │ ├── jtreg-test-output/jdk/2/JTreport/html/failed.html │ │ │ │ │ @@ -33,9 +33,9 @@ │ │ │ │ │ java/net/SocketPermission/SocketPermissionTest.java: SocketPermission tests for legacy socket types. │ │ │ │ │
    │ │ │ │ │ sun/security/krb5/auto/Addresses.java: fix krb5 caddr │ │ │ │ │
    │ │ │ │ │
    │ │ │ │ │ -Report generated on Oct 8, 2026 6:59:23 PM │ │ │ │ │ +Report generated on Oct 16, 2026 11:27:47 AM │ │ │ │ │
    Using JT Harness 6.0 b26; built on March 18, 2026, 12:00:00 AM UTC with openjdk version "25.0.3-ea" 2026-04-21
    │ │ │ │ │ ├── html2text {} │ │ │ │ │ │ @@ -11,10 +11,10 @@ │ │ │ │ │ │ MulticastSocket.setLoopbackMode with IPv4 addresses │ │ │ │ │ │ _j_a_v_a_/_n_e_t_/_M_u_l_t_i_c_a_s_t_S_o_c_k_e_t_/_T_e_s_t_._j_a_v_a: IPv4 and IPv6 multicasting broken on Linux │ │ │ │ │ │ _j_a_v_a_/_n_e_t_/_S_o_c_k_e_t_O_p_t_i_o_n_/_O_p_t_i_o_n_s_T_e_s_t_._j_a_v_a: │ │ │ │ │ │ _j_a_v_a_/_n_e_t_/_S_o_c_k_e_t_P_e_r_m_i_s_s_i_o_n_/_S_o_c_k_e_t_P_e_r_m_i_s_s_i_o_n_T_e_s_t_._j_a_v_a: SocketPermission tests for │ │ │ │ │ │ legacy socket types. │ │ │ │ │ │ _s_u_n_/_s_e_c_u_r_i_t_y_/_k_r_b_5_/_a_u_t_o_/_A_d_d_r_e_s_s_e_s_._j_a_v_a: fix krb5 caddr │ │ │ │ │ │ =============================================================================== │ │ │ │ │ │ -Report generated on Oct 8, 2026 6:59:23 PM │ │ │ │ │ │ +Report generated on Oct 16, 2026 11:27:47 AM │ │ │ │ │ │ Using JT Harness 6.0 b26; built on March 18, 2026, 12:00:00 AM UTC with openjdk │ │ │ │ │ │ version "25.0.3-ea" 2026-04-21 │ │ │ │ ├── jtreg-test-output/jdk/2/JTreport/html/passed_gr.html │ │ │ │ │ @@ -241,76843 +241,76853 @@ │ │ │ │ │ 00000f00: 6c65 732e 6a74 7222 3e6a 646b 2f63 6c61 les.jtr">jdk/cla │ │ │ │ │ 00000f10: 7373 6669 6c65 2f65 7861 6d70 6c65 732f ssfile/examples/ │ │ │ │ │ 00000f20: 5472 616e 7366 6f72 6d45 7861 6d70 6c65 TransformExample │ │ │ │ │ 00000f30: 732e 6a61 7661 3c2f 613e 3a20 5465 7374 s.java: Test │ │ │ │ │ 00000f40: 696e 6720 436c 6173 7366 696c 6520 5472 ing Classfile Tr │ │ │ │ │ 00000f50: 616e 7366 6f72 6d45 7861 6d70 6c65 7320 ansformExamples │ │ │ │ │ 00000f60: 636f 6d70 696c 6174 696f 6e2e 0a3c 2f75 compilation....

    Executio │ │ │ │ │ -00000f80: 6e20 6661 696c 6564 2061 7320 6578 7065 n failed as expe │ │ │ │ │ -00000f90: 6374 6564 3c2f 6834 3e0a 0a3c 756c 3e0a cted

    ....

    E │ │ │ │ │ -00001670: 7865 6375 7469 6f6e 2073 7563 6365 7373 xecution success │ │ │ │ │ -00001680: 6675 6c3c 2f68 343e 0a0a 3c75 6c3e 0a3c ful

    ..