--- /srv/rebuilderd/tmp/rebuilderdtNS5w3/inputs/openjdk-21-jdk_21.0.13+9-1_i386.deb +++ /srv/rebuilderd/tmp/rebuilderdtNS5w3/out/openjdk-21-jdk_21.0.13+9-1_i386.deb ├── file list │ @@ -1,3 +1,3 @@ │ -rw-r--r-- 0 0 0 4 2026-10-22 01:19:01.000000 debian-binary │ --rw-r--r-- 0 0 0 1828 2026-10-22 01:19:01.000000 control.tar.xz │ --rw-r--r-- 0 0 0 3590492 2026-10-22 01:19:01.000000 data.tar.xz │ +-rw-r--r-- 0 0 0 1832 2026-10-22 01:19:01.000000 control.tar.xz │ +-rw-r--r-- 0 0 0 3621288 2026-10-22 01:19:01.000000 data.tar.xz ├── control.tar.xz │ ├── control.tar │ │ ├── ./control │ │ │ @@ -1,13 +1,13 @@ │ │ │ Package: openjdk-21-jdk │ │ │ Source: openjdk-21 │ │ │ Version: 21.0.13+9-1 │ │ │ Architecture: i386 │ │ │ Maintainer: OpenJDK Team │ │ │ -Installed-Size: 3712 │ │ │ +Installed-Size: 3723 │ │ │ Depends: openjdk-21-jre (= 21.0.13+9-1), openjdk-21-jdk-headless (= 21.0.13+9-1), libc6 (>= 2.34), zlib1g (>= 1:1.1.4) │ │ │ Recommends: libxt-dev │ │ │ Suggests: openjdk-21-demo, openjdk-21-source, visualvm │ │ │ Provides: java-compiler, java-sdk (= 21), java10-sdk, java11-sdk, java12-sdk, java13-sdk, java14-sdk, java15-sdk, java16-sdk, java17-sdk, java18-sdk, java19-sdk, java2-sdk, java20-sdk, java21-sdk, java5-sdk, java6-sdk, java7-sdk, java8-sdk, java9-sdk │ │ │ Section: java │ │ │ Priority: optional │ │ │ Multi-Arch: same │ │ ├── ./md5sums │ │ │ ├── ./md5sums │ │ │ │┄ Files differ ├── data.tar.xz │ ├── data.tar │ │ ├── file list │ │ │ @@ -13,17 +13,17 @@ │ │ │ drwxr-xr-x 0 root (0) root (0) 0 2026-10-22 01:19:01.000000 ./usr/lib/jvm/java-21-openjdk-i386/man/man1/ │ │ │ -rw-r--r-- 0 root (0) root (0) 1723 2026-10-22 01:19:01.000000 ./usr/lib/jvm/java-21-openjdk-i386/man/man1/jconsole.1.gz │ │ │ drwxr-xr-x 0 root (0) root (0) 0 2026-10-22 01:19:01.000000 ./usr/lib/jvm/openjdk-21/ │ │ │ drwxr-xr-x 0 root (0) root (0) 0 2026-10-22 01:19:01.000000 ./usr/share/ │ │ │ drwxr-xr-x 0 root (0) root (0) 0 2026-10-22 01:19:01.000000 ./usr/share/doc/ │ │ │ drwxr-xr-x 0 root (0) root (0) 0 2026-10-22 01:19:01.000000 ./usr/share/doc/openjdk-21-jre-headless/ │ │ │ drwxr-xr-x 0 root (0) root (0) 0 2026-10-22 01:19:01.000000 ./usr/share/doc/openjdk-21-jre-headless/test-i386/ │ │ │ --rw-r--r-- 0 root (0) root (0) 26242 2026-10-22 01:19:01.000000 ./usr/share/doc/openjdk-21-jre-headless/test-i386/check-hotspot-hotspot.log.gz │ │ │ +-rw-r--r-- 0 root (0) root (0) 26139 2026-10-22 01:19:01.000000 ./usr/share/doc/openjdk-21-jre-headless/test-i386/check-hotspot-hotspot.log.gz │ │ │ -rw-r--r-- 0 root (0) root (0) 3918 2026-10-22 01:19:01.000000 ./usr/share/doc/openjdk-21-jre-headless/test-i386/check-jaxp-hotspot.log.gz │ │ │ -rw-r--r-- 0 root (0) root (0) 54997 2026-10-22 01:19:01.000000 ./usr/share/doc/openjdk-21-jre-headless/test-i386/check-jdk-hotspot.log.gz │ │ │ -rw-r--r-- 0 root (0) root (0) 35205 2026-10-22 01:19:01.000000 ./usr/share/doc/openjdk-21-jre-headless/test-i386/check-langtools-hotspot.log.gz │ │ │ --rw-r--r-- 0 root (0) root (0) 8561 2026-10-22 01:19:01.000000 ./usr/share/doc/openjdk-21-jre-headless/test-i386/failed_tests-hotspot.tar.gz │ │ │ +-rw-r--r-- 0 root (0) root (0) 8579 2026-10-22 01:19:01.000000 ./usr/share/doc/openjdk-21-jre-headless/test-i386/failed_tests-hotspot.tar.gz │ │ │ -rw-r--r-- 0 root (0) root (0) 3425 2026-10-22 01:19:01.000000 ./usr/share/doc/openjdk-21-jre-headless/test-i386/jtreg-summary-hotspot.log │ │ │ --rw-r--r-- 0 root (0) root (0) 124649 2026-10-22 01:19:01.000000 ./usr/share/doc/openjdk-21-jre-headless/test-i386/jtreg_output-hotspot.log.gz │ │ │ --rw-r--r-- 0 root (0) root (0) 3486809 2026-10-22 01:19:01.000000 ./usr/share/doc/openjdk-21-jre-headless/test-i386/jtreport-hotspot.tar.gz │ │ │ +-rw-r--r-- 0 root (0) root (0) 124615 2026-10-22 01:19:01.000000 ./usr/share/doc/openjdk-21-jre-headless/test-i386/jtreg_output-hotspot.log.gz │ │ │ +-rw-r--r-- 0 root (0) root (0) 3498188 2026-10-22 01:19:01.000000 ./usr/share/doc/openjdk-21-jre-headless/test-i386/jtreport-hotspot.tar.gz │ │ │ lrwxrwxrwx 0 root (0) root (0) 0 2026-10-22 01:19:01.000000 ./usr/lib/jvm/openjdk-21/src.zip -> lib/src.zip │ │ │ lrwxrwxrwx 0 root (0) root (0) 0 2026-10-22 01:19:01.000000 ./usr/share/doc/openjdk-21-jdk -> openjdk-21-jre │ │ ├── ./usr/share/doc/openjdk-21-jre-headless/test-i386/check-hotspot-hotspot.log.gz │ │ │ ├── check-hotspot-hotspot.log │ │ │ │ @@ -266,16 +266,14 @@ │ │ │ │ Passed: compiler/intrinsics/IntrinsicDisabledTest.java │ │ │ │ Passed: compiler/intrinsics/Test6982370.java │ │ │ │ Passed: compiler/intrinsics/Test8005419.java │ │ │ │ Passed: compiler/intrinsics/Test8215792.java │ │ │ │ Passed: compiler/intrinsics/Test8237524.java │ │ │ │ Passed: compiler/intrinsics/TestArraysHashCode.java │ │ │ │ Passed: compiler/intrinsics/TestCheckIndex.java │ │ │ │ -Passed: compiler/intrinsics/TestDoubleIsInfinite.java │ │ │ │ -Passed: compiler/intrinsics/TestFloatIsInfinite.java │ │ │ │ Passed: compiler/intrinsics/TestReferenceGetWithNull.java │ │ │ │ Passed: compiler/intrinsics/TestReferenceRefersTo.java │ │ │ │ Passed: compiler/intrinsics/TestRotate.java │ │ │ │ Passed: compiler/intrinsics/zip/TestAdler32.java │ │ │ │ Passed: compiler/intrinsics/zip/TestCRC32.java │ │ │ │ Passed: compiler/intrinsics/zip/TestCRC32C.java │ │ │ │ Passed: compiler/intrinsics/zip/TestFpRegsABI.java │ │ │ │ @@ -1441,21 +1439,18 @@ │ │ │ │ Passed: compiler/intrinsics/sha/sanity/TestSHA3Intrinsics.java │ │ │ │ Passed: compiler/intrinsics/sha/sanity/TestSHA3MultiBlockIntrinsics.java │ │ │ │ Passed: compiler/intrinsics/sha/sanity/TestSHA512Intrinsics.java │ │ │ │ Passed: compiler/intrinsics/sha/sanity/TestSHA512MultiBlockIntrinsics.java │ │ │ │ Passed: compiler/intrinsics/sha/TestDigest.java │ │ │ │ Passed: compiler/intrinsics/string/TestCopyValueOf.java │ │ │ │ Passed: compiler/intrinsics/string/TestCountPositives.java#id0 │ │ │ │ -Passed: compiler/intrinsics/string/TestCountPositives.java#id1 │ │ │ │ Passed: compiler/intrinsics/string/TestEncodeIntrinsics.java │ │ │ │ Passed: compiler/intrinsics/string/TestHasNegatives.java#id0 │ │ │ │ -Passed: compiler/intrinsics/string/TestHasNegatives.java#id1 │ │ │ │ Passed: compiler/intrinsics/string/TestStringConstruction.java │ │ │ │ Passed: compiler/intrinsics/string/TestStringConstructionIntrinsics.java#id0 │ │ │ │ -Passed: compiler/intrinsics/string/TestStringConstructionIntrinsics.java#id1 │ │ │ │ Passed: compiler/intrinsics/string/TestStringEqualsBadLength.java │ │ │ │ Passed: compiler/intrinsics/string/TestStringIndexOfCharIntrinsics.java │ │ │ │ Passed: compiler/intrinsics/string/TestStringIntrinsicMemoryFlow.java │ │ │ │ Passed: compiler/intrinsics/string/TestStringIntrinsicRangeChecks.java │ │ │ │ Passed: compiler/intrinsics/string/TestStringIntrinsics.java │ │ │ │ Passed: compiler/intrinsics/string/TestStringIntrinsics2.java │ │ │ │ Passed: compiler/intrinsics/string/TestStringLatin1IndexOfChar.java │ │ │ │ @@ -1529,22 +1524,14 @@ │ │ │ │ Passed: compiler/loopopts/superword/TestDependencyOffsets.java#avx1-v016-U │ │ │ │ Passed: compiler/loopopts/superword/TestDependencyOffsets.java#avx1-v032-A │ │ │ │ Passed: compiler/loopopts/superword/TestDependencyOffsets.java#avx1-v032-U │ │ │ │ Passed: compiler/loopopts/superword/TestDependencyOffsets.java#avx2-v016-A │ │ │ │ Passed: compiler/loopopts/superword/TestDependencyOffsets.java#avx2-v016-U │ │ │ │ Passed: compiler/loopopts/superword/TestDependencyOffsets.java#avx2-v032-A │ │ │ │ Passed: compiler/loopopts/superword/TestDependencyOffsets.java#avx2-v032-U │ │ │ │ -Passed: compiler/loopopts/superword/TestDependencyOffsets.java#avx512bw-v032-A │ │ │ │ -Passed: compiler/loopopts/superword/TestDependencyOffsets.java#avx512bw-v032-U │ │ │ │ -Passed: compiler/loopopts/superword/TestDependencyOffsets.java#avx512bw-v064-A │ │ │ │ -Passed: compiler/loopopts/superword/TestDependencyOffsets.java#avx512bw-v064-U │ │ │ │ -Passed: compiler/loopopts/superword/TestDependencyOffsets.java#avx512-v032-A │ │ │ │ -Passed: compiler/loopopts/superword/TestDependencyOffsets.java#avx512-v032-U │ │ │ │ -Passed: compiler/loopopts/superword/TestDependencyOffsets.java#avx512-v064-A │ │ │ │ -Passed: compiler/loopopts/superword/TestDependencyOffsets.java#avx512-v064-U │ │ │ │ Passed: compiler/loopopts/superword/TestDependencyOffsets.java#sse4-v002-A │ │ │ │ Passed: compiler/loopopts/superword/TestDependencyOffsets.java#sse4-v002-U │ │ │ │ Passed: compiler/loopopts/superword/TestDependencyOffsets.java#sse4-v004-A │ │ │ │ Passed: compiler/loopopts/superword/TestDependencyOffsets.java#sse4-v004-U │ │ │ │ Passed: compiler/loopopts/superword/TestDependencyOffsets.java#sse4-v008-A │ │ │ │ Passed: compiler/loopopts/superword/TestDependencyOffsets.java#sse4-v008-U │ │ │ │ Passed: compiler/loopopts/superword/TestDependencyOffsets.java#sse4-v016-A │ │ │ │ @@ -1822,15 +1809,14 @@ │ │ │ │ Passed: compiler/vectorization/TestMemoryVectorMismatched.java │ │ │ │ Passed: compiler/vectorization/TestNaNVector.java │ │ │ │ Passed: compiler/vectorization/TestNarrowedIntegerReverseBytes.java │ │ │ │ Passed: compiler/vectorization/TestOptionVectorize.java │ │ │ │ Passed: compiler/vectorization/TestOptionVectorizeIR.java │ │ │ │ Passed: compiler/vectorization/TestOverlappingMismatchedAccesses.java │ │ │ │ Passed: compiler/vectorization/TestPopCountVector.java │ │ │ │ -Passed: compiler/vectorization/TestPopCountVectorLong.java │ │ │ │ Passed: compiler/vectorization/TestReplicateLoopIV.java │ │ │ │ Passed: compiler/vectorization/TestRotateByteAndShortVector.java │ │ │ │ Passed: compiler/vectorization/TestSmallVectorPopIndex.java │ │ │ │ Passed: compiler/vectorization/TestSubwordReverseBytes.java │ │ │ │ Passed: compiler/vectorization/TestUnexpectedLoadOrdering.java │ │ │ │ Passed: compiler/vectorization/TestVectorsNotSavedAtSafepoint.java │ │ │ │ Passed: compiler/vectorization/TestVectorUnalignedOffset.java │ │ │ │ @@ -2822,14 +2808,14 @@ │ │ │ │ Passed: serviceability/tmtools/jstat/GcCapacityTest.java │ │ │ │ Passed: serviceability/tmtools/jstat/GcCauseTest01.java │ │ │ │ Passed: serviceability/tmtools/jstat/GcCauseTest02.java │ │ │ │ Passed: serviceability/tmtools/jstat/GcCauseTest03.java │ │ │ │ Passed: serviceability/tmtools/jstat/GcNewTest.java │ │ │ │ Passed: serviceability/tmtools/jstat/GcTest01.java │ │ │ │ Passed: serviceability/tmtools/jstat/GcTest02.java │ │ │ │ -Test results: passed: 2,826; skipped: 7; excluded: 45; did not match keywords: 75; did not meet module requirements: 85; did not meet platform requirements: 415 │ │ │ │ +Test results: passed: 2,812; skipped: 7; excluded: 45; did not match keywords: 75; did not meet module requirements: 85; did not meet platform requirements: 429 │ │ │ │ Framework-based tests: 437 = 408 TestNG + 29 JUnit │ │ │ │ Report written to /build/reproducible-path/openjdk-21-21.0.13+9/jtreg-test-output/hotspot/0/JTreport/html/report.html │ │ │ │ Results written to /tmp/hotspot/JTwork │ │ │ │ [debian/tests/jtreg-autopkgtest.sh] nothing to cleanup │ │ │ │ Unable to compare jtreg results: no build jtreport found for hotspot/i386. │ │ │ │ Reason: '/usr/share/doc/openjdk-21-jre-headless//test-i386/jtreport-hotspot.tar.gz' does not exist. │ │ ├── ./usr/share/doc/openjdk-21-jre-headless/test-i386/failed_tests-hotspot.tar.gz │ │ │ ├── failed_tests-hotspot.tar │ │ │ │ ├── file list │ │ │ │ │ @@ -1,9 +1,9 @@ │ │ │ │ │ --rw-r--r-- 0 sbuild (999) sbuild (999) 6754 2026-10-22 15:16:19.000000 jtreg-test-output/jdk/JTwork/java/net/MulticastSocket/B6427403.jtr │ │ │ │ │ --rw-r--r-- 0 sbuild (999) sbuild (999) 7771 2026-10-22 15:16:19.000000 jtreg-test-output/jdk/JTwork/java/net/MulticastSocket/NoLoopbackPackets.jtr │ │ │ │ │ --rw-r--r-- 0 sbuild (999) sbuild (999) 7779 2026-10-22 15:16:19.000000 jtreg-test-output/jdk/JTwork/java/net/MulticastSocket/Promiscuous.jtr │ │ │ │ │ --rw-r--r-- 0 sbuild (999) sbuild (999) 8395 2026-10-22 15:16:20.000000 jtreg-test-output/jdk/JTwork/java/net/MulticastSocket/SetLoopbackMode.jtr │ │ │ │ │ --rw-r--r-- 0 sbuild (999) sbuild (999) 8812 2026-10-22 15:16:20.000000 jtreg-test-output/jdk/JTwork/java/net/MulticastSocket/SetLoopbackModeIPv4.jtr │ │ │ │ │ --rw-r--r-- 0 sbuild (999) sbuild (999) 9665 2026-10-22 15:16:20.000000 jtreg-test-output/jdk/JTwork/java/net/MulticastSocket/Test.jtr │ │ │ │ │ --rw-r--r-- 0 sbuild (999) sbuild (999) 7417 2026-10-22 15:16:20.000000 jtreg-test-output/jdk/JTwork/java/net/SocketOption/OptionsTest.jtr │ │ │ │ │ --rw-r--r-- 0 sbuild (999) sbuild (999) 15100 2026-10-22 15:16:22.000000 jtreg-test-output/jdk/JTwork/java/net/SocketPermission/SocketPermissionTest.jtr │ │ │ │ │ --rw-r--r-- 0 sbuild (999) sbuild (999) 25655 2026-10-22 15:16:27.000000 jtreg-test-output/jdk/JTwork/sun/security/krb5/auto/Addresses.jtr │ │ │ │ │ +-rw-r--r-- 0 sbuild (999) sbuild (999) 6753 2026-10-27 17:13:19.000000 jtreg-test-output/jdk/JTwork/java/net/MulticastSocket/B6427403.jtr │ │ │ │ │ +-rw-r--r-- 0 sbuild (999) sbuild (999) 7769 2026-10-27 17:13:19.000000 jtreg-test-output/jdk/JTwork/java/net/MulticastSocket/NoLoopbackPackets.jtr │ │ │ │ │ +-rw-r--r-- 0 sbuild (999) sbuild (999) 7778 2026-10-27 17:13:19.000000 jtreg-test-output/jdk/JTwork/java/net/MulticastSocket/Promiscuous.jtr │ │ │ │ │ +-rw-r--r-- 0 sbuild (999) sbuild (999) 8394 2026-10-27 17:13:20.000000 jtreg-test-output/jdk/JTwork/java/net/MulticastSocket/SetLoopbackMode.jtr │ │ │ │ │ +-rw-r--r-- 0 sbuild (999) sbuild (999) 8809 2026-10-27 17:13:20.000000 jtreg-test-output/jdk/JTwork/java/net/MulticastSocket/SetLoopbackModeIPv4.jtr │ │ │ │ │ +-rw-r--r-- 0 sbuild (999) sbuild (999) 9666 2026-10-27 17:13:20.000000 jtreg-test-output/jdk/JTwork/java/net/MulticastSocket/Test.jtr │ │ │ │ │ +-rw-r--r-- 0 sbuild (999) sbuild (999) 7417 2026-10-27 17:13:20.000000 jtreg-test-output/jdk/JTwork/java/net/SocketOption/OptionsTest.jtr │ │ │ │ │ +-rw-r--r-- 0 sbuild (999) sbuild (999) 15100 2026-10-27 17:13:22.000000 jtreg-test-output/jdk/JTwork/java/net/SocketPermission/SocketPermissionTest.jtr │ │ │ │ │ +-rw-r--r-- 0 sbuild (999) sbuild (999) 25653 2026-10-27 17:13:27.000000 jtreg-test-output/jdk/JTwork/sun/security/krb5/auto/Addresses.jtr │ │ │ │ ├── jtreg-test-output/jdk/JTwork/java/net/MulticastSocket/B6427403.jtr │ │ │ │ │ @@ -1,70 +1,70 @@ │ │ │ │ │ #Test Results (version 2) │ │ │ │ │ -#Thu Oct 22 15:16:19 UTC 2026 │ │ │ │ │ +#Tue Oct 27 17:13:19 UTC 2026 │ │ │ │ │ #-----testdescription----- │ │ │ │ │ $file=/build/reproducible-path/openjdk-21-21.0.13+9/test/jdk/java/net/MulticastSocket/B6427403.java │ │ │ │ │ $root=/build/reproducible-path/openjdk-21-21.0.13+9/test/jdk │ │ │ │ │ keywords=bug6427403 │ │ │ │ │ run=USER_SPECIFIED main B6427403\n │ │ │ │ │ source=B6427403.java │ │ │ │ │ title=java.net.MulticastSocket.joinGroup() reports 'socket closed' │ │ │ │ │ │ │ │ │ │ #-----environment----- │ │ │ │ │ │ │ │ │ │ #-----testresult----- │ │ │ │ │ description=file\:/build/reproducible-path/openjdk-21-21.0.13+9/test/jdk/java/net/MulticastSocket/B6427403.java │ │ │ │ │ -elapsed=699 0\:00\:00.699 │ │ │ │ │ -end=Thu Oct 22 15\:16\:19 UTC 2026 │ │ │ │ │ +elapsed=727 0\:00\:00.727 │ │ │ │ │ +end=Tue Oct 27 17\:13\:19 UTC 2026 │ │ │ │ │ environment=regtest │ │ │ │ │ execStatus=Failed. Execution failed\: `main' threw exception\: java.net.SocketException\: No such device (setsockopt failed) │ │ │ │ │ harnessLoaderMode=Classpath Loader │ │ │ │ │ harnessVariety=Full Bundle │ │ │ │ │ hostname=sbuild │ │ │ │ │ javatestOS=Linux 6.12.113+deb13-amd64 (i386) │ │ │ │ │ javatestVersion=6.0-ea+b26-2026-03-18-${BUILT_FROM_COMMIT} │ │ │ │ │ jtregVersion=jtreg 8.3 src 1 │ │ │ │ │ script=com.sun.javatest.regtest.exec.RegressionScript │ │ │ │ │ sections=script_messages build main │ │ │ │ │ -start=Thu Oct 22 15\:16\:18 UTC 2026 │ │ │ │ │ +start=Tue Oct 27 17\:13\:18 UTC 2026 │ │ │ │ │ test=java/net/MulticastSocket/B6427403.java │ │ │ │ │ testJDK=/build/reproducible-path/openjdk-21-21.0.13+9/build/bootcycle-build/images/jdk │ │ │ │ │ -testJDK_OS=[name\:Linux,arch\:i386,version\:6.12.113+deb13-amd64,family\:linux,simple_arch\:i586,simple_version\:6.12,processors\:6,maxMemory\:16773832704,maxSwap\:182536105984] │ │ │ │ │ +testJDK_OS=[name\:Linux,arch\:i386,version\:6.12.113+deb13-amd64,family\:linux,simple_arch\:i586,simple_version\:6.12,processors\:8,maxMemory\:16775352320,maxSwap\:34358685696] │ │ │ │ │ testJDK_os.arch=i386 │ │ │ │ │ testJDK_os.name=Linux │ │ │ │ │ testJDK_os.version=6.12.113+deb13-amd64 │ │ │ │ │ -totalTime=704 │ │ │ │ │ +totalTime=735 │ │ │ │ │ user.name=sbuild │ │ │ │ │ work=/tmp/jdk/JTwork/java/net/MulticastSocket │ │ │ │ │ │ │ │ │ │ #section:script_messages │ │ │ │ │ ----------messages:(4/253)---------- │ │ │ │ │ JDK under test: /build/reproducible-path/openjdk-21-21.0.13+9/build/bootcycle-build/images/jdk │ │ │ │ │ openjdk version "21.0.13" 2026-10-20 │ │ │ │ │ OpenJDK Runtime Environment (build 21.0.13+9-1-Debian) │ │ │ │ │ OpenJDK Server VM (build 21.0.13+9-1-Debian, mixed mode, sharing) │ │ │ │ │ │ │ │ │ │ #section:build │ │ │ │ │ ----------messages:(5/178)---------- │ │ │ │ │ command: build B6427403 │ │ │ │ │ reason: Named class compiled on demand │ │ │ │ │ -started: Thu Oct 22 15:16:19.117 UTC 2026 │ │ │ │ │ -finished: Thu Oct 22 15:16:19.131 UTC 2026 │ │ │ │ │ -elapsed time (seconds): 0.014 │ │ │ │ │ +started: Tue Oct 27 17:13:19.113 UTC 2026 │ │ │ │ │ +finished: Tue Oct 27 17:13:19.128 UTC 2026 │ │ │ │ │ +elapsed time (seconds): 0.015 │ │ │ │ │ result: Passed. All files up to date │ │ │ │ │ │ │ │ │ │ #section:main │ │ │ │ │ ----------messages:(8/234)---------- │ │ │ │ │ command: main B6427403 │ │ │ │ │ reason: User specified action: run main B6427403 │ │ │ │ │ -started: Thu Oct 22 15:16:19.133 UTC 2026 │ │ │ │ │ +started: Tue Oct 27 17:13:19.129 UTC 2026 │ │ │ │ │ Mode: agentvm │ │ │ │ │ Agent id: 1 │ │ │ │ │ -Process id: 3625065 │ │ │ │ │ -finished: Thu Oct 22 15:16:19.694 UTC 2026 │ │ │ │ │ -elapsed time (seconds): 0.561 │ │ │ │ │ +Process id: 3620584 │ │ │ │ │ +finished: Tue Oct 27 17:13:19.682 UTC 2026 │ │ │ │ │ +elapsed time (seconds): 0.553 │ │ │ │ │ ----------configuration:(15/666)---------- │ │ │ │ │ Boot Layer │ │ │ │ │ class path: /usr/share/jtreg/lib/javatest.jar │ │ │ │ │ /usr/share/jtreg/lib/jtreg.jar │ │ │ │ │ /usr/share/jtreg/lib/junit-platform-console-standalone.jar │ │ │ │ │ /usr/share/jtreg/lib/testng.jar │ │ │ │ │ /usr/share/jtreg/lib/guice.jar │ │ │ │ ├── jtreg-test-output/jdk/JTwork/java/net/MulticastSocket/NoLoopbackPackets.jtr │ │ │ │ │ @@ -1,43 +1,43 @@ │ │ │ │ │ #Test Results (version 2) │ │ │ │ │ -#Thu Oct 22 15:16:19 UTC 2026 │ │ │ │ │ +#Tue Oct 27 17:13:19 UTC 2026 │ │ │ │ │ #-----testdescription----- │ │ │ │ │ $file=/build/reproducible-path/openjdk-21-21.0.13+9/test/jdk/java/net/MulticastSocket/NoLoopbackPackets.java │ │ │ │ │ $root=/build/reproducible-path/openjdk-21-21.0.13+9/test/jdk │ │ │ │ │ keywords=bug4742177 │ │ │ │ │ library=/test/lib │ │ │ │ │ requires=os.family \!\= "windows" │ │ │ │ │ run=ASSUMED_ACTION main NoLoopbackPackets\n │ │ │ │ │ source=NoLoopbackPackets.java │ │ │ │ │ title=Re-test IPv6 (and specifically MulticastSocket) with latest Linux & USAGI code │ │ │ │ │ │ │ │ │ │ #-----environment----- │ │ │ │ │ │ │ │ │ │ #-----testresult----- │ │ │ │ │ description=file\:/build/reproducible-path/openjdk-21-21.0.13+9/test/jdk/java/net/MulticastSocket/NoLoopbackPackets.java │ │ │ │ │ -elapsed=90 0\:00\:00.090 │ │ │ │ │ -end=Thu Oct 22 15\:16\:19 UTC 2026 │ │ │ │ │ +elapsed=88 0\:00\:00.088 │ │ │ │ │ +end=Tue Oct 27 17\:13\:19 UTC 2026 │ │ │ │ │ environment=regtest │ │ │ │ │ execStatus=Failed. Execution failed\: `main' threw exception\: java.net.SocketException\: No such device (setsockopt failed) │ │ │ │ │ harnessLoaderMode=Classpath Loader │ │ │ │ │ harnessVariety=Full Bundle │ │ │ │ │ hostname=sbuild │ │ │ │ │ javatestOS=Linux 6.12.113+deb13-amd64 (i386) │ │ │ │ │ javatestVersion=6.0-ea+b26-2026-03-18-${BUILT_FROM_COMMIT} │ │ │ │ │ jtregVersion=jtreg 8.3 src 1 │ │ │ │ │ script=com.sun.javatest.regtest.exec.RegressionScript │ │ │ │ │ sections=script_messages build main │ │ │ │ │ -start=Thu Oct 22 15\:16\:19 UTC 2026 │ │ │ │ │ +start=Tue Oct 27 17\:13\:19 UTC 2026 │ │ │ │ │ test=java/net/MulticastSocket/NoLoopbackPackets.java │ │ │ │ │ testJDK=/build/reproducible-path/openjdk-21-21.0.13+9/build/bootcycle-build/images/jdk │ │ │ │ │ -testJDK_OS=[name\:Linux,arch\:i386,version\:6.12.113+deb13-amd64,family\:linux,simple_arch\:i586,simple_version\:6.12,processors\:6,maxMemory\:16773832704,maxSwap\:182536105984] │ │ │ │ │ +testJDK_OS=[name\:Linux,arch\:i386,version\:6.12.113+deb13-amd64,family\:linux,simple_arch\:i586,simple_version\:6.12,processors\:8,maxMemory\:16775352320,maxSwap\:34358685696] │ │ │ │ │ testJDK_os.arch=i386 │ │ │ │ │ testJDK_os.name=Linux │ │ │ │ │ testJDK_os.version=6.12.113+deb13-amd64 │ │ │ │ │ -totalTime=94 │ │ │ │ │ +totalTime=89 │ │ │ │ │ user.name=sbuild │ │ │ │ │ work=/tmp/jdk/JTwork/java/net/MulticastSocket │ │ │ │ │ │ │ │ │ │ #section:script_messages │ │ │ │ │ ----------messages:(7/461)---------- │ │ │ │ │ JDK under test: /build/reproducible-path/openjdk-21-21.0.13+9/build/bootcycle-build/images/jdk │ │ │ │ │ openjdk version "21.0.13" 2026-10-20 │ │ │ │ │ @@ -47,29 +47,29 @@ │ │ │ │ │ source directory: /build/reproducible-path/openjdk-21-21.0.13+9/test/lib │ │ │ │ │ class directory: /tmp/jdk/JTwork/classes/java/net/MulticastSocket/NoLoopbackPackets.d/test/lib │ │ │ │ │ │ │ │ │ │ #section:build │ │ │ │ │ ----------messages:(5/185)---------- │ │ │ │ │ command: build NoLoopbackPackets │ │ │ │ │ reason: Named class compiled on demand │ │ │ │ │ -started: Thu Oct 22 15:16:19.709 UTC 2026 │ │ │ │ │ -finished: Thu Oct 22 15:16:19.709 UTC 2026 │ │ │ │ │ +started: Tue Oct 27 17:13:19.700 UTC 2026 │ │ │ │ │ +finished: Tue Oct 27 17:13:19.700 UTC 2026 │ │ │ │ │ elapsed time (seconds): 0.0 │ │ │ │ │ result: Passed. All files up to date │ │ │ │ │ │ │ │ │ │ #section:main │ │ │ │ │ -----------messages:(8/264)---------- │ │ │ │ │ +----------messages:(8/263)---------- │ │ │ │ │ command: main NoLoopbackPackets │ │ │ │ │ reason: Assumed action based on file name: run main NoLoopbackPackets │ │ │ │ │ -started: Thu Oct 22 15:16:19.709 UTC 2026 │ │ │ │ │ +started: Tue Oct 27 17:13:19.701 UTC 2026 │ │ │ │ │ Mode: agentvm │ │ │ │ │ Agent id: 1 │ │ │ │ │ -Process id: 3625065 │ │ │ │ │ -finished: Thu Oct 22 15:16:19.796 UTC 2026 │ │ │ │ │ -elapsed time (seconds): 0.087 │ │ │ │ │ +Process id: 3620584 │ │ │ │ │ +finished: Tue Oct 27 17:13:19.781 UTC 2026 │ │ │ │ │ +elapsed time (seconds): 0.08 │ │ │ │ │ ----------configuration:(17/836)---------- │ │ │ │ │ Boot Layer │ │ │ │ │ class path: /usr/share/jtreg/lib/javatest.jar │ │ │ │ │ /usr/share/jtreg/lib/jtreg.jar │ │ │ │ │ /usr/share/jtreg/lib/junit-platform-console-standalone.jar │ │ │ │ │ /usr/share/jtreg/lib/testng.jar │ │ │ │ │ /usr/share/jtreg/lib/guice.jar │ │ │ │ │ @@ -113,15 +113,15 @@ │ │ │ │ │ -Dtest.class.path=/tmp/jdk/JTwork/classes/java/net/MulticastSocket/NoLoopbackPackets.d:/tmp/jdk/JTwork/classes/java/net/MulticastSocket/NoLoopbackPackets.d/test/lib \\ │ │ │ │ │ -Dtest.class.path.prefix=/tmp/jdk/JTwork/classes/java/net/MulticastSocket/NoLoopbackPackets.d:/build/reproducible-path/openjdk-21-21.0.13+9/test/jdk/java/net/MulticastSocket:/tmp/jdk/JTwork/classes/java/net/MulticastSocket/NoLoopbackPackets.d/test/lib \\ │ │ │ │ │ -classpath /tmp/jdk/JTwork/classes/java/net/MulticastSocket/NoLoopbackPackets.d:/build/reproducible-path/openjdk-21-21.0.13+9/test/jdk/java/net/MulticastSocket:/tmp/jdk/JTwork/classes/java/net/MulticastSocket/NoLoopbackPackets.d/test/lib:/build/reproducible-path/openjdk-21-21.0.13+9/test/lib:/usr/share/jtreg/lib/javatest.jar:/usr/share/jtreg/lib/jtreg.jar \\ │ │ │ │ │ NoLoopbackPackets │ │ │ │ │ ----------stdout:(0/0)---------- │ │ │ │ │ ----------stderr:(0/0)---------- │ │ │ │ │ ----------System.out:(1/32)---------- │ │ │ │ │ -joining group: /224.1.1.1:52284 │ │ │ │ │ +joining group: /224.1.1.1:48611 │ │ │ │ │ ----------System.err:(17/1050)---------- │ │ │ │ │ java.net.SocketException: No such device (setsockopt failed) │ │ │ │ │ at java.base/sun.nio.ch.Net.joinOrDrop4(Native Method) │ │ │ │ │ at java.base/sun.nio.ch.Net.join4(Net.java:720) │ │ │ │ │ at java.base/sun.nio.ch.DatagramChannelImpl.innerJoin(DatagramChannelImpl.java:1676) │ │ │ │ │ at java.base/sun.nio.ch.DatagramChannelImpl.join(DatagramChannelImpl.java:1694) │ │ │ │ │ at java.base/sun.nio.ch.DatagramSocketAdaptor.joinGroup(DatagramSocketAdaptor.java:494) │ │ │ │ ├── jtreg-test-output/jdk/JTwork/java/net/MulticastSocket/Promiscuous.jtr │ │ │ │ │ @@ -1,42 +1,42 @@ │ │ │ │ │ #Test Results (version 2) │ │ │ │ │ -#Thu Oct 22 15:16:19 UTC 2026 │ │ │ │ │ +#Tue Oct 27 17:13:19 UTC 2026 │ │ │ │ │ #-----testdescription----- │ │ │ │ │ $file=/build/reproducible-path/openjdk-21-21.0.13+9/test/jdk/java/net/MulticastSocket/Promiscuous.java │ │ │ │ │ $root=/build/reproducible-path/openjdk-21-21.0.13+9/test/jdk │ │ │ │ │ keywords=bug8014499 bug8219804 othervm │ │ │ │ │ library=/test/lib │ │ │ │ │ run=USER_SPECIFIED main Promiscuous\nUSER_SPECIFIED main/othervm -Djava.net.preferIPv4Stack\=true Promiscuous\n │ │ │ │ │ source=Promiscuous.java │ │ │ │ │ title=Test for interference when two sockets are bound to the same port but joined to different multicast groups │ │ │ │ │ │ │ │ │ │ #-----environment----- │ │ │ │ │ │ │ │ │ │ #-----testresult----- │ │ │ │ │ description=file\:/build/reproducible-path/openjdk-21-21.0.13+9/test/jdk/java/net/MulticastSocket/Promiscuous.java │ │ │ │ │ -elapsed=117 0\:00\:00.117 │ │ │ │ │ -end=Thu Oct 22 15\:16\:19 UTC 2026 │ │ │ │ │ +elapsed=127 0\:00\:00.127 │ │ │ │ │ +end=Tue Oct 27 17\:13\:19 UTC 2026 │ │ │ │ │ environment=regtest │ │ │ │ │ execStatus=Failed. Execution failed\: `main' threw exception\: java.net.SocketException\: Network is unreachable │ │ │ │ │ harnessLoaderMode=Classpath Loader │ │ │ │ │ harnessVariety=Full Bundle │ │ │ │ │ hostname=sbuild │ │ │ │ │ javatestOS=Linux 6.12.113+deb13-amd64 (i386) │ │ │ │ │ javatestVersion=6.0-ea+b26-2026-03-18-${BUILT_FROM_COMMIT} │ │ │ │ │ jtregVersion=jtreg 8.3 src 1 │ │ │ │ │ script=com.sun.javatest.regtest.exec.RegressionScript │ │ │ │ │ sections=script_messages build main │ │ │ │ │ -start=Thu Oct 22 15\:16\:19 UTC 2026 │ │ │ │ │ +start=Tue Oct 27 17\:13\:19 UTC 2026 │ │ │ │ │ test=java/net/MulticastSocket/Promiscuous.java │ │ │ │ │ testJDK=/build/reproducible-path/openjdk-21-21.0.13+9/build/bootcycle-build/images/jdk │ │ │ │ │ -testJDK_OS=[name\:Linux,arch\:i386,version\:6.12.113+deb13-amd64,family\:linux,simple_arch\:i586,simple_version\:6.12,processors\:6,maxMemory\:16773832704,maxSwap\:182536105984] │ │ │ │ │ +testJDK_OS=[name\:Linux,arch\:i386,version\:6.12.113+deb13-amd64,family\:linux,simple_arch\:i586,simple_version\:6.12,processors\:8,maxMemory\:16775352320,maxSwap\:34358685696] │ │ │ │ │ testJDK_os.arch=i386 │ │ │ │ │ testJDK_os.name=Linux │ │ │ │ │ testJDK_os.version=6.12.113+deb13-amd64 │ │ │ │ │ -totalTime=118 │ │ │ │ │ +totalTime=129 │ │ │ │ │ user.name=sbuild │ │ │ │ │ work=/tmp/jdk/JTwork/java/net/MulticastSocket │ │ │ │ │ │ │ │ │ │ #section:script_messages │ │ │ │ │ ----------messages:(7/455)---------- │ │ │ │ │ JDK under test: /build/reproducible-path/openjdk-21-21.0.13+9/build/bootcycle-build/images/jdk │ │ │ │ │ openjdk version "21.0.13" 2026-10-20 │ │ │ │ │ @@ -46,29 +46,29 @@ │ │ │ │ │ source directory: /build/reproducible-path/openjdk-21-21.0.13+9/test/lib │ │ │ │ │ class directory: /tmp/jdk/JTwork/classes/java/net/MulticastSocket/Promiscuous.d/test/lib │ │ │ │ │ │ │ │ │ │ #section:build │ │ │ │ │ ----------messages:(5/179)---------- │ │ │ │ │ command: build Promiscuous │ │ │ │ │ reason: Named class compiled on demand │ │ │ │ │ -started: Thu Oct 22 15:16:19.809 UTC 2026 │ │ │ │ │ -finished: Thu Oct 22 15:16:19.809 UTC 2026 │ │ │ │ │ +started: Tue Oct 27 17:13:19.788 UTC 2026 │ │ │ │ │ +finished: Tue Oct 27 17:13:19.788 UTC 2026 │ │ │ │ │ elapsed time (seconds): 0.0 │ │ │ │ │ result: Passed. All files up to date │ │ │ │ │ │ │ │ │ │ #section:main │ │ │ │ │ ----------messages:(8/240)---------- │ │ │ │ │ command: main Promiscuous │ │ │ │ │ reason: User specified action: run main Promiscuous │ │ │ │ │ -started: Thu Oct 22 15:16:19.809 UTC 2026 │ │ │ │ │ +started: Tue Oct 27 17:13:19.789 UTC 2026 │ │ │ │ │ Mode: agentvm │ │ │ │ │ Agent id: 1 │ │ │ │ │ -Process id: 3625065 │ │ │ │ │ -finished: Thu Oct 22 15:16:19.923 UTC 2026 │ │ │ │ │ -elapsed time (seconds): 0.114 │ │ │ │ │ +Process id: 3620584 │ │ │ │ │ +finished: Tue Oct 27 17:13:19.913 UTC 2026 │ │ │ │ │ +elapsed time (seconds): 0.124 │ │ │ │ │ ----------configuration:(17/824)---------- │ │ │ │ │ Boot Layer │ │ │ │ │ class path: /usr/share/jtreg/lib/javatest.jar │ │ │ │ │ /usr/share/jtreg/lib/jtreg.jar │ │ │ │ │ /usr/share/jtreg/lib/junit-platform-console-standalone.jar │ │ │ │ │ /usr/share/jtreg/lib/testng.jar │ │ │ │ │ /usr/share/jtreg/lib/guice.jar │ │ │ │ │ @@ -112,16 +112,16 @@ │ │ │ │ │ -Dtest.class.path=/tmp/jdk/JTwork/classes/java/net/MulticastSocket/Promiscuous.d:/tmp/jdk/JTwork/classes/java/net/MulticastSocket/Promiscuous.d/test/lib \\ │ │ │ │ │ -Dtest.class.path.prefix=/tmp/jdk/JTwork/classes/java/net/MulticastSocket/Promiscuous.d:/build/reproducible-path/openjdk-21-21.0.13+9/test/jdk/java/net/MulticastSocket:/tmp/jdk/JTwork/classes/java/net/MulticastSocket/Promiscuous.d/test/lib \\ │ │ │ │ │ -classpath /tmp/jdk/JTwork/classes/java/net/MulticastSocket/Promiscuous.d:/build/reproducible-path/openjdk-21-21.0.13+9/test/jdk/java/net/MulticastSocket:/tmp/jdk/JTwork/classes/java/net/MulticastSocket/Promiscuous.d/test/lib:/build/reproducible-path/openjdk-21-21.0.13+9/test/lib:/usr/share/jtreg/lib/javatest.jar:/usr/share/jtreg/lib/jtreg.jar \\ │ │ │ │ │ Promiscuous │ │ │ │ │ ----------stdout:(0/0)---------- │ │ │ │ │ ----------stderr:(0/0)---------- │ │ │ │ │ ----------System.out:(2/58)---------- │ │ │ │ │ -Using port: 49428 │ │ │ │ │ -Sending datagram to: /224.1.1.120/49428 │ │ │ │ │ +Using port: 48126 │ │ │ │ │ +Sending datagram to: /224.1.1.120/48126 │ │ │ │ │ ----------System.err:(18/1123)---------- │ │ │ │ │ java.net.SocketException: Network is unreachable │ │ │ │ │ at java.base/sun.nio.ch.DatagramChannelImpl.send0(Native Method) │ │ │ │ │ at java.base/sun.nio.ch.DatagramChannelImpl.sendFromNativeBuffer(DatagramChannelImpl.java:1005) │ │ │ │ │ at java.base/sun.nio.ch.DatagramChannelImpl.send(DatagramChannelImpl.java:966) │ │ │ │ │ at java.base/sun.nio.ch.DatagramChannelImpl.send(DatagramChannelImpl.java:889) │ │ │ │ │ at java.base/sun.nio.ch.DatagramChannelImpl.blockingSend(DatagramChannelImpl.java:952) │ │ │ │ ├── jtreg-test-output/jdk/JTwork/java/net/MulticastSocket/SetLoopbackMode.jtr │ │ │ │ │ @@ -1,85 +1,85 @@ │ │ │ │ │ #Test Results (version 2) │ │ │ │ │ -#Thu Oct 22 15:16:20 UTC 2026 │ │ │ │ │ +#Tue Oct 27 17:13:20 UTC 2026 │ │ │ │ │ #-----testdescription----- │ │ │ │ │ $file=/build/reproducible-path/openjdk-21-21.0.13+9/test/jdk/java/net/MulticastSocket/SetLoopbackMode.java │ │ │ │ │ $root=/build/reproducible-path/openjdk-21-21.0.13+9/test/jdk │ │ │ │ │ keywords=bug4686717 othervm │ │ │ │ │ library=/test/lib │ │ │ │ │ modules=java.base/java.net\:+open │ │ │ │ │ run=USER_SPECIFIED build jdk.test.lib.NetworkConfiguration jdk.test.lib.Platform\nUSER_SPECIFIED main/othervm SetLoopbackMode\n │ │ │ │ │ source=SetLoopbackMode.java │ │ │ │ │ title=Test MulticastSocket.setLoopbackMode │ │ │ │ │ │ │ │ │ │ #-----environment----- │ │ │ │ │ │ │ │ │ │ #-----testresult----- │ │ │ │ │ description=file\:/build/reproducible-path/openjdk-21-21.0.13+9/test/jdk/java/net/MulticastSocket/SetLoopbackMode.java │ │ │ │ │ -elapsed=189 0\:00\:00.189 │ │ │ │ │ -end=Thu Oct 22 15\:16\:20 UTC 2026 │ │ │ │ │ +elapsed=228 0\:00\:00.228 │ │ │ │ │ +end=Tue Oct 27 17\:13\:20 UTC 2026 │ │ │ │ │ environment=regtest │ │ │ │ │ execStatus=Failed. Execution failed\: `main' threw exception\: java.net.SocketException\: No such device (setsockopt failed) │ │ │ │ │ harnessLoaderMode=Classpath Loader │ │ │ │ │ harnessVariety=Full Bundle │ │ │ │ │ hostname=sbuild │ │ │ │ │ javatestOS=Linux 6.12.113+deb13-amd64 (i386) │ │ │ │ │ javatestVersion=6.0-ea+b26-2026-03-18-${BUILT_FROM_COMMIT} │ │ │ │ │ jtregVersion=jtreg 8.3 src 1 │ │ │ │ │ modules=java.base/java.net\:+open │ │ │ │ │ script=com.sun.javatest.regtest.exec.RegressionScript │ │ │ │ │ sections=script_messages build build main │ │ │ │ │ -start=Thu Oct 22 15\:16\:19 UTC 2026 │ │ │ │ │ +start=Tue Oct 27 17\:13\:19 UTC 2026 │ │ │ │ │ test=java/net/MulticastSocket/SetLoopbackMode.java │ │ │ │ │ testJDK=/build/reproducible-path/openjdk-21-21.0.13+9/build/bootcycle-build/images/jdk │ │ │ │ │ -testJDK_OS=[name\:Linux,arch\:i386,version\:6.12.113+deb13-amd64,family\:linux,simple_arch\:i586,simple_version\:6.12,processors\:6,maxMemory\:16773832704,maxSwap\:182536105984] │ │ │ │ │ +testJDK_OS=[name\:Linux,arch\:i386,version\:6.12.113+deb13-amd64,family\:linux,simple_arch\:i586,simple_version\:6.12,processors\:8,maxMemory\:16775352320,maxSwap\:34358685696] │ │ │ │ │ testJDK_os.arch=i386 │ │ │ │ │ testJDK_os.name=Linux │ │ │ │ │ testJDK_os.version=6.12.113+deb13-amd64 │ │ │ │ │ -totalTime=190 │ │ │ │ │ +totalTime=230 │ │ │ │ │ user.name=sbuild │ │ │ │ │ work=/tmp/jdk/JTwork/java/net/MulticastSocket │ │ │ │ │ │ │ │ │ │ #section:script_messages │ │ │ │ │ ----------messages:(7/459)---------- │ │ │ │ │ JDK under test: /build/reproducible-path/openjdk-21-21.0.13+9/build/bootcycle-build/images/jdk │ │ │ │ │ openjdk version "21.0.13" 2026-10-20 │ │ │ │ │ OpenJDK Runtime Environment (build 21.0.13+9-1-Debian) │ │ │ │ │ OpenJDK Server VM (build 21.0.13+9-1-Debian, mixed mode, sharing) │ │ │ │ │ Library /test/lib; kind: packages │ │ │ │ │ source directory: /build/reproducible-path/openjdk-21-21.0.13+9/test/lib │ │ │ │ │ class directory: /tmp/jdk/JTwork/classes/java/net/MulticastSocket/SetLoopbackMode.d/test/lib │ │ │ │ │ │ │ │ │ │ #section:build │ │ │ │ │ -----------messages:(5/284)---------- │ │ │ │ │ +----------messages:(5/282)---------- │ │ │ │ │ command: build jdk.test.lib.NetworkConfiguration jdk.test.lib.Platform │ │ │ │ │ reason: User specified action: run build jdk.test.lib.NetworkConfiguration jdk.test.lib.Platform │ │ │ │ │ -started: Thu Oct 22 15:16:19.933 UTC 2026 │ │ │ │ │ -finished: Thu Oct 22 15:16:19.934 UTC 2026 │ │ │ │ │ -elapsed time (seconds): 0.001 │ │ │ │ │ +started: Tue Oct 27 17:13:19.921 UTC 2026 │ │ │ │ │ +finished: Tue Oct 27 17:13:19.921 UTC 2026 │ │ │ │ │ +elapsed time (seconds): 0.0 │ │ │ │ │ result: Passed. All files up to date │ │ │ │ │ │ │ │ │ │ #section:build │ │ │ │ │ -----------messages:(5/183)---------- │ │ │ │ │ +----------messages:(5/185)---------- │ │ │ │ │ command: build SetLoopbackMode │ │ │ │ │ reason: Named class compiled on demand │ │ │ │ │ -started: Thu Oct 22 15:16:19.934 UTC 2026 │ │ │ │ │ -finished: Thu Oct 22 15:16:19.934 UTC 2026 │ │ │ │ │ -elapsed time (seconds): 0.0 │ │ │ │ │ +started: Tue Oct 27 17:13:19.921 UTC 2026 │ │ │ │ │ +finished: Tue Oct 27 17:13:19.922 UTC 2026 │ │ │ │ │ +elapsed time (seconds): 0.001 │ │ │ │ │ result: Passed. All files up to date │ │ │ │ │ │ │ │ │ │ #section:main │ │ │ │ │ ----------messages:(8/411)---------- │ │ │ │ │ command: main SetLoopbackMode │ │ │ │ │ reason: User specified action: run main/othervm SetLoopbackMode │ │ │ │ │ -started: Thu Oct 22 15:16:19.935 UTC 2026 │ │ │ │ │ +started: Tue Oct 27 17:13:19.922 UTC 2026 │ │ │ │ │ Mode: othervm [/othervm specified] │ │ │ │ │ Additional options from @modules: --add-modules java.base --add-exports java.base/java.net=ALL-UNNAMED --add-opens java.base/java.net=ALL-UNNAMED │ │ │ │ │ -Process id: 3625093 │ │ │ │ │ -finished: Thu Oct 22 15:16:20.118 UTC 2026 │ │ │ │ │ -elapsed time (seconds): 0.183 │ │ │ │ │ +Process id: 3620611 │ │ │ │ │ +finished: Tue Oct 27 17:13:20.146 UTC 2026 │ │ │ │ │ +elapsed time (seconds): 0.224 │ │ │ │ │ ----------configuration:(5/139)---------- │ │ │ │ │ Boot Layer │ │ │ │ │ add modules: java.base │ │ │ │ │ add exports: java.base/java.net ALL-UNNAMED │ │ │ │ │ add opens: java.base/java.net ALL-UNNAMED │ │ │ │ │ │ │ │ │ │ ----------System.out:(5/155)---------- │ │ │ │ ├── jtreg-test-output/jdk/JTwork/java/net/MulticastSocket/SetLoopbackModeIPv4.jtr │ │ │ │ │ @@ -1,85 +1,85 @@ │ │ │ │ │ #Test Results (version 2) │ │ │ │ │ -#Thu Oct 22 15:16:20 UTC 2026 │ │ │ │ │ +#Tue Oct 27 17:13:20 UTC 2026 │ │ │ │ │ #-----testdescription----- │ │ │ │ │ $file=/build/reproducible-path/openjdk-21-21.0.13+9/test/jdk/java/net/MulticastSocket/SetLoopbackModeIPv4.java │ │ │ │ │ $root=/build/reproducible-path/openjdk-21-21.0.13+9/test/jdk │ │ │ │ │ keywords=bug4686717 bug8241786 othervm │ │ │ │ │ library=/test/lib │ │ │ │ │ modules=java.base/java.net\:+open │ │ │ │ │ run=USER_SPECIFIED build jdk.test.lib.NetworkConfiguration jdk.test.lib.Platform SetLoopbackMode SetLoopbackModeIPv4\nUSER_SPECIFIED main/othervm -Djava.net.preferIPv4Stack\=true SetLoopbackModeIPv4\n │ │ │ │ │ source=SetLoopbackModeIPv4.java │ │ │ │ │ title=Test MulticastSocket.setLoopbackMode with IPv4 addresses │ │ │ │ │ │ │ │ │ │ #-----environment----- │ │ │ │ │ │ │ │ │ │ #-----testresult----- │ │ │ │ │ description=file\:/build/reproducible-path/openjdk-21-21.0.13+9/test/jdk/java/net/MulticastSocket/SetLoopbackModeIPv4.java │ │ │ │ │ -elapsed=181 0\:00\:00.181 │ │ │ │ │ -end=Thu Oct 22 15\:16\:20 UTC 2026 │ │ │ │ │ +elapsed=178 0\:00\:00.178 │ │ │ │ │ +end=Tue Oct 27 17\:13\:20 UTC 2026 │ │ │ │ │ environment=regtest │ │ │ │ │ execStatus=Failed. Execution failed\: `main' threw exception\: java.net.SocketException\: No such device (setsockopt failed) │ │ │ │ │ harnessLoaderMode=Classpath Loader │ │ │ │ │ harnessVariety=Full Bundle │ │ │ │ │ hostname=sbuild │ │ │ │ │ javatestOS=Linux 6.12.113+deb13-amd64 (i386) │ │ │ │ │ javatestVersion=6.0-ea+b26-2026-03-18-${BUILT_FROM_COMMIT} │ │ │ │ │ jtregVersion=jtreg 8.3 src 1 │ │ │ │ │ modules=java.base/java.net\:+open │ │ │ │ │ script=com.sun.javatest.regtest.exec.RegressionScript │ │ │ │ │ sections=script_messages build build main │ │ │ │ │ -start=Thu Oct 22 15\:16\:20 UTC 2026 │ │ │ │ │ +start=Tue Oct 27 17\:13\:20 UTC 2026 │ │ │ │ │ test=java/net/MulticastSocket/SetLoopbackModeIPv4.java │ │ │ │ │ testJDK=/build/reproducible-path/openjdk-21-21.0.13+9/build/bootcycle-build/images/jdk │ │ │ │ │ -testJDK_OS=[name\:Linux,arch\:i386,version\:6.12.113+deb13-amd64,family\:linux,simple_arch\:i586,simple_version\:6.12,processors\:6,maxMemory\:16773832704,maxSwap\:182536105984] │ │ │ │ │ +testJDK_OS=[name\:Linux,arch\:i386,version\:6.12.113+deb13-amd64,family\:linux,simple_arch\:i586,simple_version\:6.12,processors\:8,maxMemory\:16775352320,maxSwap\:34358685696] │ │ │ │ │ testJDK_os.arch=i386 │ │ │ │ │ testJDK_os.name=Linux │ │ │ │ │ testJDK_os.version=6.12.113+deb13-amd64 │ │ │ │ │ -totalTime=182 │ │ │ │ │ +totalTime=179 │ │ │ │ │ user.name=sbuild │ │ │ │ │ work=/tmp/jdk/JTwork/java/net/MulticastSocket │ │ │ │ │ │ │ │ │ │ #section:script_messages │ │ │ │ │ ----------messages:(7/463)---------- │ │ │ │ │ JDK under test: /build/reproducible-path/openjdk-21-21.0.13+9/build/bootcycle-build/images/jdk │ │ │ │ │ openjdk version "21.0.13" 2026-10-20 │ │ │ │ │ OpenJDK Runtime Environment (build 21.0.13+9-1-Debian) │ │ │ │ │ OpenJDK Server VM (build 21.0.13+9-1-Debian, mixed mode, sharing) │ │ │ │ │ Library /test/lib; kind: packages │ │ │ │ │ source directory: /build/reproducible-path/openjdk-21-21.0.13+9/test/lib │ │ │ │ │ class directory: /tmp/jdk/JTwork/classes/java/net/MulticastSocket/SetLoopbackModeIPv4.d/test/lib │ │ │ │ │ │ │ │ │ │ #section:build │ │ │ │ │ -----------messages:(5/356)---------- │ │ │ │ │ +----------messages:(5/354)---------- │ │ │ │ │ command: build jdk.test.lib.NetworkConfiguration jdk.test.lib.Platform SetLoopbackMode SetLoopbackModeIPv4 │ │ │ │ │ reason: User specified action: run build jdk.test.lib.NetworkConfiguration jdk.test.lib.Platform SetLoopbackMode SetLoopbackModeIPv4 │ │ │ │ │ -started: Thu Oct 22 15:16:20.126 UTC 2026 │ │ │ │ │ -finished: Thu Oct 22 15:16:20.127 UTC 2026 │ │ │ │ │ -elapsed time (seconds): 0.001 │ │ │ │ │ +started: Tue Oct 27 17:13:20.155 UTC 2026 │ │ │ │ │ +finished: Tue Oct 27 17:13:20.155 UTC 2026 │ │ │ │ │ +elapsed time (seconds): 0.0 │ │ │ │ │ result: Passed. All files up to date │ │ │ │ │ │ │ │ │ │ #section:build │ │ │ │ │ ----------messages:(5/187)---------- │ │ │ │ │ command: build SetLoopbackModeIPv4 │ │ │ │ │ reason: Named class compiled on demand │ │ │ │ │ -started: Thu Oct 22 15:16:20.127 UTC 2026 │ │ │ │ │ -finished: Thu Oct 22 15:16:20.127 UTC 2026 │ │ │ │ │ +started: Tue Oct 27 17:13:20.156 UTC 2026 │ │ │ │ │ +finished: Tue Oct 27 17:13:20.156 UTC 2026 │ │ │ │ │ elapsed time (seconds): 0.0 │ │ │ │ │ result: Passed. All files up to date │ │ │ │ │ │ │ │ │ │ #section:main │ │ │ │ │ ----------messages:(8/483)---------- │ │ │ │ │ command: main -Djava.net.preferIPv4Stack=true SetLoopbackModeIPv4 │ │ │ │ │ reason: User specified action: run main/othervm -Djava.net.preferIPv4Stack=true SetLoopbackModeIPv4 │ │ │ │ │ -started: Thu Oct 22 15:16:20.127 UTC 2026 │ │ │ │ │ +started: Tue Oct 27 17:13:20.156 UTC 2026 │ │ │ │ │ Mode: othervm [/othervm specified] │ │ │ │ │ Additional options from @modules: --add-modules java.base --add-exports java.base/java.net=ALL-UNNAMED --add-opens java.base/java.net=ALL-UNNAMED │ │ │ │ │ -Process id: 3625115 │ │ │ │ │ -finished: Thu Oct 22 15:16:20.304 UTC 2026 │ │ │ │ │ -elapsed time (seconds): 0.177 │ │ │ │ │ +Process id: 3620633 │ │ │ │ │ +finished: Tue Oct 27 17:13:20.330 UTC 2026 │ │ │ │ │ +elapsed time (seconds): 0.174 │ │ │ │ │ ----------configuration:(5/139)---------- │ │ │ │ │ Boot Layer │ │ │ │ │ add modules: java.base │ │ │ │ │ add exports: java.base/java.net ALL-UNNAMED │ │ │ │ │ add opens: java.base/java.net ALL-UNNAMED │ │ │ │ │ │ │ │ │ │ ----------System.out:(5/155)---------- │ │ │ │ ├── jtreg-test-output/jdk/JTwork/java/net/MulticastSocket/Test.jtr │ │ │ │ │ @@ -1,83 +1,83 @@ │ │ │ │ │ #Test Results (version 2) │ │ │ │ │ -#Thu Oct 22 15:16:20 UTC 2026 │ │ │ │ │ +#Tue Oct 27 17:13:20 UTC 2026 │ │ │ │ │ #-----testdescription----- │ │ │ │ │ $file=/build/reproducible-path/openjdk-21-21.0.13+9/test/jdk/java/net/MulticastSocket/Test.java │ │ │ │ │ $root=/build/reproducible-path/openjdk-21-21.0.13+9/test/jdk │ │ │ │ │ keywords=bug4488458 othervm │ │ │ │ │ library=/test/lib │ │ │ │ │ run=USER_SPECIFIED build jdk.test.lib.NetworkConfiguration jdk.test.lib.Platform\nUSER_SPECIFIED main Test\nUSER_SPECIFIED main/othervm -Djava.net.preferIPv4Stack\=true Test\n │ │ │ │ │ source=Test.java │ │ │ │ │ title=IPv4 and IPv6 multicasting broken on Linux │ │ │ │ │ │ │ │ │ │ #-----environment----- │ │ │ │ │ │ │ │ │ │ #-----testresult----- │ │ │ │ │ description=file\:/build/reproducible-path/openjdk-21-21.0.13+9/test/jdk/java/net/MulticastSocket/Test.java │ │ │ │ │ -elapsed=80 0\:00\:00.080 │ │ │ │ │ -end=Thu Oct 22 15\:16\:20 UTC 2026 │ │ │ │ │ +elapsed=86 0\:00\:00.086 │ │ │ │ │ +end=Tue Oct 27 17\:13\:20 UTC 2026 │ │ │ │ │ environment=regtest │ │ │ │ │ execStatus=Failed. Execution failed\: `main' threw exception\: java.lang.Exception\: Test failed - see log file for details │ │ │ │ │ harnessLoaderMode=Classpath Loader │ │ │ │ │ harnessVariety=Full Bundle │ │ │ │ │ hostname=sbuild │ │ │ │ │ javatestOS=Linux 6.12.113+deb13-amd64 (i386) │ │ │ │ │ javatestVersion=6.0-ea+b26-2026-03-18-${BUILT_FROM_COMMIT} │ │ │ │ │ jtregVersion=jtreg 8.3 src 1 │ │ │ │ │ script=com.sun.javatest.regtest.exec.RegressionScript │ │ │ │ │ sections=script_messages build build main │ │ │ │ │ -start=Thu Oct 22 15\:16\:20 UTC 2026 │ │ │ │ │ +start=Tue Oct 27 17\:13\:20 UTC 2026 │ │ │ │ │ test=java/net/MulticastSocket/Test.java │ │ │ │ │ testJDK=/build/reproducible-path/openjdk-21-21.0.13+9/build/bootcycle-build/images/jdk │ │ │ │ │ -testJDK_OS=[name\:Linux,arch\:i386,version\:6.12.113+deb13-amd64,family\:linux,simple_arch\:i586,simple_version\:6.12,processors\:6,maxMemory\:16773832704,maxSwap\:182536105984] │ │ │ │ │ +testJDK_OS=[name\:Linux,arch\:i386,version\:6.12.113+deb13-amd64,family\:linux,simple_arch\:i586,simple_version\:6.12,processors\:8,maxMemory\:16775352320,maxSwap\:34358685696] │ │ │ │ │ testJDK_os.arch=i386 │ │ │ │ │ testJDK_os.name=Linux │ │ │ │ │ testJDK_os.version=6.12.113+deb13-amd64 │ │ │ │ │ -totalTime=82 │ │ │ │ │ +totalTime=86 │ │ │ │ │ user.name=sbuild │ │ │ │ │ work=/tmp/jdk/JTwork/java/net/MulticastSocket │ │ │ │ │ │ │ │ │ │ #section:script_messages │ │ │ │ │ ----------messages:(7/448)---------- │ │ │ │ │ JDK under test: /build/reproducible-path/openjdk-21-21.0.13+9/build/bootcycle-build/images/jdk │ │ │ │ │ openjdk version "21.0.13" 2026-10-20 │ │ │ │ │ OpenJDK Runtime Environment (build 21.0.13+9-1-Debian) │ │ │ │ │ OpenJDK Server VM (build 21.0.13+9-1-Debian, mixed mode, sharing) │ │ │ │ │ Library /test/lib; kind: packages │ │ │ │ │ source directory: /build/reproducible-path/openjdk-21-21.0.13+9/test/lib │ │ │ │ │ class directory: /tmp/jdk/JTwork/classes/java/net/MulticastSocket/Test.d/test/lib │ │ │ │ │ │ │ │ │ │ #section:build │ │ │ │ │ -----------messages:(5/282)---------- │ │ │ │ │ +----------messages:(5/284)---------- │ │ │ │ │ command: build jdk.test.lib.NetworkConfiguration jdk.test.lib.Platform │ │ │ │ │ reason: User specified action: run build jdk.test.lib.NetworkConfiguration jdk.test.lib.Platform │ │ │ │ │ -started: Thu Oct 22 15:16:20.311 UTC 2026 │ │ │ │ │ -finished: Thu Oct 22 15:16:20.311 UTC 2026 │ │ │ │ │ -elapsed time (seconds): 0.0 │ │ │ │ │ +started: Tue Oct 27 17:13:20.336 UTC 2026 │ │ │ │ │ +finished: Tue Oct 27 17:13:20.337 UTC 2026 │ │ │ │ │ +elapsed time (seconds): 0.001 │ │ │ │ │ result: Passed. All files up to date │ │ │ │ │ │ │ │ │ │ #section:build │ │ │ │ │ ----------messages:(5/172)---------- │ │ │ │ │ command: build Test │ │ │ │ │ reason: Named class compiled on demand │ │ │ │ │ -started: Thu Oct 22 15:16:20.311 UTC 2026 │ │ │ │ │ -finished: Thu Oct 22 15:16:20.311 UTC 2026 │ │ │ │ │ +started: Tue Oct 27 17:13:20.337 UTC 2026 │ │ │ │ │ +finished: Tue Oct 27 17:13:20.337 UTC 2026 │ │ │ │ │ elapsed time (seconds): 0.0 │ │ │ │ │ result: Passed. All files up to date │ │ │ │ │ │ │ │ │ │ #section:main │ │ │ │ │ ----------messages:(8/226)---------- │ │ │ │ │ command: main Test │ │ │ │ │ reason: User specified action: run main Test │ │ │ │ │ -started: Thu Oct 22 15:16:20.312 UTC 2026 │ │ │ │ │ +started: Tue Oct 27 17:13:20.337 UTC 2026 │ │ │ │ │ Mode: agentvm │ │ │ │ │ Agent id: 1 │ │ │ │ │ -Process id: 3625065 │ │ │ │ │ -finished: Thu Oct 22 15:16:20.389 UTC 2026 │ │ │ │ │ -elapsed time (seconds): 0.077 │ │ │ │ │ +Process id: 3620584 │ │ │ │ │ +finished: Tue Oct 27 17:13:20.419 UTC 2026 │ │ │ │ │ +elapsed time (seconds): 0.082 │ │ │ │ │ ----------configuration:(17/810)---------- │ │ │ │ │ Boot Layer │ │ │ │ │ class path: /usr/share/jtreg/lib/javatest.jar │ │ │ │ │ /usr/share/jtreg/lib/jtreg.jar │ │ │ │ │ /usr/share/jtreg/lib/junit-platform-console-standalone.jar │ │ │ │ │ /usr/share/jtreg/lib/testng.jar │ │ │ │ │ /usr/share/jtreg/lib/guice.jar │ │ │ │ ├── jtreg-test-output/jdk/JTwork/java/net/SocketOption/OptionsTest.jtr │ │ │ │ │ @@ -1,74 +1,74 @@ │ │ │ │ │ #Test Results (version 2) │ │ │ │ │ -#Thu Oct 22 15:16:20 UTC 2026 │ │ │ │ │ +#Tue Oct 27 17:13:20 UTC 2026 │ │ │ │ │ #-----testdescription----- │ │ │ │ │ $file=/build/reproducible-path/openjdk-21-21.0.13+9/test/jdk/java/net/SocketOption/OptionsTest.java │ │ │ │ │ $root=/build/reproducible-path/openjdk-21-21.0.13+9/test/jdk │ │ │ │ │ keywords=bug8036979 bug8072384 bug8044773 bug8225214 bug8233296 bug8234083 othervm │ │ │ │ │ library=/test/lib │ │ │ │ │ requires=\!vm.graal.enabled │ │ │ │ │ run=USER_SPECIFIED main/othervm -Xcheck\:jni OptionsTest\nUSER_SPECIFIED main/othervm -Xcheck\:jni -Djava.net.preferIPv4Stack\=true OptionsTest\nUSER_SPECIFIED main/othervm --limit-modules\=java.base OptionsTest\nUSER_SPECIFIED main/othervm/policy\=options.policy OptionsTest\n │ │ │ │ │ source=OptionsTest.java │ │ │ │ │ title=\ │ │ │ │ │ │ │ │ │ │ #-----environment----- │ │ │ │ │ │ │ │ │ │ #-----testresult----- │ │ │ │ │ description=file\:/build/reproducible-path/openjdk-21-21.0.13+9/test/jdk/java/net/SocketOption/OptionsTest.java │ │ │ │ │ -elapsed=208 0\:00\:00.208 │ │ │ │ │ -end=Thu Oct 22 15\:16\:20 UTC 2026 │ │ │ │ │ +elapsed=214 0\:00\:00.214 │ │ │ │ │ +end=Tue Oct 27 17\:13\:20 UTC 2026 │ │ │ │ │ environment=regtest │ │ │ │ │ execStatus=Failed. Execution failed\: `main' threw exception\: java.lang.IllegalArgumentException\: Invalid value 'null' │ │ │ │ │ harnessLoaderMode=Classpath Loader │ │ │ │ │ harnessVariety=Full Bundle │ │ │ │ │ hostname=sbuild │ │ │ │ │ javatestOS=Linux 6.12.113+deb13-amd64 (i386) │ │ │ │ │ javatestVersion=6.0-ea+b26-2026-03-18-${BUILT_FROM_COMMIT} │ │ │ │ │ jtregVersion=jtreg 8.3 src 1 │ │ │ │ │ script=com.sun.javatest.regtest.exec.RegressionScript │ │ │ │ │ sections=script_messages build main │ │ │ │ │ -start=Thu Oct 22 15\:16\:20 UTC 2026 │ │ │ │ │ +start=Tue Oct 27 17\:13\:20 UTC 2026 │ │ │ │ │ test=java/net/SocketOption/OptionsTest.java │ │ │ │ │ testJDK=/build/reproducible-path/openjdk-21-21.0.13+9/build/bootcycle-build/images/jdk │ │ │ │ │ -testJDK_OS=[name\:Linux,arch\:i386,version\:6.12.113+deb13-amd64,family\:linux,simple_arch\:i586,simple_version\:6.12,processors\:6,maxMemory\:16773832704,maxSwap\:182536105984] │ │ │ │ │ +testJDK_OS=[name\:Linux,arch\:i386,version\:6.12.113+deb13-amd64,family\:linux,simple_arch\:i586,simple_version\:6.12,processors\:8,maxMemory\:16775352320,maxSwap\:34358685696] │ │ │ │ │ testJDK_os.arch=i386 │ │ │ │ │ testJDK_os.name=Linux │ │ │ │ │ testJDK_os.version=6.12.113+deb13-amd64 │ │ │ │ │ -totalTime=208 │ │ │ │ │ +totalTime=214 │ │ │ │ │ user.name=sbuild │ │ │ │ │ work=/tmp/jdk/JTwork/java/net/SocketOption │ │ │ │ │ │ │ │ │ │ #section:script_messages │ │ │ │ │ ----------messages:(7/452)---------- │ │ │ │ │ JDK under test: /build/reproducible-path/openjdk-21-21.0.13+9/build/bootcycle-build/images/jdk │ │ │ │ │ openjdk version "21.0.13" 2026-10-20 │ │ │ │ │ OpenJDK Runtime Environment (build 21.0.13+9-1-Debian) │ │ │ │ │ OpenJDK Server VM (build 21.0.13+9-1-Debian, mixed mode, sharing) │ │ │ │ │ Library /test/lib; kind: packages │ │ │ │ │ source directory: /build/reproducible-path/openjdk-21-21.0.13+9/test/lib │ │ │ │ │ class directory: /tmp/jdk/JTwork/classes/java/net/SocketOption/OptionsTest.d/test/lib │ │ │ │ │ │ │ │ │ │ #section:build │ │ │ │ │ -----------messages:(5/179)---------- │ │ │ │ │ +----------messages:(5/181)---------- │ │ │ │ │ command: build OptionsTest │ │ │ │ │ reason: Named class compiled on demand │ │ │ │ │ -started: Thu Oct 22 15:16:20.396 UTC 2026 │ │ │ │ │ -finished: Thu Oct 22 15:16:20.396 UTC 2026 │ │ │ │ │ -elapsed time (seconds): 0.0 │ │ │ │ │ +started: Tue Oct 27 17:13:20.426 UTC 2026 │ │ │ │ │ +finished: Tue Oct 27 17:13:20.427 UTC 2026 │ │ │ │ │ +elapsed time (seconds): 0.001 │ │ │ │ │ result: Passed. All files up to date │ │ │ │ │ │ │ │ │ │ #section:main │ │ │ │ │ -----------messages:(7/281)---------- │ │ │ │ │ +----------messages:(7/280)---------- │ │ │ │ │ command: main -Xcheck:jni OptionsTest │ │ │ │ │ reason: User specified action: run main/othervm -Xcheck:jni OptionsTest │ │ │ │ │ -started: Thu Oct 22 15:16:20.396 UTC 2026 │ │ │ │ │ +started: Tue Oct 27 17:13:20.427 UTC 2026 │ │ │ │ │ Mode: othervm [/othervm specified] │ │ │ │ │ -Process id: 3625137 │ │ │ │ │ -finished: Thu Oct 22 15:16:20.601 UTC 2026 │ │ │ │ │ -elapsed time (seconds): 0.205 │ │ │ │ │ +Process id: 3620655 │ │ │ │ │ +finished: Tue Oct 27 17:13:20.637 UTC 2026 │ │ │ │ │ +elapsed time (seconds): 0.21 │ │ │ │ │ ----------configuration:(0/0)---------- │ │ │ │ │ ----------System.out:(7/201)---------- │ │ │ │ │ Testing SO_LINGER with:-1 │ │ │ │ │ Testing SO_LINGER with:-2 │ │ │ │ │ Testing SO_LINGER with:-100 │ │ │ │ │ Testing SO_LINGER with:-65534 │ │ │ │ │ Testing SO_LINGER with:-65535 │ │ │ │ ├── jtreg-test-output/jdk/JTwork/java/net/SocketPermission/SocketPermissionTest.jtr │ │ │ │ │ @@ -1,42 +1,42 @@ │ │ │ │ │ #Test Results (version 2) │ │ │ │ │ -#Thu Oct 22 15:16:22 UTC 2026 │ │ │ │ │ +#Tue Oct 27 17:13:22 UTC 2026 │ │ │ │ │ #-----testdescription----- │ │ │ │ │ $file=/build/reproducible-path/openjdk-21-21.0.13+9/test/jdk/java/net/SocketPermission/SocketPermissionTest.java │ │ │ │ │ $root=/build/reproducible-path/openjdk-21-21.0.13+9/test/jdk │ │ │ │ │ keywords=bug8047031 intermittent othervm testng │ │ │ │ │ library=/test/lib │ │ │ │ │ run=USER_SPECIFIED build jdk.test.lib.NetworkConfiguration jdk.test.lib.Platform\nUSER_SPECIFIED testng/othervm -Djava.security.manager\=allow SocketPermissionTest\n │ │ │ │ │ source=SocketPermissionTest.java │ │ │ │ │ title=SocketPermission tests for legacy socket types. │ │ │ │ │ │ │ │ │ │ #-----environment----- │ │ │ │ │ │ │ │ │ │ #-----testresult----- │ │ │ │ │ description=file\:/build/reproducible-path/openjdk-21-21.0.13+9/test/jdk/java/net/SocketPermission/SocketPermissionTest.java │ │ │ │ │ -elapsed=625 0\:00\:00.625 │ │ │ │ │ -end=Thu Oct 22 15\:16\:22 UTC 2026 │ │ │ │ │ +elapsed=901 0\:00\:00.901 │ │ │ │ │ +end=Tue Oct 27 17\:13\:22 UTC 2026 │ │ │ │ │ environment=regtest │ │ │ │ │ execStatus=Failed. Execution failed\: `main' threw exception\: java.lang.Exception\: config failures\: 0, test failures\: 2 │ │ │ │ │ harnessLoaderMode=Classpath Loader │ │ │ │ │ harnessVariety=Full Bundle │ │ │ │ │ hostname=sbuild │ │ │ │ │ javatestOS=Linux 6.12.113+deb13-amd64 (i386) │ │ │ │ │ javatestVersion=6.0-ea+b26-2026-03-18-${BUILT_FROM_COMMIT} │ │ │ │ │ jtregVersion=jtreg 8.3 src 1 │ │ │ │ │ script=com.sun.javatest.regtest.exec.RegressionScript │ │ │ │ │ sections=script_messages build build testng │ │ │ │ │ -start=Thu Oct 22 15\:16\:21 UTC 2026 │ │ │ │ │ +start=Tue Oct 27 17\:13\:21 UTC 2026 │ │ │ │ │ test=java/net/SocketPermission/SocketPermissionTest.java │ │ │ │ │ testJDK=/build/reproducible-path/openjdk-21-21.0.13+9/build/bootcycle-build/images/jdk │ │ │ │ │ -testJDK_OS=[name\:Linux,arch\:i386,version\:6.12.113+deb13-amd64,family\:linux,simple_arch\:i586,simple_version\:6.12,processors\:6,maxMemory\:16773832704,maxSwap\:182536105984] │ │ │ │ │ +testJDK_OS=[name\:Linux,arch\:i386,version\:6.12.113+deb13-amd64,family\:linux,simple_arch\:i586,simple_version\:6.12,processors\:8,maxMemory\:16775352320,maxSwap\:34358685696] │ │ │ │ │ testJDK_os.arch=i386 │ │ │ │ │ testJDK_os.name=Linux │ │ │ │ │ testJDK_os.version=6.12.113+deb13-amd64 │ │ │ │ │ -totalTime=626 │ │ │ │ │ +totalTime=903 │ │ │ │ │ user.name=sbuild │ │ │ │ │ work=/tmp/jdk/JTwork/java/net/SocketPermission │ │ │ │ │ │ │ │ │ │ #section:script_messages │ │ │ │ │ ----------messages:(7/465)---------- │ │ │ │ │ JDK under test: /build/reproducible-path/openjdk-21-21.0.13+9/build/bootcycle-build/images/jdk │ │ │ │ │ openjdk version "21.0.13" 2026-10-20 │ │ │ │ │ @@ -46,47 +46,47 @@ │ │ │ │ │ source directory: /build/reproducible-path/openjdk-21-21.0.13+9/test/lib │ │ │ │ │ class directory: /tmp/jdk/JTwork/classes/java/net/SocketPermission/SocketPermissionTest.d/test/lib │ │ │ │ │ │ │ │ │ │ #section:build │ │ │ │ │ ----------messages:(5/284)---------- │ │ │ │ │ command: build jdk.test.lib.NetworkConfiguration jdk.test.lib.Platform │ │ │ │ │ reason: User specified action: run build jdk.test.lib.NetworkConfiguration jdk.test.lib.Platform │ │ │ │ │ -started: Thu Oct 22 15:16:21.840 UTC 2026 │ │ │ │ │ -finished: Thu Oct 22 15:16:21.841 UTC 2026 │ │ │ │ │ +started: Tue Oct 27 17:13:21.767 UTC 2026 │ │ │ │ │ +finished: Tue Oct 27 17:13:21.768 UTC 2026 │ │ │ │ │ elapsed time (seconds): 0.001 │ │ │ │ │ result: Passed. All files up to date │ │ │ │ │ │ │ │ │ │ #section:build │ │ │ │ │ ----------messages:(5/188)---------- │ │ │ │ │ command: build SocketPermissionTest │ │ │ │ │ reason: Named class compiled on demand │ │ │ │ │ -started: Thu Oct 22 15:16:21.841 UTC 2026 │ │ │ │ │ -finished: Thu Oct 22 15:16:21.841 UTC 2026 │ │ │ │ │ +started: Tue Oct 27 17:13:21.768 UTC 2026 │ │ │ │ │ +finished: Tue Oct 27 17:13:21.768 UTC 2026 │ │ │ │ │ elapsed time (seconds): 0.0 │ │ │ │ │ result: Passed. All files up to date │ │ │ │ │ │ │ │ │ │ #section:testng │ │ │ │ │ ----------messages:(7/339)---------- │ │ │ │ │ command: testng -Djava.security.manager=allow SocketPermissionTest │ │ │ │ │ reason: User specified action: run testng/othervm -Djava.security.manager=allow SocketPermissionTest │ │ │ │ │ -started: Thu Oct 22 15:16:21.841 UTC 2026 │ │ │ │ │ +started: Tue Oct 27 17:13:21.768 UTC 2026 │ │ │ │ │ Mode: othervm [/othervm specified] │ │ │ │ │ -Process id: 3625159 │ │ │ │ │ -finished: Thu Oct 22 15:16:22.457 UTC 2026 │ │ │ │ │ -elapsed time (seconds): 0.616 │ │ │ │ │ +Process id: 3620676 │ │ │ │ │ +finished: Tue Oct 27 17:13:22.661 UTC 2026 │ │ │ │ │ +elapsed time (seconds): 0.893 │ │ │ │ │ ----------configuration:(0/0)---------- │ │ │ │ │ -----------System.out:(97/6917)---------- │ │ │ │ │ -[15:16:22.279] config SocketPermissionTest.setupSecurityManager(): success [0ms] │ │ │ │ │ -[15:16:22.311] test SocketPermissionTest.acceptServerSocketTest(): success [25ms] │ │ │ │ │ -[15:16:22.313] config SocketPermissionTest.setupSecurityManager(): success [0ms] │ │ │ │ │ -[15:16:22.327] test SocketPermissionTest.connectDatagramSocketTest(): success [14ms] │ │ │ │ │ -[15:16:22.328] config SocketPermissionTest.setupSecurityManager(): success [0ms] │ │ │ │ │ -[15:16:22.330] test SocketPermissionTest.connectSocketTest(): success [1ms] │ │ │ │ │ -[15:16:22.331] config SocketPermissionTest.setupSecurityManager(): success [0ms] │ │ │ │ │ -[15:16:22.339] test SocketPermissionTest.joinGroupMulticastTest(): failure [9ms] │ │ │ │ │ +----------System.out:(97/6918)---------- │ │ │ │ │ +[17:13:22.250] config SocketPermissionTest.setupSecurityManager(): success [0ms] │ │ │ │ │ +[17:13:22.296] test SocketPermissionTest.acceptServerSocketTest(): success [37ms] │ │ │ │ │ +[17:13:22.298] config SocketPermissionTest.setupSecurityManager(): success [0ms] │ │ │ │ │ +[17:13:22.315] test SocketPermissionTest.connectDatagramSocketTest(): success [15ms] │ │ │ │ │ +[17:13:22.316] config SocketPermissionTest.setupSecurityManager(): success [0ms] │ │ │ │ │ +[17:13:22.319] test SocketPermissionTest.connectSocketTest(): success [1ms] │ │ │ │ │ +[17:13:22.320] config SocketPermissionTest.setupSecurityManager(): success [0ms] │ │ │ │ │ +[17:13:22.329] test SocketPermissionTest.joinGroupMulticastTest(): failure [10ms] │ │ │ │ │ java.util.NoSuchElementException: No value present │ │ │ │ │ at java.base/java.util.Optional.get(Optional.java:143) │ │ │ │ │ at SocketPermissionTest.joinGroupMulticastTest(SocketPermissionTest.java:227) │ │ │ │ │ at java.base/jdk.internal.reflect.DirectMethodHandleAccessor.invoke(DirectMethodHandleAccessor.java:103) │ │ │ │ │ at java.base/java.lang.reflect.Method.invoke(Method.java:580) │ │ │ │ │ at org.testng.internal.invokers.MethodInvocationHelper.invokeMethod(MethodInvocationHelper.java:136) │ │ │ │ │ at org.testng.internal.invokers.TestInvoker.invokeMethod(TestInvoker.java:658) │ │ │ │ │ @@ -111,22 +111,22 @@ │ │ │ │ │ at org.testng.TestNG.run(TestNG.java:1060) │ │ │ │ │ at com.sun.javatest.regtest.agent.TestNGRunner.main(TestNGRunner.java:109) │ │ │ │ │ at com.sun.javatest.regtest.agent.TestNGRunner.main(TestNGRunner.java:65) │ │ │ │ │ at java.base/jdk.internal.reflect.DirectMethodHandleAccessor.invoke(DirectMethodHandleAccessor.java:103) │ │ │ │ │ at java.base/java.lang.reflect.Method.invoke(Method.java:580) │ │ │ │ │ at com.sun.javatest.regtest.agent.MainWrapper$MainTask.run(MainWrapper.java:143) │ │ │ │ │ at java.base/java.lang.Thread.run(Thread.java:1583) │ │ │ │ │ -[15:16:22.342] config SocketPermissionTest.setupSecurityManager(): success [0ms] │ │ │ │ │ -[15:16:22.344] test SocketPermissionTest.listenDatagramSocketTest(): success [1ms] │ │ │ │ │ -[15:16:22.345] config SocketPermissionTest.setupSecurityManager(): success [0ms] │ │ │ │ │ -[15:16:22.347] test SocketPermissionTest.listenMulticastSocketTest(): success [1ms] │ │ │ │ │ -[15:16:22.347] config SocketPermissionTest.setupSecurityManager(): success [0ms] │ │ │ │ │ -[15:16:22.349] test SocketPermissionTest.listenServerSocketTest(): success [1ms] │ │ │ │ │ -[15:16:22.350] config SocketPermissionTest.setupSecurityManager(): success [0ms] │ │ │ │ │ -[15:16:22.351] test SocketPermissionTest.sendDatagramPacketTest(): failure [1ms] │ │ │ │ │ +[17:13:22.332] config SocketPermissionTest.setupSecurityManager(): success [0ms] │ │ │ │ │ +[17:13:22.334] test SocketPermissionTest.listenDatagramSocketTest(): success [1ms] │ │ │ │ │ +[17:13:22.335] config SocketPermissionTest.setupSecurityManager(): success [0ms] │ │ │ │ │ +[17:13:22.337] test SocketPermissionTest.listenMulticastSocketTest(): success [1ms] │ │ │ │ │ +[17:13:22.338] config SocketPermissionTest.setupSecurityManager(): success [0ms] │ │ │ │ │ +[17:13:22.340] test SocketPermissionTest.listenServerSocketTest(): success [1ms] │ │ │ │ │ +[17:13:22.341] config SocketPermissionTest.setupSecurityManager(): success [0ms] │ │ │ │ │ +[17:13:22.343] test SocketPermissionTest.sendDatagramPacketTest(): failure [2ms] │ │ │ │ │ java.security.PrivilegedActionException: java.net.SocketException: Network is unreachable │ │ │ │ │ at java.base/java.security.AccessController.doPrivileged(AccessController.java:718) │ │ │ │ │ at SocketPermissionTest.sendDatagramPacketTest(SocketPermissionTest.java:195) │ │ │ │ │ at java.base/jdk.internal.reflect.DirectMethodHandleAccessor.invoke(DirectMethodHandleAccessor.java:103) │ │ │ │ │ at java.base/java.lang.reflect.Method.invoke(Method.java:580) │ │ │ │ │ at org.testng.internal.invokers.MethodInvocationHelper.invokeMethod(MethodInvocationHelper.java:136) │ │ │ │ │ at org.testng.internal.invokers.TestInvoker.invokeMethod(TestInvoker.java:658) │ │ │ │ ├── jtreg-test-output/jdk/JTwork/sun/security/krb5/auto/Addresses.jtr │ │ │ │ │ @@ -1,44 +1,44 @@ │ │ │ │ │ #Test Results (version 2) │ │ │ │ │ -#Thu Oct 22 15:16:27 UTC 2026 │ │ │ │ │ +#Tue Oct 27 17:13:27 UTC 2026 │ │ │ │ │ #-----testdescription----- │ │ │ │ │ $file=/build/reproducible-path/openjdk-21-21.0.13+9/test/jdk/sun/security/krb5/auto/Addresses.java │ │ │ │ │ $root=/build/reproducible-path/openjdk-21-21.0.13+9/test/jdk │ │ │ │ │ keywords=bug8031111 bug8194486 othervm │ │ │ │ │ library=/test/lib │ │ │ │ │ modules=java.base/jdk.internal.misc java.base/sun.security.util java.security.jgss/sun.security.jgss java.security.jgss/sun.security.jgss.krb5 java.security.jgss/sun.security.krb5\:+open java.security.jgss/sun.security.krb5.internal\:+open java.security.jgss/sun.security.krb5.internal.ccache java.security.jgss/sun.security.krb5.internal.rcache java.security.jgss/sun.security.krb5.internal.crypto java.security.jgss/sun.security.krb5.internal.ktab jdk.security.auth jdk.security.jgss │ │ │ │ │ run=USER_SPECIFIED compile -XDignore.symbol.file Addresses.java\nUSER_SPECIFIED main jdk.test.lib.FileInstaller TestHosts TestHosts\nUSER_SPECIFIED main/othervm -Djdk.net.hosts.file\=TestHosts Addresses\n │ │ │ │ │ source=Addresses.java │ │ │ │ │ title=fix krb5 caddr │ │ │ │ │ │ │ │ │ │ #-----environment----- │ │ │ │ │ │ │ │ │ │ #-----testresult----- │ │ │ │ │ description=file\:/build/reproducible-path/openjdk-21-21.0.13+9/test/jdk/sun/security/krb5/auto/Addresses.java │ │ │ │ │ -elapsed=4735 0\:00\:04.735 │ │ │ │ │ -end=Thu Oct 22 15\:16\:27 UTC 2026 │ │ │ │ │ +elapsed=4715 0\:00\:04.715 │ │ │ │ │ +end=Tue Oct 27 17\:13\:27 UTC 2026 │ │ │ │ │ environment=regtest │ │ │ │ │ execStatus=Failed. Execution failed\: `main' threw exception\: java.lang.Exception │ │ │ │ │ harnessLoaderMode=Classpath Loader │ │ │ │ │ harnessVariety=Full Bundle │ │ │ │ │ hostname=sbuild │ │ │ │ │ javatestOS=Linux 6.12.113+deb13-amd64 (i386) │ │ │ │ │ javatestVersion=6.0-ea+b26-2026-03-18-${BUILT_FROM_COMMIT} │ │ │ │ │ jtregVersion=jtreg 8.3 src 1 │ │ │ │ │ modules=java.base/jdk.internal.misc java.base/sun.security.util java.security.jgss/sun.security.jgss java.security.jgss/sun.security.jgss.krb5 java.security.jgss/sun.security.krb5\:+open java.security.jgss/sun.security.krb5.internal\:+open java.security.jgss/sun.security.krb5.internal.ccache java.security.jgss/sun.security.krb5.internal.rcache java.security.jgss/sun.security.krb5.internal.crypto java.security.jgss/sun.security.krb5.internal.ktab jdk.security.auth jdk.security.jgss │ │ │ │ │ script=com.sun.javatest.regtest.exec.RegressionScript │ │ │ │ │ sections=script_messages compile build main build main │ │ │ │ │ -start=Thu Oct 22 15\:16\:22 UTC 2026 │ │ │ │ │ +start=Tue Oct 27 17\:13\:22 UTC 2026 │ │ │ │ │ test=sun/security/krb5/auto/Addresses.java │ │ │ │ │ testJDK=/build/reproducible-path/openjdk-21-21.0.13+9/build/bootcycle-build/images/jdk │ │ │ │ │ -testJDK_OS=[name\:Linux,arch\:i386,version\:6.12.113+deb13-amd64,family\:linux,simple_arch\:i586,simple_version\:6.12,processors\:6,maxMemory\:16773832704,maxSwap\:182536105984] │ │ │ │ │ +testJDK_OS=[name\:Linux,arch\:i386,version\:6.12.113+deb13-amd64,family\:linux,simple_arch\:i586,simple_version\:6.12,processors\:8,maxMemory\:16775352320,maxSwap\:34358685696] │ │ │ │ │ testJDK_os.arch=i386 │ │ │ │ │ testJDK_os.name=Linux │ │ │ │ │ testJDK_os.version=6.12.113+deb13-amd64 │ │ │ │ │ -totalTime=4736 │ │ │ │ │ +totalTime=4717 │ │ │ │ │ user.name=sbuild │ │ │ │ │ work=/tmp/jdk/JTwork/sun/security/krb5/auto │ │ │ │ │ │ │ │ │ │ #section:script_messages │ │ │ │ │ ----------messages:(7/451)---------- │ │ │ │ │ JDK under test: /build/reproducible-path/openjdk-21-21.0.13+9/build/bootcycle-build/images/jdk │ │ │ │ │ openjdk version "21.0.13" 2026-10-20 │ │ │ │ │ @@ -48,21 +48,21 @@ │ │ │ │ │ source directory: /build/reproducible-path/openjdk-21-21.0.13+9/test/lib │ │ │ │ │ class directory: /tmp/jdk/JTwork/classes/sun/security/krb5/auto/Addresses.d/test/lib │ │ │ │ │ │ │ │ │ │ #section:compile │ │ │ │ │ ----------messages:(9/1175)---------- │ │ │ │ │ command: compile -XDignore.symbol.file /build/reproducible-path/openjdk-21-21.0.13+9/test/jdk/sun/security/krb5/auto/Addresses.java │ │ │ │ │ reason: User specified action: run compile -XDignore.symbol.file Addresses.java │ │ │ │ │ -started: Thu Oct 22 15:16:22.511 UTC 2026 │ │ │ │ │ +started: Tue Oct 27 17:13:22.677 UTC 2026 │ │ │ │ │ Additional options from @modules: --add-modules java.base,java.security.jgss,jdk.security.auth,jdk.security.jgss --add-exports java.base/jdk.internal.misc=ALL-UNNAMED --add-exports java.base/sun.security.util=ALL-UNNAMED --add-exports java.security.jgss/sun.security.jgss=ALL-UNNAMED --add-exports java.security.jgss/sun.security.jgss.krb5=ALL-UNNAMED --add-exports java.security.jgss/sun.security.krb5=ALL-UNNAMED --add-exports java.security.jgss/sun.security.krb5.internal=ALL-UNNAMED --add-exports java.security.jgss/sun.security.krb5.internal.ccache=ALL-UNNAMED --add-exports java.security.jgss/sun.security.krb5.internal.rcache=ALL-UNNAMED --add-exports java.security.jgss/sun.security.krb5.internal.crypto=ALL-UNNAMED --add-exports java.security.jgss/sun.security.krb5.internal.ktab=ALL-UNNAMED │ │ │ │ │ Mode: agentvm │ │ │ │ │ Agent id: 2 │ │ │ │ │ -Process id: 3625186 │ │ │ │ │ -finished: Thu Oct 22 15:16:23.685 UTC 2026 │ │ │ │ │ -elapsed time (seconds): 1.174 │ │ │ │ │ +Process id: 3620704 │ │ │ │ │ +finished: Tue Oct 27 17:13:23.992 UTC 2026 │ │ │ │ │ +elapsed time (seconds): 1.315 │ │ │ │ │ ----------configuration:(23/1523)---------- │ │ │ │ │ Boot Layer (javac runtime environment) │ │ │ │ │ class path: /usr/share/jtreg/lib/javatest.jar │ │ │ │ │ /usr/share/jtreg/lib/jtreg.jar │ │ │ │ │ patch: java.base /tmp/jdk/JTwork/patches/java.base │ │ │ │ │ │ │ │ │ │ javac compilation environment │ │ │ │ │ @@ -135,31 +135,31 @@ │ │ │ │ │ ----------stderr:(0/0)---------- │ │ │ │ │ result: Passed. Compilation successful │ │ │ │ │ │ │ │ │ │ #section:build │ │ │ │ │ ----------messages:(5/196)---------- │ │ │ │ │ command: build jdk.test.lib.FileInstaller │ │ │ │ │ reason: Named class compiled on demand │ │ │ │ │ -started: Thu Oct 22 15:16:23.685 UTC 2026 │ │ │ │ │ -finished: Thu Oct 22 15:16:23.686 UTC 2026 │ │ │ │ │ +started: Tue Oct 27 17:13:23.993 UTC 2026 │ │ │ │ │ +finished: Tue Oct 27 17:13:23.994 UTC 2026 │ │ │ │ │ elapsed time (seconds): 0.001 │ │ │ │ │ result: Passed. All files up to date │ │ │ │ │ │ │ │ │ │ #section:main │ │ │ │ │ ----------messages:(10/925)---------- │ │ │ │ │ command: main jdk.test.lib.FileInstaller TestHosts TestHosts │ │ │ │ │ reason: User specified action: run main jdk.test.lib.FileInstaller TestHosts TestHosts │ │ │ │ │ -started: Thu Oct 22 15:16:23.686 UTC 2026 │ │ │ │ │ +started: Tue Oct 27 17:13:23.994 UTC 2026 │ │ │ │ │ Mode: agentvm │ │ │ │ │ Agent id: 1 │ │ │ │ │ -Process id: 3625065 │ │ │ │ │ +Process id: 3620584 │ │ │ │ │ Additional exports to unnamed modules from @modules: java.base/jdk.internal.misc java.base/sun.security.util java.security.jgss/sun.security.jgss java.security.jgss/sun.security.jgss.krb5 java.security.jgss/sun.security.krb5 java.security.jgss/sun.security.krb5.internal java.security.jgss/sun.security.krb5.internal.ccache java.security.jgss/sun.security.krb5.internal.rcache java.security.jgss/sun.security.krb5.internal.crypto java.security.jgss/sun.security.krb5.internal.ktab │ │ │ │ │ Additional opens to unnamed modules from @modules: java.security.jgss/sun.security.krb5 java.security.jgss/sun.security.krb5.internal │ │ │ │ │ -finished: Thu Oct 22 15:16:23.750 UTC 2026 │ │ │ │ │ -elapsed time (seconds): 0.064 │ │ │ │ │ +finished: Tue Oct 27 17:13:24.066 UTC 2026 │ │ │ │ │ +elapsed time (seconds): 0.072 │ │ │ │ │ ----------configuration:(29/1782)---------- │ │ │ │ │ Boot Layer │ │ │ │ │ class path: /usr/share/jtreg/lib/javatest.jar │ │ │ │ │ /usr/share/jtreg/lib/jtreg.jar │ │ │ │ │ /usr/share/jtreg/lib/junit-platform-console-standalone.jar │ │ │ │ │ /usr/share/jtreg/lib/testng.jar │ │ │ │ │ /usr/share/jtreg/lib/guice.jar │ │ │ │ │ @@ -224,32 +224,32 @@ │ │ │ │ │ ----------System.err:(3/35)---------- │ │ │ │ │ │ │ │ │ │ JavaTest Message: Test complete. │ │ │ │ │ │ │ │ │ │ result: Passed. Execution successful │ │ │ │ │ │ │ │ │ │ #section:build │ │ │ │ │ -----------messages:(5/179)---------- │ │ │ │ │ +----------messages:(5/177)---------- │ │ │ │ │ command: build Addresses │ │ │ │ │ reason: Named class compiled on demand │ │ │ │ │ -started: Thu Oct 22 15:16:23.750 UTC 2026 │ │ │ │ │ -finished: Thu Oct 22 15:16:23.751 UTC 2026 │ │ │ │ │ -elapsed time (seconds): 0.001 │ │ │ │ │ +started: Tue Oct 27 17:13:24.067 UTC 2026 │ │ │ │ │ +finished: Tue Oct 27 17:13:24.067 UTC 2026 │ │ │ │ │ +elapsed time (seconds): 0.0 │ │ │ │ │ result: Passed. All files up to date │ │ │ │ │ │ │ │ │ │ #section:main │ │ │ │ │ -----------messages:(8/1246)---------- │ │ │ │ │ +----------messages:(8/1247)---------- │ │ │ │ │ command: main -Djdk.net.hosts.file=TestHosts Addresses │ │ │ │ │ reason: User specified action: run main/othervm -Djdk.net.hosts.file=TestHosts Addresses │ │ │ │ │ -started: Thu Oct 22 15:16:23.751 UTC 2026 │ │ │ │ │ +started: Tue Oct 27 17:13:24.068 UTC 2026 │ │ │ │ │ Mode: othervm [/othervm specified] │ │ │ │ │ Additional options from @modules: --add-modules java.base,java.security.jgss,jdk.security.auth,jdk.security.jgss --add-exports java.base/jdk.internal.misc=ALL-UNNAMED --add-exports java.base/sun.security.util=ALL-UNNAMED --add-exports java.security.jgss/sun.security.jgss=ALL-UNNAMED --add-exports java.security.jgss/sun.security.jgss.krb5=ALL-UNNAMED --add-exports java.security.jgss/sun.security.krb5=ALL-UNNAMED --add-opens java.security.jgss/sun.security.krb5=ALL-UNNAMED --add-exports java.security.jgss/sun.security.krb5.internal=ALL-UNNAMED --add-opens java.security.jgss/sun.security.krb5.internal=ALL-UNNAMED --add-exports java.security.jgss/sun.security.krb5.internal.ccache=ALL-UNNAMED --add-exports java.security.jgss/sun.security.krb5.internal.rcache=ALL-UNNAMED --add-exports java.security.jgss/sun.security.krb5.internal.crypto=ALL-UNNAMED --add-exports java.security.jgss/sun.security.krb5.internal.ktab=ALL-UNNAMED │ │ │ │ │ -Process id: 3625214 │ │ │ │ │ -finished: Thu Oct 22 15:16:27.241 UTC 2026 │ │ │ │ │ -elapsed time (seconds): 3.49 │ │ │ │ │ +Process id: 3620734 │ │ │ │ │ +finished: Tue Oct 27 17:13:27.385 UTC 2026 │ │ │ │ │ +elapsed time (seconds): 3.317 │ │ │ │ │ ----------configuration:(15/1053)---------- │ │ │ │ │ Boot Layer │ │ │ │ │ add modules: java.base java.security.jgss jdk.security.auth jdk.security.jgss │ │ │ │ │ add exports: java.base/jdk.internal.misc ALL-UNNAMED │ │ │ │ │ java.base/sun.security.util ALL-UNNAMED │ │ │ │ │ java.security.jgss/sun.security.jgss ALL-UNNAMED │ │ │ │ │ java.security.jgss/sun.security.jgss.krb5 ALL-UNNAMED │ │ │ │ │ @@ -259,27 +259,27 @@ │ │ │ │ │ java.security.jgss/sun.security.krb5.internal.crypto ALL-UNNAMED │ │ │ │ │ java.security.jgss/sun.security.krb5.internal.ktab ALL-UNNAMED │ │ │ │ │ java.security.jgss/sun.security.krb5.internal.rcache ALL-UNNAMED │ │ │ │ │ add opens: java.security.jgss/sun.security.krb5 ALL-UNNAMED │ │ │ │ │ java.security.jgss/sun.security.krb5.internal ALL-UNNAMED │ │ │ │ │ │ │ │ │ │ ----------System.out:(24/852)---------- │ │ │ │ │ -Start KDC on 12471 │ │ │ │ │ +Start KDC on 15009 │ │ │ │ │ ----------------------------------------------- │ │ │ │ │ >>>>> UDP packet received │ │ │ │ │ -RABBIT.HOLE:12471> dummy@RABBIT.HOLE sends AS-REQ for krbtgt/RABBIT.HOLE@RABBIT.HOLE, KDCOptions: │ │ │ │ │ +RABBIT.HOLE:15009> dummy@RABBIT.HOLE sends AS-REQ for krbtgt/RABBIT.HOLE@RABBIT.HOLE, KDCOptions: │ │ │ │ │ KrbException: Additional pre-authentication required (25) │ │ │ │ │ at KDC.processAsReq(KDC.java:1335) │ │ │ │ │ at KDC.processMessage(KDC.java:809) │ │ │ │ │ at KDC$1.run(KDC.java:1565) │ │ │ │ │ Error 25 Additional pre-authentication required │ │ │ │ │ >>>>> UDP request honored │ │ │ │ │ ----------------------------------------------- │ │ │ │ │ >>>>> UDP packet received │ │ │ │ │ -RABBIT.HOLE:12471> dummy@RABBIT.HOLE sends AS-REQ for krbtgt/RABBIT.HOLE@RABBIT.HOLE, KDCOptions: │ │ │ │ │ +RABBIT.HOLE:15009> dummy@RABBIT.HOLE sends AS-REQ for krbtgt/RABBIT.HOLE@RABBIT.HOLE, KDCOptions: │ │ │ │ │ Return dummy@RABBIT.HOLE ticket for krbtgt/RABBIT.HOLE@RABBIT.HOLE, flags INITIAL;PRE-AUTHENT │ │ │ │ │ >>>>> UDP request honored │ │ │ │ │ /10.0.0.10 │ │ │ │ │ extra1 found │ │ │ │ │ /10.0.0.11 │ │ │ │ │ extra2 found │ │ │ │ │ /10.0.0.12 │ │ ├── ./usr/share/doc/openjdk-21-jre-headless/test-i386/jtreg-summary-hotspot.log │ │ │ @@ -1,9 +1,9 @@ │ │ │ --------------- jtreg console summary for hotspot --------------- │ │ │ -Test results: passed: 2,826; skipped: 7; excluded: 45; did not match keywords: 75; did not meet module requirements: 85; did not meet platform requirements: 415 │ │ │ +Test results: passed: 2,812; skipped: 7; excluded: 45; did not match keywords: 75; did not meet module requirements: 85; did not meet platform requirements: 429 │ │ │ Framework-based tests: 437 = 408 TestNG + 29 JUnit │ │ │ [debian/tests/jtreg-autopkgtest.sh] nothing to cleanup │ │ │ Unable to compare jtreg results: no build jtreport found for hotspot/i386. │ │ │ Reason: '/usr/share/doc/openjdk-21-jre-headless//test-i386/jtreport-hotspot.tar.gz' does not exist. │ │ │ --------------- jtreg console summary for langtools --------------- │ │ │ Test results: passed: 4,429; skipped: 1; excluded: 17; did not match keywords: 1; did not meet platform requirements: 1 │ │ │ Framework-based tests: 4,129 = 3,147 TestNG + 982 JUnit │ │ ├── ./usr/share/doc/openjdk-21-jre-headless/test-i386/jtreg_output-hotspot.log.gz │ │ │ ├── jtreg_output-hotspot.log │ │ │ │ @@ -281,16 +281,14 @@ │ │ │ │ Passed: compiler/intrinsics/IntrinsicDisabledTest.java │ │ │ │ Passed: compiler/intrinsics/Test6982370.java │ │ │ │ Passed: compiler/intrinsics/Test8005419.java │ │ │ │ Passed: compiler/intrinsics/Test8215792.java │ │ │ │ Passed: compiler/intrinsics/Test8237524.java │ │ │ │ Passed: compiler/intrinsics/TestArraysHashCode.java │ │ │ │ Passed: compiler/intrinsics/TestCheckIndex.java │ │ │ │ -Passed: compiler/intrinsics/TestDoubleIsInfinite.java │ │ │ │ -Passed: compiler/intrinsics/TestFloatIsInfinite.java │ │ │ │ Passed: compiler/intrinsics/TestReferenceGetWithNull.java │ │ │ │ Passed: compiler/intrinsics/TestReferenceRefersTo.java │ │ │ │ Passed: compiler/intrinsics/TestRotate.java │ │ │ │ Passed: compiler/intrinsics/zip/TestAdler32.java │ │ │ │ Passed: compiler/intrinsics/zip/TestCRC32.java │ │ │ │ Passed: compiler/intrinsics/zip/TestCRC32C.java │ │ │ │ Passed: compiler/intrinsics/zip/TestFpRegsABI.java │ │ │ │ @@ -1456,21 +1454,18 @@ │ │ │ │ Passed: compiler/intrinsics/sha/sanity/TestSHA3Intrinsics.java │ │ │ │ Passed: compiler/intrinsics/sha/sanity/TestSHA3MultiBlockIntrinsics.java │ │ │ │ Passed: compiler/intrinsics/sha/sanity/TestSHA512Intrinsics.java │ │ │ │ Passed: compiler/intrinsics/sha/sanity/TestSHA512MultiBlockIntrinsics.java │ │ │ │ Passed: compiler/intrinsics/sha/TestDigest.java │ │ │ │ Passed: compiler/intrinsics/string/TestCopyValueOf.java │ │ │ │ Passed: compiler/intrinsics/string/TestCountPositives.java#id0 │ │ │ │ -Passed: compiler/intrinsics/string/TestCountPositives.java#id1 │ │ │ │ Passed: compiler/intrinsics/string/TestEncodeIntrinsics.java │ │ │ │ Passed: compiler/intrinsics/string/TestHasNegatives.java#id0 │ │ │ │ -Passed: compiler/intrinsics/string/TestHasNegatives.java#id1 │ │ │ │ Passed: compiler/intrinsics/string/TestStringConstruction.java │ │ │ │ Passed: compiler/intrinsics/string/TestStringConstructionIntrinsics.java#id0 │ │ │ │ -Passed: compiler/intrinsics/string/TestStringConstructionIntrinsics.java#id1 │ │ │ │ Passed: compiler/intrinsics/string/TestStringEqualsBadLength.java │ │ │ │ Passed: compiler/intrinsics/string/TestStringIndexOfCharIntrinsics.java │ │ │ │ Passed: compiler/intrinsics/string/TestStringIntrinsicMemoryFlow.java │ │ │ │ Passed: compiler/intrinsics/string/TestStringIntrinsicRangeChecks.java │ │ │ │ Passed: compiler/intrinsics/string/TestStringIntrinsics.java │ │ │ │ Passed: compiler/intrinsics/string/TestStringIntrinsics2.java │ │ │ │ Passed: compiler/intrinsics/string/TestStringLatin1IndexOfChar.java │ │ │ │ @@ -1544,22 +1539,14 @@ │ │ │ │ Passed: compiler/loopopts/superword/TestDependencyOffsets.java#avx1-v016-U │ │ │ │ Passed: compiler/loopopts/superword/TestDependencyOffsets.java#avx1-v032-A │ │ │ │ Passed: compiler/loopopts/superword/TestDependencyOffsets.java#avx1-v032-U │ │ │ │ Passed: compiler/loopopts/superword/TestDependencyOffsets.java#avx2-v016-A │ │ │ │ Passed: compiler/loopopts/superword/TestDependencyOffsets.java#avx2-v016-U │ │ │ │ Passed: compiler/loopopts/superword/TestDependencyOffsets.java#avx2-v032-A │ │ │ │ Passed: compiler/loopopts/superword/TestDependencyOffsets.java#avx2-v032-U │ │ │ │ -Passed: compiler/loopopts/superword/TestDependencyOffsets.java#avx512bw-v032-A │ │ │ │ -Passed: compiler/loopopts/superword/TestDependencyOffsets.java#avx512bw-v032-U │ │ │ │ -Passed: compiler/loopopts/superword/TestDependencyOffsets.java#avx512bw-v064-A │ │ │ │ -Passed: compiler/loopopts/superword/TestDependencyOffsets.java#avx512bw-v064-U │ │ │ │ -Passed: compiler/loopopts/superword/TestDependencyOffsets.java#avx512-v032-A │ │ │ │ -Passed: compiler/loopopts/superword/TestDependencyOffsets.java#avx512-v032-U │ │ │ │ -Passed: compiler/loopopts/superword/TestDependencyOffsets.java#avx512-v064-A │ │ │ │ -Passed: compiler/loopopts/superword/TestDependencyOffsets.java#avx512-v064-U │ │ │ │ Passed: compiler/loopopts/superword/TestDependencyOffsets.java#sse4-v002-A │ │ │ │ Passed: compiler/loopopts/superword/TestDependencyOffsets.java#sse4-v002-U │ │ │ │ Passed: compiler/loopopts/superword/TestDependencyOffsets.java#sse4-v004-A │ │ │ │ Passed: compiler/loopopts/superword/TestDependencyOffsets.java#sse4-v004-U │ │ │ │ Passed: compiler/loopopts/superword/TestDependencyOffsets.java#sse4-v008-A │ │ │ │ Passed: compiler/loopopts/superword/TestDependencyOffsets.java#sse4-v008-U │ │ │ │ Passed: compiler/loopopts/superword/TestDependencyOffsets.java#sse4-v016-A │ │ │ │ @@ -1837,15 +1824,14 @@ │ │ │ │ Passed: compiler/vectorization/TestMemoryVectorMismatched.java │ │ │ │ Passed: compiler/vectorization/TestNaNVector.java │ │ │ │ Passed: compiler/vectorization/TestNarrowedIntegerReverseBytes.java │ │ │ │ Passed: compiler/vectorization/TestOptionVectorize.java │ │ │ │ Passed: compiler/vectorization/TestOptionVectorizeIR.java │ │ │ │ Passed: compiler/vectorization/TestOverlappingMismatchedAccesses.java │ │ │ │ Passed: compiler/vectorization/TestPopCountVector.java │ │ │ │ -Passed: compiler/vectorization/TestPopCountVectorLong.java │ │ │ │ Passed: compiler/vectorization/TestReplicateLoopIV.java │ │ │ │ Passed: compiler/vectorization/TestRotateByteAndShortVector.java │ │ │ │ Passed: compiler/vectorization/TestSmallVectorPopIndex.java │ │ │ │ Passed: compiler/vectorization/TestSubwordReverseBytes.java │ │ │ │ Passed: compiler/vectorization/TestUnexpectedLoadOrdering.java │ │ │ │ Passed: compiler/vectorization/TestVectorsNotSavedAtSafepoint.java │ │ │ │ Passed: compiler/vectorization/TestVectorUnalignedOffset.java │ │ │ │ @@ -2837,41 +2823,41 @@ │ │ │ │ Passed: serviceability/tmtools/jstat/GcCapacityTest.java │ │ │ │ Passed: serviceability/tmtools/jstat/GcCauseTest01.java │ │ │ │ Passed: serviceability/tmtools/jstat/GcCauseTest02.java │ │ │ │ Passed: serviceability/tmtools/jstat/GcCauseTest03.java │ │ │ │ Passed: serviceability/tmtools/jstat/GcNewTest.java │ │ │ │ Passed: serviceability/tmtools/jstat/GcTest01.java │ │ │ │ Passed: serviceability/tmtools/jstat/GcTest02.java │ │ │ │ -Test results: passed: 2,826; skipped: 7; excluded: 45; did not match keywords: 75; did not meet module requirements: 85; did not meet platform requirements: 415 │ │ │ │ +Test results: passed: 2,812; skipped: 7; excluded: 45; did not match keywords: 75; did not meet module requirements: 85; did not meet platform requirements: 429 │ │ │ │ Framework-based tests: 437 = 408 TestNG + 29 JUnit │ │ │ │ Report written to /build/reproducible-path/openjdk-21-21.0.13+9/jtreg-test-output/hotspot/0/JTreport/html/report.html │ │ │ │ Results written to /tmp/hotspot/JTwork │ │ │ │ [debian/tests/jtreg-autopkgtest.sh] nothing to cleanup │ │ │ │ grep: debian/tests/hotspot-archs: No such file or directory │ │ │ │ Unable to compare jtreg results: no build jtreport found for hotspot/i386. │ │ │ │ Reason: '/usr/share/doc/openjdk-21-jre-headless//test-i386/jtreport-hotspot.tar.gz' does not exist. │ │ │ │ Command exited with non-zero status 77 │ │ │ │ Command being timed: "debian/tests/hotspot" │ │ │ │ - User time (seconds): 12412.95 │ │ │ │ - System time (seconds): 2192.84 │ │ │ │ - Percent of CPU this job got: 135% │ │ │ │ - Elapsed (wall clock) time (h:mm:ss or m:ss): 3:00:00 │ │ │ │ + User time (seconds): 11858.48 │ │ │ │ + System time (seconds): 1847.50 │ │ │ │ + Percent of CPU this job got: 140% │ │ │ │ + Elapsed (wall clock) time (h:mm:ss or m:ss): 2:42:59 │ │ │ │ Average shared text size (kbytes): 0 │ │ │ │ Average unshared data size (kbytes): 0 │ │ │ │ Average stack size (kbytes): 0 │ │ │ │ Average total size (kbytes): 0 │ │ │ │ - Maximum resident set size (kbytes): 1358624 │ │ │ │ + Maximum resident set size (kbytes): 1321264 │ │ │ │ Average resident set size (kbytes): 0 │ │ │ │ - Major (requiring I/O) page faults: 3203 │ │ │ │ - Minor (reclaiming a frame) page faults: 99154804 │ │ │ │ - Voluntary context switches: 45276926 │ │ │ │ - Involuntary context switches: 5692904 │ │ │ │ + Major (requiring I/O) page faults: 274 │ │ │ │ + Minor (reclaiming a frame) page faults: 89528974 │ │ │ │ + Voluntary context switches: 50471327 │ │ │ │ + Involuntary context switches: 3912342 │ │ │ │ Swaps: 0 │ │ │ │ - File system inputs: 1228304 │ │ │ │ - File system outputs: 0 │ │ │ │ + File system inputs: 1378488 │ │ │ │ + File system outputs: 15367184 │ │ │ │ Socket messages sent: 0 │ │ │ │ Socket messages received: 0 │ │ │ │ Signals delivered: 0 │ │ │ │ Page size (bytes): 4096 │ │ │ │ Exit status: 77 │ │ │ │ ===== END check-hotspot ===== │ │ │ │ ===== START check-langtools ===== │ │ │ │ @@ -7325,31 +7311,31 @@ │ │ │ │ Results written to /tmp/langtools/JTwork │ │ │ │ [debian/tests/jtreg-autopkgtest.sh] nothing to cleanup │ │ │ │ grep: debian/tests/hotspot-archs: No such file or directory │ │ │ │ Unable to compare jtreg results: no build jtreport found for hotspot/i386. │ │ │ │ Reason: '/usr/share/doc/openjdk-21-jre-headless//test-i386/jtreport-hotspot.tar.gz' does not exist. │ │ │ │ Command exited with non-zero status 77 │ │ │ │ Command being timed: "debian/tests/langtools" │ │ │ │ - User time (seconds): 4175.97 │ │ │ │ - System time (seconds): 428.15 │ │ │ │ - Percent of CPU this job got: 157% │ │ │ │ - Elapsed (wall clock) time (h:mm:ss or m:ss): 48:52.29 │ │ │ │ + User time (seconds): 4130.09 │ │ │ │ + System time (seconds): 342.89 │ │ │ │ + Percent of CPU this job got: 149% │ │ │ │ + Elapsed (wall clock) time (h:mm:ss or m:ss): 49:56.07 │ │ │ │ Average shared text size (kbytes): 0 │ │ │ │ Average unshared data size (kbytes): 0 │ │ │ │ Average stack size (kbytes): 0 │ │ │ │ Average total size (kbytes): 0 │ │ │ │ - Maximum resident set size (kbytes): 1191148 │ │ │ │ + Maximum resident set size (kbytes): 1199152 │ │ │ │ Average resident set size (kbytes): 0 │ │ │ │ - Major (requiring I/O) page faults: 12 │ │ │ │ - Minor (reclaiming a frame) page faults: 13379563 │ │ │ │ - Voluntary context switches: 3955214 │ │ │ │ - Involuntary context switches: 167628 │ │ │ │ + Major (requiring I/O) page faults: 0 │ │ │ │ + Minor (reclaiming a frame) page faults: 13254620 │ │ │ │ + Voluntary context switches: 4282114 │ │ │ │ + Involuntary context switches: 91444 │ │ │ │ Swaps: 0 │ │ │ │ - File system inputs: 179680 │ │ │ │ - File system outputs: 0 │ │ │ │ + File system inputs: 193584 │ │ │ │ + File system outputs: 3214512 │ │ │ │ Socket messages sent: 0 │ │ │ │ Socket messages received: 0 │ │ │ │ Signals delivered: 0 │ │ │ │ Page size (bytes): 4096 │ │ │ │ Exit status: 77 │ │ │ │ ===== END check-langtools ===== │ │ │ │ ===== START check-jaxp ===== │ │ │ │ @@ -7875,62 +7861,62 @@ │ │ │ │ Results written to /tmp/jaxp/JTwork │ │ │ │ [debian/tests/jtreg-autopkgtest.sh] nothing to cleanup │ │ │ │ grep: debian/tests/hotspot-archs: No such file or directory │ │ │ │ Unable to compare jtreg results: no build jtreport found for hotspot/i386. │ │ │ │ Reason: '/usr/share/doc/openjdk-21-jre-headless//test-i386/jtreport-hotspot.tar.gz' does not exist. │ │ │ │ Command exited with non-zero status 77 │ │ │ │ Command being timed: "debian/tests/jaxp" │ │ │ │ - User time (seconds): 3236.88 │ │ │ │ - System time (seconds): 201.01 │ │ │ │ - Percent of CPU this job got: 257% │ │ │ │ - Elapsed (wall clock) time (h:mm:ss or m:ss): 22:17.34 │ │ │ │ + User time (seconds): 3134.67 │ │ │ │ + System time (seconds): 175.38 │ │ │ │ + Percent of CPU this job got: 247% │ │ │ │ + Elapsed (wall clock) time (h:mm:ss or m:ss): 22:19.31 │ │ │ │ Average shared text size (kbytes): 0 │ │ │ │ Average unshared data size (kbytes): 0 │ │ │ │ Average stack size (kbytes): 0 │ │ │ │ Average total size (kbytes): 0 │ │ │ │ - Maximum resident set size (kbytes): 250048 │ │ │ │ + Maximum resident set size (kbytes): 249504 │ │ │ │ Average resident set size (kbytes): 0 │ │ │ │ Major (requiring I/O) page faults: 0 │ │ │ │ - Minor (reclaiming a frame) page faults: 15919520 │ │ │ │ - Voluntary context switches: 2185006 │ │ │ │ - Involuntary context switches: 33360 │ │ │ │ + Minor (reclaiming a frame) page faults: 16009255 │ │ │ │ + Voluntary context switches: 2446685 │ │ │ │ + Involuntary context switches: 24617 │ │ │ │ Swaps: 0 │ │ │ │ - File system inputs: 640256 │ │ │ │ - File system outputs: 0 │ │ │ │ + File system inputs: 857296 │ │ │ │ + File system outputs: 3046032 │ │ │ │ Socket messages sent: 0 │ │ │ │ Socket messages received: 0 │ │ │ │ Signals delivered: 0 │ │ │ │ Page size (bytes): 4096 │ │ │ │ Exit status: 77 │ │ │ │ ===== END check-jaxp ===== │ │ │ │ ===== START check-jdk ===== │ │ │ │ mkdir -p jtreg-test-output/jdk │ │ │ │ BOOTJDK_HOME=/usr/lib/jvm/java-21-openjdk-i386 JTREG_OPTIONS= VMNAME=hotspot JDK_TO_TEST=build/bootcycle-build/images/jdk \ │ │ │ │ AUTOPKGTEST_TMP=/tmp/ AUTOPKGTEST_ARTIFACTS=jtreg-test-output/ \ │ │ │ │ /usr/bin/time -v debian/tests/jdk | tee jtreg-test-output/check-jdk.log │ │ │ │ │ │ │ │ -(xfwm4:3086670): atspi-WARNING **: 09:39:19.214: AT-SPI: Error retrieving accessibility bus address: org.freedesktop.DBus.Error.ServiceUnknown: The name org.a11y.Bus was not provided by any .service files │ │ │ │ -dbus-daemon[3086659]: [session uid=999 pid=3086659 pidfd=5] Activating service name='org.xfce.Xfconf' requested by ':1.1' (uid=999 pid=3086670 comm="xfwm4") │ │ │ │ -dbus-daemon[3086659]: [session uid=999 pid=3086659 pidfd=5] Successfully activated service 'org.xfce.Xfconf' │ │ │ │ +(xfwm4:3077762): atspi-WARNING **: 11:48:57.639: AT-SPI: Error retrieving accessibility bus address: org.freedesktop.DBus.Error.ServiceUnknown: The name org.a11y.Bus was not provided by any .service files │ │ │ │ +dbus-daemon[3077751]: [session uid=999 pid=3077751 pidfd=5] Activating service name='org.xfce.Xfconf' requested by ':1.1' (uid=999 pid=3077762 comm="xfwm4") │ │ │ │ +dbus-daemon[3077751]: [session uid=999 pid=3077751 pidfd=5] Successfully activated service 'org.xfce.Xfconf' │ │ │ │ WARNING: Glycin running without sandbox. Bubblewrap (bwrap) doesn't work in the environment. │ │ │ │ dpkg: error: --compare-versions takes three arguments: │ │ │ │ │ │ │ │ Type dpkg --help for help about installing and deinstalling packages [*]; │ │ │ │ Use 'apt' or 'aptitude' for user-friendly package management; │ │ │ │ Type dpkg -Dhelp for a list of dpkg debug flag values; │ │ │ │ Type dpkg --force-help for a list of forcing options; │ │ │ │ Type dpkg-deb --help for help about manipulating *.deb files; │ │ │ │ │ │ │ │ Options marked [*] produce a lot of output - pipe it through 'less' or 'more' ! │ │ │ │ Directory "/tmp/jdk/JTwork" not found: creating │ │ │ │ Directory "jtreg-test-output/jdk/0/JTreport" not found: creating │ │ │ │ │ │ │ │ -(xfwm4:3086670): xfwm4-WARNING **: 09:39:22.400: Another compositing manager is running on screen 0 │ │ │ │ +(xfwm4:3077762): xfwm4-WARNING **: 11:49:01.445: Another compositing manager is running on screen 0 │ │ │ │ │ │ │ │ -(xfwm4:3086670): xfwm4-WARNING **: 09:39:22.406: Failed to connect to session manager: Failed to connect to the session manager: SESSION_MANAGER environment variable not defined │ │ │ │ +(xfwm4:3077762): xfwm4-WARNING **: 11:49:01.448: Failed to connect to session manager: Failed to connect to the session manager: SESSION_MANAGER environment variable not defined │ │ │ │ Passed: com/sun/jdi/AcceptTimeout.java │ │ │ │ Passed: com/sun/jdi/AccessSpecifierTest.java │ │ │ │ Passed: com/sun/jdi/AfterThreadDeathTest.java │ │ │ │ Passed: com/sun/jdi/ArrayRangeTest.java │ │ │ │ Passed: com/sun/jdi/ConstantPoolInfo.java │ │ │ │ Passed: com/sun/jdi/CountFilterTest.java │ │ │ │ Passed: com/sun/jdi/EarlyReturnNegativeTest.java │ │ │ │ @@ -14355,16 +14341,16 @@ │ │ │ │ FAILED: java/net/MulticastSocket/Test.java │ │ │ │ FAILED: java/net/SocketOption/OptionsTest.java │ │ │ │ FAILED: java/net/SocketPermission/SocketPermissionTest.java │ │ │ │ FAILED: sun/security/krb5/auto/Addresses.java │ │ │ │ Test results: failed: 9; excluded: 48; did not match keywords: 37; did not match prior status: 6,595 │ │ │ │ Framework-based tests: 8 = 8 TestNG + 0 JUnit │ │ │ │ Report written to /build/reproducible-path/openjdk-21-21.0.13+9/jtreg-test-output/jdk/1/JTreport/html/report.html │ │ │ │ -Results written to /tmp/jdk/JTwork │ │ │ │ Error: Some tests failed or other problems occurred. │ │ │ │ +Results written to /tmp/jdk/JTwork │ │ │ │ Directory "jtreg-test-output/jdk/2/JTreport" not found: creating │ │ │ │ FAILED: java/net/MulticastSocket/B6427403.java │ │ │ │ FAILED: java/net/MulticastSocket/NoLoopbackPackets.java │ │ │ │ FAILED: java/net/MulticastSocket/Promiscuous.java │ │ │ │ FAILED: java/net/MulticastSocket/SetLoopbackMode.java │ │ │ │ FAILED: java/net/MulticastSocket/SetLoopbackModeIPv4.java │ │ │ │ FAILED: java/net/MulticastSocket/Test.java │ │ │ │ @@ -14375,44 +14361,44 @@ │ │ │ │ Framework-based tests: 8 = 8 TestNG + 0 JUnit │ │ │ │ Report written to /build/reproducible-path/openjdk-21-21.0.13+9/jtreg-test-output/jdk/2/JTreport/html/report.html │ │ │ │ Results written to /tmp/jdk/JTwork │ │ │ │ Error: Some tests failed or other problems occurred. │ │ │ │ [debian/tests/jtreg-autopkgtest.sh] nothing to cleanup │ │ │ │ Command exited with non-zero status 2 │ │ │ │ Command being timed: "debian/tests/jdk" │ │ │ │ - User time (seconds): 27096.89 │ │ │ │ - System time (seconds): 2035.78 │ │ │ │ - Percent of CPU this job got: 143% │ │ │ │ - Elapsed (wall clock) time (h:mm:ss or m:ss): 5:37:44 │ │ │ │ + User time (seconds): 26691.76 │ │ │ │ + System time (seconds): 1837.44 │ │ │ │ + Percent of CPU this job got: 146% │ │ │ │ + Elapsed (wall clock) time (h:mm:ss or m:ss): 5:24:54 │ │ │ │ Average shared text size (kbytes): 0 │ │ │ │ Average unshared data size (kbytes): 0 │ │ │ │ Average stack size (kbytes): 0 │ │ │ │ Average total size (kbytes): 0 │ │ │ │ - Maximum resident set size (kbytes): 1423876 │ │ │ │ + Maximum resident set size (kbytes): 1470076 │ │ │ │ Average resident set size (kbytes): 0 │ │ │ │ - Major (requiring I/O) page faults: 2308 │ │ │ │ - Minor (reclaiming a frame) page faults: 97331525 │ │ │ │ - Voluntary context switches: 29495758 │ │ │ │ - Involuntary context switches: 1493995 │ │ │ │ + Major (requiring I/O) page faults: 124 │ │ │ │ + Minor (reclaiming a frame) page faults: 101215505 │ │ │ │ + Voluntary context switches: 34737736 │ │ │ │ + Involuntary context switches: 1588092 │ │ │ │ Swaps: 0 │ │ │ │ - File system inputs: 1316816 │ │ │ │ - File system outputs: 0 │ │ │ │ + File system inputs: 3922728 │ │ │ │ + File system outputs: 63374888 │ │ │ │ Socket messages sent: 0 │ │ │ │ Socket messages received: 0 │ │ │ │ Signals delivered: 0 │ │ │ │ - Page size (bytes)Killed │ │ │ │ -: 4096 │ │ │ │ + Page size (bytes): 4096 │ │ │ │ Exit status: 2 │ │ │ │ +Killed │ │ │ │ ===== END check-jdk ===== │ │ │ │ for i in hotspot langtools jaxp jdk; do \ │ │ │ │ echo "--------------- jtreg console summary for $i ---------------"; \ │ │ │ │ egrep -v '^(Passed:|Directory|Re[a-z]+\ written\ to)' jtreg-test-output/check-$i.log; \ │ │ │ │ done | tee jtreg-test-output/jtreg-summary.log │ │ │ │ --------------- jtreg console summary for hotspot --------------- │ │ │ │ -Test results: passed: 2,826; skipped: 7; excluded: 45; did not match keywords: 75; did not meet module requirements: 85; did not meet platform requirements: 415 │ │ │ │ +Test results: passed: 2,812; skipped: 7; excluded: 45; did not match keywords: 75; did not meet module requirements: 85; did not meet platform requirements: 429 │ │ │ │ Framework-based tests: 437 = 408 TestNG + 29 JUnit │ │ │ │ [debian/tests/jtreg-autopkgtest.sh] nothing to cleanup │ │ │ │ Unable to compare jtreg results: no build jtreport found for hotspot/i386. │ │ │ │ Reason: '/usr/share/doc/openjdk-21-jre-headless//test-i386/jtreport-hotspot.tar.gz' does not exist. │ │ │ │ --------------- jtreg console summary for langtools --------------- │ │ │ │ Test results: passed: 4,429; skipped: 1; excluded: 17; did not match keywords: 1; did not meet platform requirements: 1 │ │ │ │ Framework-based tests: 4,129 = 3,147 TestNG + 982 JUnit │ │ │ │ @@ -14458,29 +14444,29 @@ │ │ │ │ FAILED: java/net/SocketPermission/SocketPermissionTest.java │ │ │ │ FAILED: sun/security/krb5/auto/Addresses.java │ │ │ │ Test results: failed: 9; excluded: 48; did not match keywords: 37; did not match prior status: 6,595 │ │ │ │ Framework-based tests: 8 = 8 TestNG + 0 JUnit │ │ │ │ [debian/tests/jtreg-autopkgtest.sh] nothing to cleanup │ │ │ │ make[2]: Leaving directory '/build/reproducible-path/openjdk-21-21.0.13+9' │ │ │ │ Command being timed: "/usr/bin/make -f debian/rules -k jtregcheck TEST_SUITES=hotspot langtools jaxp jdk JTREG_OPTIONS=" │ │ │ │ - User time (seconds): 46923.81 │ │ │ │ - System time (seconds): 4859.06 │ │ │ │ - Percent of CPU this job got: 24% │ │ │ │ - Elapsed (wall clock) time (h:mm:ss or m:ss): 9:48:56 │ │ │ │ + User time (seconds): 45815.88 │ │ │ │ + System time (seconds): 4204.45 │ │ │ │ + Percent of CPU this job got: 21% │ │ │ │ + Elapsed (wall clock) time (h:mm:ss or m:ss): 9:20:10 │ │ │ │ Average shared text size (kbytes): 0 │ │ │ │ Average unshared data size (kbytes): 0 │ │ │ │ Average stack size (kbytes): 0 │ │ │ │ Average total size (kbytes): 0 │ │ │ │ - Maximum resident set size (kbytes): 1423876 │ │ │ │ + Maximum resident set size (kbytes): 1470076 │ │ │ │ Average resident set size (kbytes): 0 │ │ │ │ - Major (requiring I/O) page faults: 5523 │ │ │ │ - Minor (reclaiming a frame) page faults: 225808794 │ │ │ │ - Voluntary context switches: 80927445 │ │ │ │ - Involuntary context switches: 7387945 │ │ │ │ + Major (requiring I/O) page faults: 398 │ │ │ │ + Minor (reclaiming a frame) page faults: 220031761 │ │ │ │ + Voluntary context switches: 91952411 │ │ │ │ + Involuntary context switches: 5616528 │ │ │ │ Swaps: 0 │ │ │ │ - File system inputs: 3365056 │ │ │ │ - File system outputs: 0 │ │ │ │ + File system inputs: 6353312 │ │ │ │ + File system outputs: 85018936 │ │ │ │ Socket messages sent: 0 │ │ │ │ Socket messages received: 0 │ │ │ │ Signals delivered: 0 │ │ │ │ Page size (bytes): 4096 │ │ │ │ Exit status: 0 │ │ ├── ./usr/share/doc/openjdk-21-jre-headless/test-i386/jtreport-hotspot.tar.gz │ │ │ ├── jtreport-hotspot.tar │ │ │ │ ├── file list │ │ │ │ │ @@ -1,230 +1,230 @@ │ │ │ │ │ -lrwxrwxrwx 0 sbuild (999) sbuild (999) 0 2026-10-22 15:17:03.000000 jtreg-test-output/jdk/JTreport -> 2/JTreport │ │ │ │ │ -drwxr-xr-x 0 sbuild (999) sbuild (999) 0 2026-10-22 15:16:32.000000 jtreg-test-output/jdk/2/JTreport/ │ │ │ │ │ --rw-r--r-- 0 sbuild (999) sbuild (999) 708 2026-10-22 15:16:32.000000 jtreg-test-output/jdk/2/JTreport/index.html │ │ │ │ │ --rw-r--r-- 0 sbuild (999) sbuild (999) 0 2026-10-22 15:16:32.000000 jtreg-test-output/jdk/2/JTreport/reportdir.dat │ │ │ │ │ -drwxr-xr-x 0 sbuild (999) sbuild (999) 0 2026-10-22 15:16:32.000000 jtreg-test-output/jdk/2/JTreport/html/ │ │ │ │ │ --rw-r--r-- 0 sbuild (999) sbuild (999) 762780 2026-10-22 15:16:32.000000 jtreg-test-output/jdk/2/JTreport/html/notRun_gr.html │ │ │ │ │ --rw-r--r-- 0 sbuild (999) sbuild (999) 762507 2026-10-22 15:16:32.000000 jtreg-test-output/jdk/2/JTreport/html/notRun.html │ │ │ │ │ --rw-r--r-- 0 sbuild (999) sbuild (999) 521 2026-10-22 15:16:32.000000 jtreg-test-output/jdk/2/JTreport/html/error_gr.html │ │ │ │ │ --rw-r--r-- 0 sbuild (999) sbuild (999) 473 2026-10-22 15:16:32.000000 jtreg-test-output/jdk/2/JTreport/html/error.html │ │ │ │ │ --rw-r--r-- 0 sbuild (999) sbuild (999) 2750 2026-10-22 15:16:32.000000 jtreg-test-output/jdk/2/JTreport/html/failed_gr.html │ │ │ │ │ --rw-r--r-- 0 sbuild (999) sbuild (999) 2020 2026-10-22 15:16:32.000000 jtreg-test-output/jdk/2/JTreport/html/failed.html │ │ │ │ │ --rw-r--r-- 0 sbuild (999) sbuild (999) 1233901 2026-10-22 15:16:32.000000 jtreg-test-output/jdk/2/JTreport/html/passed_gr.html │ │ │ │ │ --rw-r--r-- 0 sbuild (999) sbuild (999) 1232386 2026-10-22 15:16:32.000000 jtreg-test-output/jdk/2/JTreport/html/passed.html │ │ │ │ │ --rw-r--r-- 0 sbuild (999) sbuild (999) 85437 2026-10-22 15:16:32.000000 jtreg-test-output/jdk/2/JTreport/html/excluded.html │ │ │ │ │ --rw-r--r-- 0 sbuild (999) sbuild (999) 4126 2026-10-22 15:16:32.000000 jtreg-test-output/jdk/2/JTreport/html/env.html │ │ │ │ │ --rw-r--r-- 0 sbuild (999) sbuild (999) 24356 2026-10-22 15:16:32.000000 jtreg-test-output/jdk/2/JTreport/html/config.html │ │ │ │ │ --rw-r--r-- 0 sbuild (999) sbuild (999) 307 2026-10-22 15:16:32.000000 jtreg-test-output/jdk/2/JTreport/html/report.css │ │ │ │ │ --rw-r--r-- 0 sbuild (999) sbuild (999) 1101291 2026-10-22 15:16:32.000000 jtreg-test-output/jdk/2/JTreport/html/index.html │ │ │ │ │ --rw-r--r-- 0 sbuild (999) sbuild (999) 1101291 2026-10-22 15:16:32.000000 jtreg-test-output/jdk/2/JTreport/html/report.html │ │ │ │ │ -drwxr-xr-x 0 sbuild (999) sbuild (999) 0 2026-10-22 15:16:32.000000 jtreg-test-output/jdk/2/JTreport/text/ │ │ │ │ │ --rw-r--r-- 0 sbuild (999) sbuild (999) 132 2026-10-22 15:16:32.000000 jtreg-test-output/jdk/2/JTreport/text/testng.txt │ │ │ │ │ --rw-r--r-- 0 sbuild (999) sbuild (999) 1023601 2026-10-22 15:16:32.000000 jtreg-test-output/jdk/2/JTreport/text/notRun.txt │ │ │ │ │ --rw-r--r-- 0 sbuild (999) sbuild (999) 101 2026-10-22 15:16:32.000000 jtreg-test-output/jdk/2/JTreport/text/stats.txt │ │ │ │ │ --rw-r--r-- 0 sbuild (999) sbuild (999) 116 2026-10-22 15:16:32.000000 jtreg-test-output/jdk/2/JTreport/text/timeStats.txt │ │ │ │ │ --rw-r--r-- 0 sbuild (999) sbuild (999) 21 2026-10-22 15:16:32.000000 jtreg-test-output/jdk/2/JTreport/text/tc_newfailures.txt │ │ │ │ │ --rw-r--r-- 0 sbuild (999) sbuild (999) 21 2026-10-22 15:16:32.000000 jtreg-test-output/jdk/2/JTreport/text/tc_fail2notrun.txt │ │ │ │ │ --rw-r--r-- 0 sbuild (999) sbuild (999) 20 2026-10-22 15:16:32.000000 jtreg-test-output/jdk/2/JTreport/text/tc_fail2error.txt │ │ │ │ │ --rw-r--r-- 0 sbuild (999) sbuild (999) 19 2026-10-22 15:16:32.000000 jtreg-test-output/jdk/2/JTreport/text/tc_fail2pass.txt │ │ │ │ │ --rw-r--r-- 0 sbuild (999) sbuild (999) 22 2026-10-22 15:16:32.000000 jtreg-test-output/jdk/2/JTreport/text/tc_fail2missing.txt │ │ │ │ │ --rw-r--r-- 0 sbuild (999) sbuild (999) 19 2026-10-22 15:16:32.000000 jtreg-test-output/jdk/2/JTreport/text/other_errors.txt │ │ │ │ │ --rw-r--r-- 0 sbuild (999) sbuild (999) 416 2026-10-22 15:16:32.000000 jtreg-test-output/jdk/2/JTreport/text/newfailures.txt │ │ │ │ │ --rw-r--r-- 0 sbuild (999) sbuild (999) 16 2026-10-22 15:16:32.000000 jtreg-test-output/jdk/2/JTreport/text/fail2fail.txt │ │ │ │ │ --rw-r--r-- 0 sbuild (999) sbuild (999) 18 2026-10-22 15:16:32.000000 jtreg-test-output/jdk/2/JTreport/text/fail2notrun.txt │ │ │ │ │ --rw-r--r-- 0 sbuild (999) sbuild (999) 17 2026-10-22 15:16:32.000000 jtreg-test-output/jdk/2/JTreport/text/faiL2error.txt │ │ │ │ │ --rw-r--r-- 0 sbuild (999) sbuild (999) 16 2026-10-22 15:16:32.000000 jtreg-test-output/jdk/2/JTreport/text/fail2pass.txt │ │ │ │ │ --rw-r--r-- 0 sbuild (999) sbuild (999) 19 2026-10-22 15:16:32.000000 jtreg-test-output/jdk/2/JTreport/text/fail2missing.txt │ │ │ │ │ --rw-r--r-- 0 sbuild (999) sbuild (999) 878238 2026-10-22 15:16:32.000000 jtreg-test-output/jdk/2/JTreport/text/summary.txt │ │ │ │ │ --rw-r--r-- 0 sbuild (999) sbuild (999) 547 2026-10-22 15:16:14.000000 jtreg-test-output/jdk/2/JTreport/text/cmdArgs.txt │ │ │ │ │ -drwxr-xr-x 0 sbuild (999) sbuild (999) 0 2026-10-22 15:15:43.000000 jtreg-test-output/jdk/1/JTreport/ │ │ │ │ │ --rw-r--r-- 0 sbuild (999) sbuild (999) 708 2026-10-22 15:15:43.000000 jtreg-test-output/jdk/1/JTreport/index.html │ │ │ │ │ --rw-r--r-- 0 sbuild (999) sbuild (999) 0 2026-10-22 15:15:43.000000 jtreg-test-output/jdk/1/JTreport/reportdir.dat │ │ │ │ │ -drwxr-xr-x 0 sbuild (999) sbuild (999) 0 2026-10-22 15:15:43.000000 jtreg-test-output/jdk/1/JTreport/html/ │ │ │ │ │ --rw-r--r-- 0 sbuild (999) sbuild (999) 762780 2026-10-22 15:15:43.000000 jtreg-test-output/jdk/1/JTreport/html/notRun_gr.html │ │ │ │ │ --rw-r--r-- 0 sbuild (999) sbuild (999) 762507 2026-10-22 15:15:43.000000 jtreg-test-output/jdk/1/JTreport/html/notRun.html │ │ │ │ │ --rw-r--r-- 0 sbuild (999) sbuild (999) 521 2026-10-22 15:15:43.000000 jtreg-test-output/jdk/1/JTreport/html/error_gr.html │ │ │ │ │ --rw-r--r-- 0 sbuild (999) sbuild (999) 473 2026-10-22 15:15:43.000000 jtreg-test-output/jdk/1/JTreport/html/error.html │ │ │ │ │ --rw-r--r-- 0 sbuild (999) sbuild (999) 2750 2026-10-22 15:15:43.000000 jtreg-test-output/jdk/1/JTreport/html/failed_gr.html │ │ │ │ │ --rw-r--r-- 0 sbuild (999) sbuild (999) 2020 2026-10-22 15:15:43.000000 jtreg-test-output/jdk/1/JTreport/html/failed.html │ │ │ │ │ --rw-r--r-- 0 sbuild (999) sbuild (999) 1233901 2026-10-22 15:15:43.000000 jtreg-test-output/jdk/1/JTreport/html/passed_gr.html │ │ │ │ │ --rw-r--r-- 0 sbuild (999) sbuild (999) 1232386 2026-10-22 15:15:43.000000 jtreg-test-output/jdk/1/JTreport/html/passed.html │ │ │ │ │ --rw-r--r-- 0 sbuild (999) sbuild (999) 85437 2026-10-22 15:15:43.000000 jtreg-test-output/jdk/1/JTreport/html/excluded.html │ │ │ │ │ --rw-r--r-- 0 sbuild (999) sbuild (999) 4126 2026-10-22 15:15:43.000000 jtreg-test-output/jdk/1/JTreport/html/env.html │ │ │ │ │ --rw-r--r-- 0 sbuild (999) sbuild (999) 24356 2026-10-22 15:15:43.000000 jtreg-test-output/jdk/1/JTreport/html/config.html │ │ │ │ │ --rw-r--r-- 0 sbuild (999) sbuild (999) 307 2026-10-22 15:15:42.000000 jtreg-test-output/jdk/1/JTreport/html/report.css │ │ │ │ │ --rw-r--r-- 0 sbuild (999) sbuild (999) 1101291 2026-10-22 15:15:43.000000 jtreg-test-output/jdk/1/JTreport/html/index.html │ │ │ │ │ --rw-r--r-- 0 sbuild (999) sbuild (999) 1101291 2026-10-22 15:15:43.000000 jtreg-test-output/jdk/1/JTreport/html/report.html │ │ │ │ │ -drwxr-xr-x 0 sbuild (999) sbuild (999) 0 2026-10-22 15:15:43.000000 jtreg-test-output/jdk/1/JTreport/text/ │ │ │ │ │ --rw-r--r-- 0 sbuild (999) sbuild (999) 132 2026-10-22 15:15:43.000000 jtreg-test-output/jdk/1/JTreport/text/testng.txt │ │ │ │ │ --rw-r--r-- 0 sbuild (999) sbuild (999) 1023601 2026-10-22 15:15:43.000000 jtreg-test-output/jdk/1/JTreport/text/notRun.txt │ │ │ │ │ --rw-r--r-- 0 sbuild (999) sbuild (999) 101 2026-10-22 15:15:43.000000 jtreg-test-output/jdk/1/JTreport/text/stats.txt │ │ │ │ │ --rw-r--r-- 0 sbuild (999) sbuild (999) 116 2026-10-22 15:15:43.000000 jtreg-test-output/jdk/1/JTreport/text/timeStats.txt │ │ │ │ │ --rw-r--r-- 0 sbuild (999) sbuild (999) 21 2026-10-22 15:15:43.000000 jtreg-test-output/jdk/1/JTreport/text/tc_newfailures.txt │ │ │ │ │ --rw-r--r-- 0 sbuild (999) sbuild (999) 21 2026-10-22 15:15:43.000000 jtreg-test-output/jdk/1/JTreport/text/tc_fail2notrun.txt │ │ │ │ │ --rw-r--r-- 0 sbuild (999) sbuild (999) 20 2026-10-22 15:15:43.000000 jtreg-test-output/jdk/1/JTreport/text/tc_fail2error.txt │ │ │ │ │ --rw-r--r-- 0 sbuild (999) sbuild (999) 19 2026-10-22 15:15:43.000000 jtreg-test-output/jdk/1/JTreport/text/tc_fail2pass.txt │ │ │ │ │ --rw-r--r-- 0 sbuild (999) sbuild (999) 22 2026-10-22 15:15:43.000000 jtreg-test-output/jdk/1/JTreport/text/tc_fail2missing.txt │ │ │ │ │ --rw-r--r-- 0 sbuild (999) sbuild (999) 19 2026-10-22 15:15:43.000000 jtreg-test-output/jdk/1/JTreport/text/other_errors.txt │ │ │ │ │ --rw-r--r-- 0 sbuild (999) sbuild (999) 416 2026-10-22 15:15:43.000000 jtreg-test-output/jdk/1/JTreport/text/newfailures.txt │ │ │ │ │ --rw-r--r-- 0 sbuild (999) sbuild (999) 16 2026-10-22 15:15:43.000000 jtreg-test-output/jdk/1/JTreport/text/fail2fail.txt │ │ │ │ │ --rw-r--r-- 0 sbuild (999) sbuild (999) 18 2026-10-22 15:15:43.000000 jtreg-test-output/jdk/1/JTreport/text/fail2notrun.txt │ │ │ │ │ --rw-r--r-- 0 sbuild (999) sbuild (999) 17 2026-10-22 15:15:43.000000 jtreg-test-output/jdk/1/JTreport/text/faiL2error.txt │ │ │ │ │ --rw-r--r-- 0 sbuild (999) sbuild (999) 16 2026-10-22 15:15:43.000000 jtreg-test-output/jdk/1/JTreport/text/fail2pass.txt │ │ │ │ │ --rw-r--r-- 0 sbuild (999) sbuild (999) 19 2026-10-22 15:15:43.000000 jtreg-test-output/jdk/1/JTreport/text/fail2missing.txt │ │ │ │ │ --rw-r--r-- 0 sbuild (999) sbuild (999) 878238 2026-10-22 15:15:43.000000 jtreg-test-output/jdk/1/JTreport/text/summary.txt │ │ │ │ │ --rw-r--r-- 0 sbuild (999) sbuild (999) 547 2026-10-22 15:15:24.000000 jtreg-test-output/jdk/1/JTreport/text/cmdArgs.txt │ │ │ │ │ -drwxr-xr-x 0 sbuild (999) sbuild (999) 0 2026-10-22 15:14:53.000000 jtreg-test-output/jdk/0/JTreport/ │ │ │ │ │ --rw-r--r-- 0 sbuild (999) sbuild (999) 708 2026-10-22 15:14:53.000000 jtreg-test-output/jdk/0/JTreport/index.html │ │ │ │ │ --rw-r--r-- 0 sbuild (999) sbuild (999) 0 2026-10-22 15:14:53.000000 jtreg-test-output/jdk/0/JTreport/reportdir.dat │ │ │ │ │ -drwxr-xr-x 0 sbuild (999) sbuild (999) 0 2026-10-22 15:14:53.000000 jtreg-test-output/jdk/0/JTreport/html/ │ │ │ │ │ --rw-r--r-- 0 sbuild (999) sbuild (999) 30763 2026-10-22 15:14:53.000000 jtreg-test-output/jdk/0/JTreport/html/notRun_gr.html │ │ │ │ │ --rw-r--r-- 0 sbuild (999) sbuild (999) 30418 2026-10-22 15:14:53.000000 jtreg-test-output/jdk/0/JTreport/html/notRun.html │ │ │ │ │ --rw-r--r-- 0 sbuild (999) sbuild (999) 521 2026-10-22 15:14:53.000000 jtreg-test-output/jdk/0/JTreport/html/error_gr.html │ │ │ │ │ --rw-r--r-- 0 sbuild (999) sbuild (999) 473 2026-10-22 15:14:53.000000 jtreg-test-output/jdk/0/JTreport/html/error.html │ │ │ │ │ --rw-r--r-- 0 sbuild (999) sbuild (999) 2750 2026-10-22 15:14:53.000000 jtreg-test-output/jdk/0/JTreport/html/failed_gr.html │ │ │ │ │ --rw-r--r-- 0 sbuild (999) sbuild (999) 2020 2026-10-22 15:14:53.000000 jtreg-test-output/jdk/0/JTreport/html/failed.html │ │ │ │ │ --rw-r--r-- 0 sbuild (999) sbuild (999) 1233901 2026-10-22 15:14:53.000000 jtreg-test-output/jdk/0/JTreport/html/passed_gr.html │ │ │ │ │ --rw-r--r-- 0 sbuild (999) sbuild (999) 1232386 2026-10-22 15:14:53.000000 jtreg-test-output/jdk/0/JTreport/html/passed.html │ │ │ │ │ --rw-r--r-- 0 sbuild (999) sbuild (999) 85437 2026-10-22 15:14:53.000000 jtreg-test-output/jdk/0/JTreport/html/excluded.html │ │ │ │ │ --rw-r--r-- 0 sbuild (999) sbuild (999) 4107 2026-10-22 15:14:53.000000 jtreg-test-output/jdk/0/JTreport/html/env.html │ │ │ │ │ --rw-r--r-- 0 sbuild (999) sbuild (999) 23924 2026-10-22 15:14:53.000000 jtreg-test-output/jdk/0/JTreport/html/config.html │ │ │ │ │ --rw-r--r-- 0 sbuild (999) sbuild (999) 307 2026-10-22 15:14:53.000000 jtreg-test-output/jdk/0/JTreport/html/report.css │ │ │ │ │ --rw-r--r-- 0 sbuild (999) sbuild (999) 1123733 2026-10-22 15:14:53.000000 jtreg-test-output/jdk/0/JTreport/html/index.html │ │ │ │ │ --rw-r--r-- 0 sbuild (999) sbuild (999) 1123733 2026-10-22 15:14:53.000000 jtreg-test-output/jdk/0/JTreport/html/report.html │ │ │ │ │ -drwxr-xr-x 0 sbuild (999) sbuild (999) 0 2026-10-22 15:14:53.000000 jtreg-test-output/jdk/0/JTreport/text/ │ │ │ │ │ --rw-r--r-- 0 sbuild (999) sbuild (999) 83295 2026-10-22 15:14:53.000000 jtreg-test-output/jdk/0/JTreport/text/junit.txt │ │ │ │ │ --rw-r--r-- 0 sbuild (999) sbuild (999) 129170 2026-10-22 15:14:53.000000 jtreg-test-output/jdk/0/JTreport/text/testng.txt │ │ │ │ │ --rw-r--r-- 0 sbuild (999) sbuild (999) 40569 2026-10-22 15:14:53.000000 jtreg-test-output/jdk/0/JTreport/text/notRun.txt │ │ │ │ │ --rw-r--r-- 0 sbuild (999) sbuild (999) 173 2026-10-22 15:14:53.000000 jtreg-test-output/jdk/0/JTreport/text/stats.txt │ │ │ │ │ --rw-r--r-- 0 sbuild (999) sbuild (999) 1199 2026-10-22 15:14:53.000000 jtreg-test-output/jdk/0/JTreport/text/timeStats.txt │ │ │ │ │ --rw-r--r-- 0 sbuild (999) sbuild (999) 21 2026-10-22 15:14:53.000000 jtreg-test-output/jdk/0/JTreport/text/tc_newfailures.txt │ │ │ │ │ --rw-r--r-- 0 sbuild (999) sbuild (999) 21 2026-10-22 15:14:53.000000 jtreg-test-output/jdk/0/JTreport/text/tc_fail2notrun.txt │ │ │ │ │ --rw-r--r-- 0 sbuild (999) sbuild (999) 20 2026-10-22 15:14:53.000000 jtreg-test-output/jdk/0/JTreport/text/tc_fail2error.txt │ │ │ │ │ --rw-r--r-- 0 sbuild (999) sbuild (999) 19 2026-10-22 15:14:53.000000 jtreg-test-output/jdk/0/JTreport/text/tc_fail2pass.txt │ │ │ │ │ --rw-r--r-- 0 sbuild (999) sbuild (999) 22 2026-10-22 15:14:53.000000 jtreg-test-output/jdk/0/JTreport/text/tc_fail2missing.txt │ │ │ │ │ --rw-r--r-- 0 sbuild (999) sbuild (999) 19 2026-10-22 15:14:53.000000 jtreg-test-output/jdk/0/JTreport/text/other_errors.txt │ │ │ │ │ --rw-r--r-- 0 sbuild (999) sbuild (999) 416 2026-10-22 15:14:53.000000 jtreg-test-output/jdk/0/JTreport/text/newfailures.txt │ │ │ │ │ --rw-r--r-- 0 sbuild (999) sbuild (999) 16 2026-10-22 15:14:53.000000 jtreg-test-output/jdk/0/JTreport/text/fail2fail.txt │ │ │ │ │ --rw-r--r-- 0 sbuild (999) sbuild (999) 18 2026-10-22 15:14:53.000000 jtreg-test-output/jdk/0/JTreport/text/fail2notrun.txt │ │ │ │ │ --rw-r--r-- 0 sbuild (999) sbuild (999) 17 2026-10-22 15:14:53.000000 jtreg-test-output/jdk/0/JTreport/text/faiL2error.txt │ │ │ │ │ --rw-r--r-- 0 sbuild (999) sbuild (999) 16 2026-10-22 15:14:53.000000 jtreg-test-output/jdk/0/JTreport/text/fail2pass.txt │ │ │ │ │ --rw-r--r-- 0 sbuild (999) sbuild (999) 19 2026-10-22 15:14:53.000000 jtreg-test-output/jdk/0/JTreport/text/fail2missing.txt │ │ │ │ │ --rw-r--r-- 0 sbuild (999) sbuild (999) 878238 2026-10-22 15:14:53.000000 jtreg-test-output/jdk/0/JTreport/text/summary.txt │ │ │ │ │ --rw-r--r-- 0 sbuild (999) sbuild (999) 528 2026-10-22 09:39:22.000000 jtreg-test-output/jdk/0/JTreport/text/cmdArgs.txt │ │ │ │ │ -lrwxrwxrwx 0 sbuild (999) sbuild (999) 0 2026-10-22 09:39:18.000000 jtreg-test-output/jaxp/JTreport -> 0/JTreport │ │ │ │ │ -drwxr-xr-x 0 sbuild (999) sbuild (999) 0 2026-10-22 09:39:16.000000 jtreg-test-output/jaxp/0/JTreport/ │ │ │ │ │ --rw-r--r-- 0 sbuild (999) sbuild (999) 710 2026-10-22 09:39:16.000000 jtreg-test-output/jaxp/0/JTreport/index.html │ │ │ │ │ --rw-r--r-- 0 sbuild (999) sbuild (999) 0 2026-10-22 09:39:16.000000 jtreg-test-output/jaxp/0/JTreport/reportdir.dat │ │ │ │ │ -drwxr-xr-x 0 sbuild (999) sbuild (999) 0 2026-10-22 09:39:16.000000 jtreg-test-output/jaxp/0/JTreport/html/ │ │ │ │ │ --rw-r--r-- 0 sbuild (999) sbuild (999) 695 2026-10-22 09:39:16.000000 jtreg-test-output/jaxp/0/JTreport/html/notRun_gr.html │ │ │ │ │ --rw-r--r-- 0 sbuild (999) sbuild (999) 573 2026-10-22 09:39:16.000000 jtreg-test-output/jaxp/0/JTreport/html/notRun.html │ │ │ │ │ --rw-r--r-- 0 sbuild (999) sbuild (999) 521 2026-10-22 09:39:16.000000 jtreg-test-output/jaxp/0/JTreport/html/error_gr.html │ │ │ │ │ --rw-r--r-- 0 sbuild (999) sbuild (999) 473 2026-10-22 09:39:16.000000 jtreg-test-output/jaxp/0/JTreport/html/error.html │ │ │ │ │ --rw-r--r-- 0 sbuild (999) sbuild (999) 513 2026-10-22 09:39:16.000000 jtreg-test-output/jaxp/0/JTreport/html/failed_gr.html │ │ │ │ │ --rw-r--r-- 0 sbuild (999) sbuild (999) 465 2026-10-22 09:39:16.000000 jtreg-test-output/jaxp/0/JTreport/html/failed.html │ │ │ │ │ --rw-r--r-- 0 sbuild (999) sbuild (999) 110062 2026-10-22 09:39:16.000000 jtreg-test-output/jaxp/0/JTreport/html/passed_gr.html │ │ │ │ │ --rw-r--r-- 0 sbuild (999) sbuild (999) 109973 2026-10-22 09:39:16.000000 jtreg-test-output/jaxp/0/JTreport/html/passed.html │ │ │ │ │ --rw-r--r-- 0 sbuild (999) sbuild (999) 5905 2026-10-22 09:39:16.000000 jtreg-test-output/jaxp/0/JTreport/html/excluded.html │ │ │ │ │ --rw-r--r-- 0 sbuild (999) sbuild (999) 4017 2026-10-22 09:39:16.000000 jtreg-test-output/jaxp/0/JTreport/html/env.html │ │ │ │ │ --rw-r--r-- 0 sbuild (999) sbuild (999) 4423 2026-10-22 09:39:16.000000 jtreg-test-output/jaxp/0/JTreport/html/config.html │ │ │ │ │ --rw-r--r-- 0 sbuild (999) sbuild (999) 307 2026-10-22 09:39:16.000000 jtreg-test-output/jaxp/0/JTreport/html/report.css │ │ │ │ │ --rw-r--r-- 0 sbuild (999) sbuild (999) 58492 2026-10-22 09:39:16.000000 jtreg-test-output/jaxp/0/JTreport/html/index.html │ │ │ │ │ --rw-r--r-- 0 sbuild (999) sbuild (999) 58492 2026-10-22 09:39:16.000000 jtreg-test-output/jaxp/0/JTreport/html/report.html │ │ │ │ │ -drwxr-xr-x 0 sbuild (999) sbuild (999) 0 2026-10-22 09:39:16.000000 jtreg-test-output/jaxp/0/JTreport/text/ │ │ │ │ │ --rw-r--r-- 0 sbuild (999) sbuild (999) 200 2026-10-22 09:39:16.000000 jtreg-test-output/jaxp/0/JTreport/text/junit.txt │ │ │ │ │ --rw-r--r-- 0 sbuild (999) sbuild (999) 69461 2026-10-22 09:39:16.000000 jtreg-test-output/jaxp/0/JTreport/text/testng.txt │ │ │ │ │ --rw-r--r-- 0 sbuild (999) sbuild (999) 116 2026-10-22 09:39:16.000000 jtreg-test-output/jaxp/0/JTreport/text/notRun.txt │ │ │ │ │ --rw-r--r-- 0 sbuild (999) sbuild (999) 65 2026-10-22 09:39:16.000000 jtreg-test-output/jaxp/0/JTreport/text/stats.txt │ │ │ │ │ --rw-r--r-- 0 sbuild (999) sbuild (999) 154 2026-10-22 09:39:16.000000 jtreg-test-output/jaxp/0/JTreport/text/timeStats.txt │ │ │ │ │ --rw-r--r-- 0 sbuild (999) sbuild (999) 21 2026-10-22 09:39:16.000000 jtreg-test-output/jaxp/0/JTreport/text/tc_newfailures.txt │ │ │ │ │ --rw-r--r-- 0 sbuild (999) sbuild (999) 21 2026-10-22 09:39:16.000000 jtreg-test-output/jaxp/0/JTreport/text/tc_fail2notrun.txt │ │ │ │ │ --rw-r--r-- 0 sbuild (999) sbuild (999) 20 2026-10-22 09:39:16.000000 jtreg-test-output/jaxp/0/JTreport/text/tc_fail2error.txt │ │ │ │ │ --rw-r--r-- 0 sbuild (999) sbuild (999) 19 2026-10-22 09:39:16.000000 jtreg-test-output/jaxp/0/JTreport/text/tc_fail2pass.txt │ │ │ │ │ --rw-r--r-- 0 sbuild (999) sbuild (999) 22 2026-10-22 09:39:16.000000 jtreg-test-output/jaxp/0/JTreport/text/tc_fail2missing.txt │ │ │ │ │ --rw-r--r-- 0 sbuild (999) sbuild (999) 19 2026-10-22 09:39:16.000000 jtreg-test-output/jaxp/0/JTreport/text/other_errors.txt │ │ │ │ │ --rw-r--r-- 0 sbuild (999) sbuild (999) 18 2026-10-22 09:39:16.000000 jtreg-test-output/jaxp/0/JTreport/text/newfailures.txt │ │ │ │ │ --rw-r--r-- 0 sbuild (999) sbuild (999) 16 2026-10-22 09:39:16.000000 jtreg-test-output/jaxp/0/JTreport/text/fail2fail.txt │ │ │ │ │ --rw-r--r-- 0 sbuild (999) sbuild (999) 18 2026-10-22 09:39:16.000000 jtreg-test-output/jaxp/0/JTreport/text/fail2notrun.txt │ │ │ │ │ --rw-r--r-- 0 sbuild (999) sbuild (999) 17 2026-10-22 09:39:16.000000 jtreg-test-output/jaxp/0/JTreport/text/faiL2error.txt │ │ │ │ │ --rw-r--r-- 0 sbuild (999) sbuild (999) 16 2026-10-22 09:39:16.000000 jtreg-test-output/jaxp/0/JTreport/text/fail2pass.txt │ │ │ │ │ --rw-r--r-- 0 sbuild (999) sbuild (999) 19 2026-10-22 09:39:16.000000 jtreg-test-output/jaxp/0/JTreport/text/fail2missing.txt │ │ │ │ │ --rw-r--r-- 0 sbuild (999) sbuild (999) 59118 2026-10-22 09:39:16.000000 jtreg-test-output/jaxp/0/JTreport/text/summary.txt │ │ │ │ │ --rw-r--r-- 0 sbuild (999) sbuild (999) 438 2026-10-22 09:17:01.000000 jtreg-test-output/jaxp/0/JTreport/text/cmdArgs.txt │ │ │ │ │ -lrwxrwxrwx 0 sbuild (999) sbuild (999) 0 2026-10-22 09:17:01.000000 jtreg-test-output/langtools/JTreport -> 0/JTreport │ │ │ │ │ -drwxr-xr-x 0 sbuild (999) sbuild (999) 0 2026-10-22 09:16:41.000000 jtreg-test-output/langtools/0/JTreport/ │ │ │ │ │ --rw-r--r-- 0 sbuild (999) sbuild (999) 720 2026-10-22 09:16:41.000000 jtreg-test-output/langtools/0/JTreport/index.html │ │ │ │ │ --rw-r--r-- 0 sbuild (999) sbuild (999) 0 2026-10-22 09:16:41.000000 jtreg-test-output/langtools/0/JTreport/reportdir.dat │ │ │ │ │ -drwxr-xr-x 0 sbuild (999) sbuild (999) 0 2026-10-22 09:16:41.000000 jtreg-test-output/langtools/0/JTreport/html/ │ │ │ │ │ --rw-r--r-- 0 sbuild (999) sbuild (999) 3090 2026-10-22 09:16:41.000000 jtreg-test-output/langtools/0/JTreport/html/notRun_gr.html │ │ │ │ │ --rw-r--r-- 0 sbuild (999) sbuild (999) 2801 2026-10-22 09:16:41.000000 jtreg-test-output/langtools/0/JTreport/html/notRun.html │ │ │ │ │ --rw-r--r-- 0 sbuild (999) sbuild (999) 521 2026-10-22 09:16:41.000000 jtreg-test-output/langtools/0/JTreport/html/error_gr.html │ │ │ │ │ --rw-r--r-- 0 sbuild (999) sbuild (999) 473 2026-10-22 09:16:41.000000 jtreg-test-output/langtools/0/JTreport/html/error.html │ │ │ │ │ --rw-r--r-- 0 sbuild (999) sbuild (999) 513 2026-10-22 09:16:41.000000 jtreg-test-output/langtools/0/JTreport/html/failed_gr.html │ │ │ │ │ --rw-r--r-- 0 sbuild (999) sbuild (999) 465 2026-10-22 09:16:41.000000 jtreg-test-output/langtools/0/JTreport/html/failed.html │ │ │ │ │ --rw-r--r-- 0 sbuild (999) sbuild (999) 884645 2026-10-22 09:16:41.000000 jtreg-test-output/langtools/0/JTreport/html/passed_gr.html │ │ │ │ │ --rw-r--r-- 0 sbuild (999) sbuild (999) 884320 2026-10-22 09:16:41.000000 jtreg-test-output/langtools/0/JTreport/html/passed.html │ │ │ │ │ --rw-r--r-- 0 sbuild (999) sbuild (999) 8458 2026-10-22 09:16:41.000000 jtreg-test-output/langtools/0/JTreport/html/excluded.html │ │ │ │ │ --rw-r--r-- 0 sbuild (999) sbuild (999) 4032 2026-10-22 09:16:41.000000 jtreg-test-output/langtools/0/JTreport/html/env.html │ │ │ │ │ --rw-r--r-- 0 sbuild (999) sbuild (999) 10783 2026-10-22 09:16:41.000000 jtreg-test-output/langtools/0/JTreport/html/config.html │ │ │ │ │ --rw-r--r-- 0 sbuild (999) sbuild (999) 307 2026-10-22 09:16:41.000000 jtreg-test-output/langtools/0/JTreport/html/report.css │ │ │ │ │ --rw-r--r-- 0 sbuild (999) sbuild (999) 541887 2026-10-22 09:16:41.000000 jtreg-test-output/langtools/0/JTreport/html/index.html │ │ │ │ │ --rw-r--r-- 0 sbuild (999) sbuild (999) 541887 2026-10-22 09:16:41.000000 jtreg-test-output/langtools/0/JTreport/html/report.html │ │ │ │ │ -drwxr-xr-x 0 sbuild (999) sbuild (999) 0 2026-10-22 09:16:41.000000 jtreg-test-output/langtools/0/JTreport/text/ │ │ │ │ │ --rw-r--r-- 0 sbuild (999) sbuild (999) 18737 2026-10-22 09:16:41.000000 jtreg-test-output/langtools/0/JTreport/text/junit.txt │ │ │ │ │ --rw-r--r-- 0 sbuild (999) sbuild (999) 9538 2026-10-22 09:16:41.000000 jtreg-test-output/langtools/0/JTreport/text/testng.txt │ │ │ │ │ --rw-r--r-- 0 sbuild (999) sbuild (999) 2591 2026-10-22 09:16:41.000000 jtreg-test-output/langtools/0/JTreport/text/notRun.txt │ │ │ │ │ --rw-r--r-- 0 sbuild (999) sbuild (999) 120 2026-10-22 09:16:41.000000 jtreg-test-output/langtools/0/JTreport/text/stats.txt │ │ │ │ │ --rw-r--r-- 0 sbuild (999) sbuild (999) 502 2026-10-22 09:16:41.000000 jtreg-test-output/langtools/0/JTreport/text/timeStats.txt │ │ │ │ │ --rw-r--r-- 0 sbuild (999) sbuild (999) 21 2026-10-22 09:16:41.000000 jtreg-test-output/langtools/0/JTreport/text/tc_newfailures.txt │ │ │ │ │ --rw-r--r-- 0 sbuild (999) sbuild (999) 21 2026-10-22 09:16:41.000000 jtreg-test-output/langtools/0/JTreport/text/tc_fail2notrun.txt │ │ │ │ │ --rw-r--r-- 0 sbuild (999) sbuild (999) 20 2026-10-22 09:16:41.000000 jtreg-test-output/langtools/0/JTreport/text/tc_fail2error.txt │ │ │ │ │ --rw-r--r-- 0 sbuild (999) sbuild (999) 19 2026-10-22 09:16:41.000000 jtreg-test-output/langtools/0/JTreport/text/tc_fail2pass.txt │ │ │ │ │ --rw-r--r-- 0 sbuild (999) sbuild (999) 22 2026-10-22 09:16:41.000000 jtreg-test-output/langtools/0/JTreport/text/tc_fail2missing.txt │ │ │ │ │ --rw-r--r-- 0 sbuild (999) sbuild (999) 19 2026-10-22 09:16:41.000000 jtreg-test-output/langtools/0/JTreport/text/other_errors.txt │ │ │ │ │ --rw-r--r-- 0 sbuild (999) sbuild (999) 18 2026-10-22 09:16:41.000000 jtreg-test-output/langtools/0/JTreport/text/newfailures.txt │ │ │ │ │ --rw-r--r-- 0 sbuild (999) sbuild (999) 16 2026-10-22 09:16:41.000000 jtreg-test-output/langtools/0/JTreport/text/fail2fail.txt │ │ │ │ │ --rw-r--r-- 0 sbuild (999) sbuild (999) 18 2026-10-22 09:16:41.000000 jtreg-test-output/langtools/0/JTreport/text/fail2notrun.txt │ │ │ │ │ --rw-r--r-- 0 sbuild (999) sbuild (999) 17 2026-10-22 09:16:41.000000 jtreg-test-output/langtools/0/JTreport/text/faiL2error.txt │ │ │ │ │ --rw-r--r-- 0 sbuild (999) sbuild (999) 16 2026-10-22 09:16:41.000000 jtreg-test-output/langtools/0/JTreport/text/fail2pass.txt │ │ │ │ │ --rw-r--r-- 0 sbuild (999) sbuild (999) 19 2026-10-22 09:16:41.000000 jtreg-test-output/langtools/0/JTreport/text/fail2missing.txt │ │ │ │ │ --rw-r--r-- 0 sbuild (999) sbuild (999) 643052 2026-10-22 09:16:41.000000 jtreg-test-output/langtools/0/JTreport/text/summary.txt │ │ │ │ │ --rw-r--r-- 0 sbuild (999) sbuild (999) 453 2026-10-22 08:28:09.000000 jtreg-test-output/langtools/0/JTreport/text/cmdArgs.txt │ │ │ │ │ -lrwxrwxrwx 0 sbuild (999) sbuild (999) 0 2026-10-22 08:28:09.000000 jtreg-test-output/hotspot/JTreport -> 0/JTreport │ │ │ │ │ -drwxr-xr-x 0 sbuild (999) sbuild (999) 0 2026-10-22 08:27:55.000000 jtreg-test-output/hotspot/0/JTreport/ │ │ │ │ │ --rw-r--r-- 0 sbuild (999) sbuild (999) 722 2026-10-22 08:27:55.000000 jtreg-test-output/hotspot/0/JTreport/index.html │ │ │ │ │ --rw-r--r-- 0 sbuild (999) sbuild (999) 0 2026-10-22 08:27:55.000000 jtreg-test-output/hotspot/0/JTreport/reportdir.dat │ │ │ │ │ -drwxr-xr-x 0 sbuild (999) sbuild (999) 0 2026-10-22 08:27:55.000000 jtreg-test-output/hotspot/0/JTreport/html/ │ │ │ │ │ --rw-r--r-- 0 sbuild (999) sbuild (999) 70697 2026-10-22 08:27:55.000000 jtreg-test-output/hotspot/0/JTreport/html/notRun_gr.html │ │ │ │ │ --rw-r--r-- 0 sbuild (999) sbuild (999) 70352 2026-10-22 08:27:55.000000 jtreg-test-output/hotspot/0/JTreport/html/notRun.html │ │ │ │ │ --rw-r--r-- 0 sbuild (999) sbuild (999) 521 2026-10-22 08:27:55.000000 jtreg-test-output/hotspot/0/JTreport/html/error_gr.html │ │ │ │ │ --rw-r--r-- 0 sbuild (999) sbuild (999) 473 2026-10-22 08:27:55.000000 jtreg-test-output/hotspot/0/JTreport/html/error.html │ │ │ │ │ --rw-r--r-- 0 sbuild (999) sbuild (999) 513 2026-10-22 08:27:55.000000 jtreg-test-output/hotspot/0/JTreport/html/failed_gr.html │ │ │ │ │ --rw-r--r-- 0 sbuild (999) sbuild (999) 465 2026-10-22 08:27:55.000000 jtreg-test-output/hotspot/0/JTreport/html/failed.html │ │ │ │ │ --rw-r--r-- 0 sbuild (999) sbuild (999) 571405 2026-10-22 08:27:55.000000 jtreg-test-output/hotspot/0/JTreport/html/passed_gr.html │ │ │ │ │ --rw-r--r-- 0 sbuild (999) sbuild (999) 570850 2026-10-22 08:27:55.000000 jtreg-test-output/hotspot/0/JTreport/html/passed.html │ │ │ │ │ --rw-r--r-- 0 sbuild (999) sbuild (999) 20587 2026-10-22 08:27:55.000000 jtreg-test-output/hotspot/0/JTreport/html/excluded.html │ │ │ │ │ --rw-r--r-- 0 sbuild (999) sbuild (999) 4129 2026-10-22 08:27:55.000000 jtreg-test-output/hotspot/0/JTreport/html/env.html │ │ │ │ │ --rw-r--r-- 0 sbuild (999) sbuild (999) 78257 2026-10-22 08:27:55.000000 jtreg-test-output/hotspot/0/JTreport/html/config.html │ │ │ │ │ --rw-r--r-- 0 sbuild (999) sbuild (999) 307 2026-10-22 08:27:55.000000 jtreg-test-output/hotspot/0/JTreport/html/report.css │ │ │ │ │ --rw-r--r-- 0 sbuild (999) sbuild (999) 526864 2026-10-22 08:27:55.000000 jtreg-test-output/hotspot/0/JTreport/html/index.html │ │ │ │ │ --rw-r--r-- 0 sbuild (999) sbuild (999) 526864 2026-10-22 08:27:55.000000 jtreg-test-output/hotspot/0/JTreport/html/report.html │ │ │ │ │ -drwxr-xr-x 0 sbuild (999) sbuild (999) 0 2026-10-22 08:27:55.000000 jtreg-test-output/hotspot/0/JTreport/text/ │ │ │ │ │ --rw-r--r-- 0 sbuild (999) sbuild (999) 3273 2026-10-22 08:27:55.000000 jtreg-test-output/hotspot/0/JTreport/text/junit.txt │ │ │ │ │ --rw-r--r-- 0 sbuild (999) sbuild (999) 7594 2026-10-22 08:27:55.000000 jtreg-test-output/hotspot/0/JTreport/text/testng.txt │ │ │ │ │ --rw-r--r-- 0 sbuild (999) sbuild (999) 107920 2026-10-22 08:27:55.000000 jtreg-test-output/hotspot/0/JTreport/text/notRun.txt │ │ │ │ │ --rw-r--r-- 0 sbuild (999) sbuild (999) 161 2026-10-22 08:27:55.000000 jtreg-test-output/hotspot/0/JTreport/text/stats.txt │ │ │ │ │ --rw-r--r-- 0 sbuild (999) sbuild (999) 899 2026-10-22 08:27:55.000000 jtreg-test-output/hotspot/0/JTreport/text/timeStats.txt │ │ │ │ │ --rw-r--r-- 0 sbuild (999) sbuild (999) 21 2026-10-22 08:27:55.000000 jtreg-test-output/hotspot/0/JTreport/text/tc_newfailures.txt │ │ │ │ │ --rw-r--r-- 0 sbuild (999) sbuild (999) 21 2026-10-22 08:27:55.000000 jtreg-test-output/hotspot/0/JTreport/text/tc_fail2notrun.txt │ │ │ │ │ --rw-r--r-- 0 sbuild (999) sbuild (999) 20 2026-10-22 08:27:55.000000 jtreg-test-output/hotspot/0/JTreport/text/tc_fail2error.txt │ │ │ │ │ --rw-r--r-- 0 sbuild (999) sbuild (999) 19 2026-10-22 08:27:55.000000 jtreg-test-output/hotspot/0/JTreport/text/tc_fail2pass.txt │ │ │ │ │ --rw-r--r-- 0 sbuild (999) sbuild (999) 22 2026-10-22 08:27:55.000000 jtreg-test-output/hotspot/0/JTreport/text/tc_fail2missing.txt │ │ │ │ │ --rw-r--r-- 0 sbuild (999) sbuild (999) 19 2026-10-22 08:27:55.000000 jtreg-test-output/hotspot/0/JTreport/text/other_errors.txt │ │ │ │ │ --rw-r--r-- 0 sbuild (999) sbuild (999) 18 2026-10-22 08:27:55.000000 jtreg-test-output/hotspot/0/JTreport/text/newfailures.txt │ │ │ │ │ --rw-r--r-- 0 sbuild (999) sbuild (999) 16 2026-10-22 08:27:55.000000 jtreg-test-output/hotspot/0/JTreport/text/fail2fail.txt │ │ │ │ │ --rw-r--r-- 0 sbuild (999) sbuild (999) 18 2026-10-22 08:27:55.000000 jtreg-test-output/hotspot/0/JTreport/text/fail2notrun.txt │ │ │ │ │ --rw-r--r-- 0 sbuild (999) sbuild (999) 17 2026-10-22 08:27:55.000000 jtreg-test-output/hotspot/0/JTreport/text/faiL2error.txt │ │ │ │ │ --rw-r--r-- 0 sbuild (999) sbuild (999) 16 2026-10-22 08:27:55.000000 jtreg-test-output/hotspot/0/JTreport/text/fail2pass.txt │ │ │ │ │ --rw-r--r-- 0 sbuild (999) sbuild (999) 19 2026-10-22 08:27:55.000000 jtreg-test-output/hotspot/0/JTreport/text/fail2missing.txt │ │ │ │ │ --rw-r--r-- 0 sbuild (999) sbuild (999) 429918 2026-10-22 08:27:55.000000 jtreg-test-output/hotspot/0/JTreport/text/summary.txt │ │ │ │ │ --rw-r--r-- 0 sbuild (999) sbuild (999) 550 2026-10-22 05:28:09.000000 jtreg-test-output/hotspot/0/JTreport/text/cmdArgs.txt │ │ │ │ │ +lrwxrwxrwx 0 sbuild (999) sbuild (999) 0 2026-10-27 11:26:37.000000 jtreg-test-output/langtools/JTreport -> 0/JTreport │ │ │ │ │ +drwxr-xr-x 0 sbuild (999) sbuild (999) 0 2026-10-27 11:26:25.000000 jtreg-test-output/langtools/0/JTreport/ │ │ │ │ │ +drwxr-xr-x 0 sbuild (999) sbuild (999) 0 2026-10-27 11:26:25.000000 jtreg-test-output/langtools/0/JTreport/text/ │ │ │ │ │ +-rw-r--r-- 0 sbuild (999) sbuild (999) 17 2026-10-27 11:26:25.000000 jtreg-test-output/langtools/0/JTreport/text/faiL2error.txt │ │ │ │ │ +-rw-r--r-- 0 sbuild (999) sbuild (999) 16 2026-10-27 11:26:25.000000 jtreg-test-output/langtools/0/JTreport/text/fail2fail.txt │ │ │ │ │ +-rw-r--r-- 0 sbuild (999) sbuild (999) 19 2026-10-27 11:26:25.000000 jtreg-test-output/langtools/0/JTreport/text/other_errors.txt │ │ │ │ │ +-rw-r--r-- 0 sbuild (999) sbuild (999) 19 2026-10-27 11:26:25.000000 jtreg-test-output/langtools/0/JTreport/text/fail2missing.txt │ │ │ │ │ +-rw-r--r-- 0 sbuild (999) sbuild (999) 120 2026-10-27 11:26:25.000000 jtreg-test-output/langtools/0/JTreport/text/stats.txt │ │ │ │ │ +-rw-r--r-- 0 sbuild (999) sbuild (999) 478 2026-10-27 11:26:25.000000 jtreg-test-output/langtools/0/JTreport/text/timeStats.txt │ │ │ │ │ +-rw-r--r-- 0 sbuild (999) sbuild (999) 18737 2026-10-27 11:26:25.000000 jtreg-test-output/langtools/0/JTreport/text/junit.txt │ │ │ │ │ +-rw-r--r-- 0 sbuild (999) sbuild (999) 16 2026-10-27 11:26:25.000000 jtreg-test-output/langtools/0/JTreport/text/fail2pass.txt │ │ │ │ │ +-rw-r--r-- 0 sbuild (999) sbuild (999) 453 2026-10-27 10:36:42.000000 jtreg-test-output/langtools/0/JTreport/text/cmdArgs.txt │ │ │ │ │ +-rw-r--r-- 0 sbuild (999) sbuild (999) 2591 2026-10-27 11:26:25.000000 jtreg-test-output/langtools/0/JTreport/text/notRun.txt │ │ │ │ │ +-rw-r--r-- 0 sbuild (999) sbuild (999) 21 2026-10-27 11:26:25.000000 jtreg-test-output/langtools/0/JTreport/text/tc_fail2notrun.txt │ │ │ │ │ +-rw-r--r-- 0 sbuild (999) sbuild (999) 20 2026-10-27 11:26:25.000000 jtreg-test-output/langtools/0/JTreport/text/tc_fail2error.txt │ │ │ │ │ +-rw-r--r-- 0 sbuild (999) sbuild (999) 22 2026-10-27 11:26:25.000000 jtreg-test-output/langtools/0/JTreport/text/tc_fail2missing.txt │ │ │ │ │ +-rw-r--r-- 0 sbuild (999) sbuild (999) 643052 2026-10-27 11:26:25.000000 jtreg-test-output/langtools/0/JTreport/text/summary.txt │ │ │ │ │ +-rw-r--r-- 0 sbuild (999) sbuild (999) 9538 2026-10-27 11:26:25.000000 jtreg-test-output/langtools/0/JTreport/text/testng.txt │ │ │ │ │ +-rw-r--r-- 0 sbuild (999) sbuild (999) 18 2026-10-27 11:26:25.000000 jtreg-test-output/langtools/0/JTreport/text/newfailures.txt │ │ │ │ │ +-rw-r--r-- 0 sbuild (999) sbuild (999) 18 2026-10-27 11:26:25.000000 jtreg-test-output/langtools/0/JTreport/text/fail2notrun.txt │ │ │ │ │ +-rw-r--r-- 0 sbuild (999) sbuild (999) 19 2026-10-27 11:26:25.000000 jtreg-test-output/langtools/0/JTreport/text/tc_fail2pass.txt │ │ │ │ │ +-rw-r--r-- 0 sbuild (999) sbuild (999) 21 2026-10-27 11:26:25.000000 jtreg-test-output/langtools/0/JTreport/text/tc_newfailures.txt │ │ │ │ │ +-rw-r--r-- 0 sbuild (999) sbuild (999) 720 2026-10-27 11:26:25.000000 jtreg-test-output/langtools/0/JTreport/index.html │ │ │ │ │ +-rw-r--r-- 0 sbuild (999) sbuild (999) 0 2026-10-27 11:26:25.000000 jtreg-test-output/langtools/0/JTreport/reportdir.dat │ │ │ │ │ +drwxr-xr-x 0 sbuild (999) sbuild (999) 0 2026-10-27 11:26:25.000000 jtreg-test-output/langtools/0/JTreport/html/ │ │ │ │ │ +-rw-r--r-- 0 sbuild (999) sbuild (999) 884646 2026-10-27 11:26:25.000000 jtreg-test-output/langtools/0/JTreport/html/passed_gr.html │ │ │ │ │ +-rw-r--r-- 0 sbuild (999) sbuild (999) 541888 2026-10-27 11:26:25.000000 jtreg-test-output/langtools/0/JTreport/html/index.html │ │ │ │ │ +-rw-r--r-- 0 sbuild (999) sbuild (999) 8459 2026-10-27 11:26:25.000000 jtreg-test-output/langtools/0/JTreport/html/excluded.html │ │ │ │ │ +-rw-r--r-- 0 sbuild (999) sbuild (999) 522 2026-10-27 11:26:25.000000 jtreg-test-output/langtools/0/JTreport/html/error_gr.html │ │ │ │ │ +-rw-r--r-- 0 sbuild (999) sbuild (999) 541888 2026-10-27 11:26:25.000000 jtreg-test-output/langtools/0/JTreport/html/report.html │ │ │ │ │ +-rw-r--r-- 0 sbuild (999) sbuild (999) 2802 2026-10-27 11:26:25.000000 jtreg-test-output/langtools/0/JTreport/html/notRun.html │ │ │ │ │ +-rw-r--r-- 0 sbuild (999) sbuild (999) 466 2026-10-27 11:26:25.000000 jtreg-test-output/langtools/0/JTreport/html/failed.html │ │ │ │ │ +-rw-r--r-- 0 sbuild (999) sbuild (999) 474 2026-10-27 11:26:25.000000 jtreg-test-output/langtools/0/JTreport/html/error.html │ │ │ │ │ +-rw-r--r-- 0 sbuild (999) sbuild (999) 3091 2026-10-27 11:26:25.000000 jtreg-test-output/langtools/0/JTreport/html/notRun_gr.html │ │ │ │ │ +-rw-r--r-- 0 sbuild (999) sbuild (999) 4033 2026-10-27 11:26:25.000000 jtreg-test-output/langtools/0/JTreport/html/env.html │ │ │ │ │ +-rw-r--r-- 0 sbuild (999) sbuild (999) 307 2026-10-27 11:26:24.000000 jtreg-test-output/langtools/0/JTreport/html/report.css │ │ │ │ │ +-rw-r--r-- 0 sbuild (999) sbuild (999) 514 2026-10-27 11:26:25.000000 jtreg-test-output/langtools/0/JTreport/html/failed_gr.html │ │ │ │ │ +-rw-r--r-- 0 sbuild (999) sbuild (999) 10783 2026-10-27 11:26:25.000000 jtreg-test-output/langtools/0/JTreport/html/config.html │ │ │ │ │ +-rw-r--r-- 0 sbuild (999) sbuild (999) 884321 2026-10-27 11:26:25.000000 jtreg-test-output/langtools/0/JTreport/html/passed.html │ │ │ │ │ +lrwxrwxrwx 0 sbuild (999) sbuild (999) 0 2026-10-27 11:48:56.000000 jtreg-test-output/jaxp/JTreport -> 0/JTreport │ │ │ │ │ +drwxr-xr-x 0 sbuild (999) sbuild (999) 0 2026-10-27 11:48:55.000000 jtreg-test-output/jaxp/0/JTreport/ │ │ │ │ │ +drwxr-xr-x 0 sbuild (999) sbuild (999) 0 2026-10-27 11:48:55.000000 jtreg-test-output/jaxp/0/JTreport/text/ │ │ │ │ │ +-rw-r--r-- 0 sbuild (999) sbuild (999) 17 2026-10-27 11:48:55.000000 jtreg-test-output/jaxp/0/JTreport/text/faiL2error.txt │ │ │ │ │ +-rw-r--r-- 0 sbuild (999) sbuild (999) 16 2026-10-27 11:48:55.000000 jtreg-test-output/jaxp/0/JTreport/text/fail2fail.txt │ │ │ │ │ +-rw-r--r-- 0 sbuild (999) sbuild (999) 19 2026-10-27 11:48:55.000000 jtreg-test-output/jaxp/0/JTreport/text/other_errors.txt │ │ │ │ │ +-rw-r--r-- 0 sbuild (999) sbuild (999) 19 2026-10-27 11:48:55.000000 jtreg-test-output/jaxp/0/JTreport/text/fail2missing.txt │ │ │ │ │ +-rw-r--r-- 0 sbuild (999) sbuild (999) 65 2026-10-27 11:48:55.000000 jtreg-test-output/jaxp/0/JTreport/text/stats.txt │ │ │ │ │ +-rw-r--r-- 0 sbuild (999) sbuild (999) 178 2026-10-27 11:48:55.000000 jtreg-test-output/jaxp/0/JTreport/text/timeStats.txt │ │ │ │ │ +-rw-r--r-- 0 sbuild (999) sbuild (999) 200 2026-10-27 11:48:55.000000 jtreg-test-output/jaxp/0/JTreport/text/junit.txt │ │ │ │ │ +-rw-r--r-- 0 sbuild (999) sbuild (999) 16 2026-10-27 11:48:55.000000 jtreg-test-output/jaxp/0/JTreport/text/fail2pass.txt │ │ │ │ │ +-rw-r--r-- 0 sbuild (999) sbuild (999) 438 2026-10-27 11:26:38.000000 jtreg-test-output/jaxp/0/JTreport/text/cmdArgs.txt │ │ │ │ │ +-rw-r--r-- 0 sbuild (999) sbuild (999) 116 2026-10-27 11:48:55.000000 jtreg-test-output/jaxp/0/JTreport/text/notRun.txt │ │ │ │ │ +-rw-r--r-- 0 sbuild (999) sbuild (999) 21 2026-10-27 11:48:55.000000 jtreg-test-output/jaxp/0/JTreport/text/tc_fail2notrun.txt │ │ │ │ │ +-rw-r--r-- 0 sbuild (999) sbuild (999) 20 2026-10-27 11:48:55.000000 jtreg-test-output/jaxp/0/JTreport/text/tc_fail2error.txt │ │ │ │ │ +-rw-r--r-- 0 sbuild (999) sbuild (999) 22 2026-10-27 11:48:55.000000 jtreg-test-output/jaxp/0/JTreport/text/tc_fail2missing.txt │ │ │ │ │ +-rw-r--r-- 0 sbuild (999) sbuild (999) 59118 2026-10-27 11:48:55.000000 jtreg-test-output/jaxp/0/JTreport/text/summary.txt │ │ │ │ │ +-rw-r--r-- 0 sbuild (999) sbuild (999) 69461 2026-10-27 11:48:55.000000 jtreg-test-output/jaxp/0/JTreport/text/testng.txt │ │ │ │ │ +-rw-r--r-- 0 sbuild (999) sbuild (999) 18 2026-10-27 11:48:55.000000 jtreg-test-output/jaxp/0/JTreport/text/newfailures.txt │ │ │ │ │ +-rw-r--r-- 0 sbuild (999) sbuild (999) 18 2026-10-27 11:48:55.000000 jtreg-test-output/jaxp/0/JTreport/text/fail2notrun.txt │ │ │ │ │ +-rw-r--r-- 0 sbuild (999) sbuild (999) 19 2026-10-27 11:48:55.000000 jtreg-test-output/jaxp/0/JTreport/text/tc_fail2pass.txt │ │ │ │ │ +-rw-r--r-- 0 sbuild (999) sbuild (999) 21 2026-10-27 11:48:55.000000 jtreg-test-output/jaxp/0/JTreport/text/tc_newfailures.txt │ │ │ │ │ +-rw-r--r-- 0 sbuild (999) sbuild (999) 710 2026-10-27 11:48:55.000000 jtreg-test-output/jaxp/0/JTreport/index.html │ │ │ │ │ +-rw-r--r-- 0 sbuild (999) sbuild (999) 0 2026-10-27 11:48:55.000000 jtreg-test-output/jaxp/0/JTreport/reportdir.dat │ │ │ │ │ +drwxr-xr-x 0 sbuild (999) sbuild (999) 0 2026-10-27 11:48:55.000000 jtreg-test-output/jaxp/0/JTreport/html/ │ │ │ │ │ +-rw-r--r-- 0 sbuild (999) sbuild (999) 110063 2026-10-27 11:48:55.000000 jtreg-test-output/jaxp/0/JTreport/html/passed_gr.html │ │ │ │ │ +-rw-r--r-- 0 sbuild (999) sbuild (999) 58493 2026-10-27 11:48:55.000000 jtreg-test-output/jaxp/0/JTreport/html/index.html │ │ │ │ │ +-rw-r--r-- 0 sbuild (999) sbuild (999) 5906 2026-10-27 11:48:55.000000 jtreg-test-output/jaxp/0/JTreport/html/excluded.html │ │ │ │ │ +-rw-r--r-- 0 sbuild (999) sbuild (999) 522 2026-10-27 11:48:55.000000 jtreg-test-output/jaxp/0/JTreport/html/error_gr.html │ │ │ │ │ +-rw-r--r-- 0 sbuild (999) sbuild (999) 58493 2026-10-27 11:48:55.000000 jtreg-test-output/jaxp/0/JTreport/html/report.html │ │ │ │ │ +-rw-r--r-- 0 sbuild (999) sbuild (999) 574 2026-10-27 11:48:55.000000 jtreg-test-output/jaxp/0/JTreport/html/notRun.html │ │ │ │ │ +-rw-r--r-- 0 sbuild (999) sbuild (999) 466 2026-10-27 11:48:55.000000 jtreg-test-output/jaxp/0/JTreport/html/failed.html │ │ │ │ │ +-rw-r--r-- 0 sbuild (999) sbuild (999) 474 2026-10-27 11:48:55.000000 jtreg-test-output/jaxp/0/JTreport/html/error.html │ │ │ │ │ +-rw-r--r-- 0 sbuild (999) sbuild (999) 696 2026-10-27 11:48:55.000000 jtreg-test-output/jaxp/0/JTreport/html/notRun_gr.html │ │ │ │ │ +-rw-r--r-- 0 sbuild (999) sbuild (999) 4018 2026-10-27 11:48:55.000000 jtreg-test-output/jaxp/0/JTreport/html/env.html │ │ │ │ │ +-rw-r--r-- 0 sbuild (999) sbuild (999) 307 2026-10-27 11:48:55.000000 jtreg-test-output/jaxp/0/JTreport/html/report.css │ │ │ │ │ +-rw-r--r-- 0 sbuild (999) sbuild (999) 514 2026-10-27 11:48:55.000000 jtreg-test-output/jaxp/0/JTreport/html/failed_gr.html │ │ │ │ │ +-rw-r--r-- 0 sbuild (999) sbuild (999) 4423 2026-10-27 11:48:55.000000 jtreg-test-output/jaxp/0/JTreport/html/config.html │ │ │ │ │ +-rw-r--r-- 0 sbuild (999) sbuild (999) 109974 2026-10-27 11:48:55.000000 jtreg-test-output/jaxp/0/JTreport/html/passed.html │ │ │ │ │ +lrwxrwxrwx 0 sbuild (999) sbuild (999) 0 2026-10-27 10:36:41.000000 jtreg-test-output/hotspot/JTreport -> 0/JTreport │ │ │ │ │ +drwxr-xr-x 0 sbuild (999) sbuild (999) 0 2026-10-27 10:36:33.000000 jtreg-test-output/hotspot/0/JTreport/ │ │ │ │ │ +drwxr-xr-x 0 sbuild (999) sbuild (999) 0 2026-10-27 10:36:33.000000 jtreg-test-output/hotspot/0/JTreport/text/ │ │ │ │ │ +-rw-r--r-- 0 sbuild (999) sbuild (999) 17 2026-10-27 10:36:33.000000 jtreg-test-output/hotspot/0/JTreport/text/faiL2error.txt │ │ │ │ │ +-rw-r--r-- 0 sbuild (999) sbuild (999) 16 2026-10-27 10:36:33.000000 jtreg-test-output/hotspot/0/JTreport/text/fail2fail.txt │ │ │ │ │ +-rw-r--r-- 0 sbuild (999) sbuild (999) 19 2026-10-27 10:36:33.000000 jtreg-test-output/hotspot/0/JTreport/text/other_errors.txt │ │ │ │ │ +-rw-r--r-- 0 sbuild (999) sbuild (999) 19 2026-10-27 10:36:33.000000 jtreg-test-output/hotspot/0/JTreport/text/fail2missing.txt │ │ │ │ │ +-rw-r--r-- 0 sbuild (999) sbuild (999) 161 2026-10-27 10:36:33.000000 jtreg-test-output/hotspot/0/JTreport/text/stats.txt │ │ │ │ │ +-rw-r--r-- 0 sbuild (999) sbuild (999) 791 2026-10-27 10:36:33.000000 jtreg-test-output/hotspot/0/JTreport/text/timeStats.txt │ │ │ │ │ +-rw-r--r-- 0 sbuild (999) sbuild (999) 3273 2026-10-27 10:36:33.000000 jtreg-test-output/hotspot/0/JTreport/text/junit.txt │ │ │ │ │ +-rw-r--r-- 0 sbuild (999) sbuild (999) 16 2026-10-27 10:36:33.000000 jtreg-test-output/hotspot/0/JTreport/text/fail2pass.txt │ │ │ │ │ +-rw-r--r-- 0 sbuild (999) sbuild (999) 550 2026-10-27 07:53:43.000000 jtreg-test-output/hotspot/0/JTreport/text/cmdArgs.txt │ │ │ │ │ +-rw-r--r-- 0 sbuild (999) sbuild (999) 110370 2026-10-27 10:36:33.000000 jtreg-test-output/hotspot/0/JTreport/text/notRun.txt │ │ │ │ │ +-rw-r--r-- 0 sbuild (999) sbuild (999) 21 2026-10-27 10:36:33.000000 jtreg-test-output/hotspot/0/JTreport/text/tc_fail2notrun.txt │ │ │ │ │ +-rw-r--r-- 0 sbuild (999) sbuild (999) 20 2026-10-27 10:36:33.000000 jtreg-test-output/hotspot/0/JTreport/text/tc_fail2error.txt │ │ │ │ │ +-rw-r--r-- 0 sbuild (999) sbuild (999) 22 2026-10-27 10:36:33.000000 jtreg-test-output/hotspot/0/JTreport/text/tc_fail2missing.txt │ │ │ │ │ +-rw-r--r-- 0 sbuild (999) sbuild (999) 427790 2026-10-27 10:36:33.000000 jtreg-test-output/hotspot/0/JTreport/text/summary.txt │ │ │ │ │ +-rw-r--r-- 0 sbuild (999) sbuild (999) 7594 2026-10-27 10:36:33.000000 jtreg-test-output/hotspot/0/JTreport/text/testng.txt │ │ │ │ │ +-rw-r--r-- 0 sbuild (999) sbuild (999) 18 2026-10-27 10:36:33.000000 jtreg-test-output/hotspot/0/JTreport/text/newfailures.txt │ │ │ │ │ +-rw-r--r-- 0 sbuild (999) sbuild (999) 18 2026-10-27 10:36:33.000000 jtreg-test-output/hotspot/0/JTreport/text/fail2notrun.txt │ │ │ │ │ +-rw-r--r-- 0 sbuild (999) sbuild (999) 19 2026-10-27 10:36:33.000000 jtreg-test-output/hotspot/0/JTreport/text/tc_fail2pass.txt │ │ │ │ │ +-rw-r--r-- 0 sbuild (999) sbuild (999) 21 2026-10-27 10:36:33.000000 jtreg-test-output/hotspot/0/JTreport/text/tc_newfailures.txt │ │ │ │ │ +-rw-r--r-- 0 sbuild (999) sbuild (999) 722 2026-10-27 10:36:33.000000 jtreg-test-output/hotspot/0/JTreport/index.html │ │ │ │ │ +-rw-r--r-- 0 sbuild (999) sbuild (999) 0 2026-10-27 10:36:33.000000 jtreg-test-output/hotspot/0/JTreport/reportdir.dat │ │ │ │ │ +drwxr-xr-x 0 sbuild (999) sbuild (999) 0 2026-10-27 10:36:33.000000 jtreg-test-output/hotspot/0/JTreport/html/ │ │ │ │ │ +-rw-r--r-- 0 sbuild (999) sbuild (999) 568191 2026-10-27 10:36:33.000000 jtreg-test-output/hotspot/0/JTreport/html/passed_gr.html │ │ │ │ │ +-rw-r--r-- 0 sbuild (999) sbuild (999) 526860 2026-10-27 10:36:33.000000 jtreg-test-output/hotspot/0/JTreport/html/index.html │ │ │ │ │ +-rw-r--r-- 0 sbuild (999) sbuild (999) 20588 2026-10-27 10:36:33.000000 jtreg-test-output/hotspot/0/JTreport/html/excluded.html │ │ │ │ │ +-rw-r--r-- 0 sbuild (999) sbuild (999) 522 2026-10-27 10:36:33.000000 jtreg-test-output/hotspot/0/JTreport/html/error_gr.html │ │ │ │ │ +-rw-r--r-- 0 sbuild (999) sbuild (999) 526860 2026-10-27 10:36:33.000000 jtreg-test-output/hotspot/0/JTreport/html/report.html │ │ │ │ │ +-rw-r--r-- 0 sbuild (999) sbuild (999) 72213 2026-10-27 10:36:33.000000 jtreg-test-output/hotspot/0/JTreport/html/notRun.html │ │ │ │ │ +-rw-r--r-- 0 sbuild (999) sbuild (999) 466 2026-10-27 10:36:33.000000 jtreg-test-output/hotspot/0/JTreport/html/failed.html │ │ │ │ │ +-rw-r--r-- 0 sbuild (999) sbuild (999) 474 2026-10-27 10:36:33.000000 jtreg-test-output/hotspot/0/JTreport/html/error.html │ │ │ │ │ +-rw-r--r-- 0 sbuild (999) sbuild (999) 72558 2026-10-27 10:36:33.000000 jtreg-test-output/hotspot/0/JTreport/html/notRun_gr.html │ │ │ │ │ +-rw-r--r-- 0 sbuild (999) sbuild (999) 4130 2026-10-27 10:36:33.000000 jtreg-test-output/hotspot/0/JTreport/html/env.html │ │ │ │ │ +-rw-r--r-- 0 sbuild (999) sbuild (999) 307 2026-10-27 10:36:33.000000 jtreg-test-output/hotspot/0/JTreport/html/report.css │ │ │ │ │ +-rw-r--r-- 0 sbuild (999) sbuild (999) 514 2026-10-27 10:36:33.000000 jtreg-test-output/hotspot/0/JTreport/html/failed_gr.html │ │ │ │ │ +-rw-r--r-- 0 sbuild (999) sbuild (999) 78257 2026-10-27 10:36:33.000000 jtreg-test-output/hotspot/0/JTreport/html/config.html │ │ │ │ │ +-rw-r--r-- 0 sbuild (999) sbuild (999) 567636 2026-10-27 10:36:33.000000 jtreg-test-output/hotspot/0/JTreport/html/passed.html │ │ │ │ │ +lrwxrwxrwx 0 sbuild (999) sbuild (999) 0 2026-10-27 17:13:51.000000 jtreg-test-output/jdk/JTreport -> 2/JTreport │ │ │ │ │ +drwxr-xr-x 0 sbuild (999) sbuild (999) 0 2026-10-27 17:11:52.000000 jtreg-test-output/jdk/0/JTreport/ │ │ │ │ │ +drwxr-xr-x 0 sbuild (999) sbuild (999) 0 2026-10-27 17:11:52.000000 jtreg-test-output/jdk/0/JTreport/text/ │ │ │ │ │ +-rw-r--r-- 0 sbuild (999) sbuild (999) 17 2026-10-27 17:11:52.000000 jtreg-test-output/jdk/0/JTreport/text/faiL2error.txt │ │ │ │ │ +-rw-r--r-- 0 sbuild (999) sbuild (999) 16 2026-10-27 17:11:52.000000 jtreg-test-output/jdk/0/JTreport/text/fail2fail.txt │ │ │ │ │ +-rw-r--r-- 0 sbuild (999) sbuild (999) 19 2026-10-27 17:11:52.000000 jtreg-test-output/jdk/0/JTreport/text/other_errors.txt │ │ │ │ │ +-rw-r--r-- 0 sbuild (999) sbuild (999) 19 2026-10-27 17:11:52.000000 jtreg-test-output/jdk/0/JTreport/text/fail2missing.txt │ │ │ │ │ +-rw-r--r-- 0 sbuild (999) sbuild (999) 173 2026-10-27 17:11:52.000000 jtreg-test-output/jdk/0/JTreport/text/stats.txt │ │ │ │ │ +-rw-r--r-- 0 sbuild (999) sbuild (999) 1127 2026-10-27 17:11:52.000000 jtreg-test-output/jdk/0/JTreport/text/timeStats.txt │ │ │ │ │ +-rw-r--r-- 0 sbuild (999) sbuild (999) 83295 2026-10-27 17:11:52.000000 jtreg-test-output/jdk/0/JTreport/text/junit.txt │ │ │ │ │ +-rw-r--r-- 0 sbuild (999) sbuild (999) 16 2026-10-27 17:11:52.000000 jtreg-test-output/jdk/0/JTreport/text/fail2pass.txt │ │ │ │ │ +-rw-r--r-- 0 sbuild (999) sbuild (999) 528 2026-10-27 11:49:00.000000 jtreg-test-output/jdk/0/JTreport/text/cmdArgs.txt │ │ │ │ │ +-rw-r--r-- 0 sbuild (999) sbuild (999) 40569 2026-10-27 17:11:52.000000 jtreg-test-output/jdk/0/JTreport/text/notRun.txt │ │ │ │ │ +-rw-r--r-- 0 sbuild (999) sbuild (999) 21 2026-10-27 17:11:52.000000 jtreg-test-output/jdk/0/JTreport/text/tc_fail2notrun.txt │ │ │ │ │ +-rw-r--r-- 0 sbuild (999) sbuild (999) 20 2026-10-27 17:11:52.000000 jtreg-test-output/jdk/0/JTreport/text/tc_fail2error.txt │ │ │ │ │ +-rw-r--r-- 0 sbuild (999) sbuild (999) 22 2026-10-27 17:11:52.000000 jtreg-test-output/jdk/0/JTreport/text/tc_fail2missing.txt │ │ │ │ │ +-rw-r--r-- 0 sbuild (999) sbuild (999) 878212 2026-10-27 17:11:52.000000 jtreg-test-output/jdk/0/JTreport/text/summary.txt │ │ │ │ │ +-rw-r--r-- 0 sbuild (999) sbuild (999) 129170 2026-10-27 17:11:52.000000 jtreg-test-output/jdk/0/JTreport/text/testng.txt │ │ │ │ │ +-rw-r--r-- 0 sbuild (999) sbuild (999) 416 2026-10-27 17:11:52.000000 jtreg-test-output/jdk/0/JTreport/text/newfailures.txt │ │ │ │ │ +-rw-r--r-- 0 sbuild (999) sbuild (999) 18 2026-10-27 17:11:52.000000 jtreg-test-output/jdk/0/JTreport/text/fail2notrun.txt │ │ │ │ │ +-rw-r--r-- 0 sbuild (999) sbuild (999) 19 2026-10-27 17:11:52.000000 jtreg-test-output/jdk/0/JTreport/text/tc_fail2pass.txt │ │ │ │ │ +-rw-r--r-- 0 sbuild (999) sbuild (999) 21 2026-10-27 17:11:52.000000 jtreg-test-output/jdk/0/JTreport/text/tc_newfailures.txt │ │ │ │ │ +-rw-r--r-- 0 sbuild (999) sbuild (999) 708 2026-10-27 17:11:52.000000 jtreg-test-output/jdk/0/JTreport/index.html │ │ │ │ │ +-rw-r--r-- 0 sbuild (999) sbuild (999) 0 2026-10-27 17:11:52.000000 jtreg-test-output/jdk/0/JTreport/reportdir.dat │ │ │ │ │ +drwxr-xr-x 0 sbuild (999) sbuild (999) 0 2026-10-27 17:11:52.000000 jtreg-test-output/jdk/0/JTreport/html/ │ │ │ │ │ +-rw-r--r-- 0 sbuild (999) sbuild (999) 1233833 2026-10-27 17:11:52.000000 jtreg-test-output/jdk/0/JTreport/html/passed_gr.html │ │ │ │ │ +-rw-r--r-- 0 sbuild (999) sbuild (999) 1123733 2026-10-27 17:11:52.000000 jtreg-test-output/jdk/0/JTreport/html/index.html │ │ │ │ │ +-rw-r--r-- 0 sbuild (999) sbuild (999) 85437 2026-10-27 17:11:52.000000 jtreg-test-output/jdk/0/JTreport/html/excluded.html │ │ │ │ │ +-rw-r--r-- 0 sbuild (999) sbuild (999) 521 2026-10-27 17:11:52.000000 jtreg-test-output/jdk/0/JTreport/html/error_gr.html │ │ │ │ │ +-rw-r--r-- 0 sbuild (999) sbuild (999) 1123733 2026-10-27 17:11:52.000000 jtreg-test-output/jdk/0/JTreport/html/report.html │ │ │ │ │ +-rw-r--r-- 0 sbuild (999) sbuild (999) 30418 2026-10-27 17:11:52.000000 jtreg-test-output/jdk/0/JTreport/html/notRun.html │ │ │ │ │ +-rw-r--r-- 0 sbuild (999) sbuild (999) 2020 2026-10-27 17:11:52.000000 jtreg-test-output/jdk/0/JTreport/html/failed.html │ │ │ │ │ +-rw-r--r-- 0 sbuild (999) sbuild (999) 473 2026-10-27 17:11:52.000000 jtreg-test-output/jdk/0/JTreport/html/error.html │ │ │ │ │ +-rw-r--r-- 0 sbuild (999) sbuild (999) 30763 2026-10-27 17:11:52.000000 jtreg-test-output/jdk/0/JTreport/html/notRun_gr.html │ │ │ │ │ +-rw-r--r-- 0 sbuild (999) sbuild (999) 4107 2026-10-27 17:11:52.000000 jtreg-test-output/jdk/0/JTreport/html/env.html │ │ │ │ │ +-rw-r--r-- 0 sbuild (999) sbuild (999) 307 2026-10-27 17:11:52.000000 jtreg-test-output/jdk/0/JTreport/html/report.css │ │ │ │ │ +-rw-r--r-- 0 sbuild (999) sbuild (999) 2750 2026-10-27 17:11:52.000000 jtreg-test-output/jdk/0/JTreport/html/failed_gr.html │ │ │ │ │ +-rw-r--r-- 0 sbuild (999) sbuild (999) 23924 2026-10-27 17:11:52.000000 jtreg-test-output/jdk/0/JTreport/html/config.html │ │ │ │ │ +-rw-r--r-- 0 sbuild (999) sbuild (999) 1232386 2026-10-27 17:11:52.000000 jtreg-test-output/jdk/0/JTreport/html/passed.html │ │ │ │ │ +drwxr-xr-x 0 sbuild (999) sbuild (999) 0 2026-10-27 17:12:55.000000 jtreg-test-output/jdk/1/JTreport/ │ │ │ │ │ +drwxr-xr-x 0 sbuild (999) sbuild (999) 0 2026-10-27 17:12:55.000000 jtreg-test-output/jdk/1/JTreport/text/ │ │ │ │ │ +-rw-r--r-- 0 sbuild (999) sbuild (999) 17 2026-10-27 17:12:55.000000 jtreg-test-output/jdk/1/JTreport/text/faiL2error.txt │ │ │ │ │ +-rw-r--r-- 0 sbuild (999) sbuild (999) 16 2026-10-27 17:12:55.000000 jtreg-test-output/jdk/1/JTreport/text/fail2fail.txt │ │ │ │ │ +-rw-r--r-- 0 sbuild (999) sbuild (999) 19 2026-10-27 17:12:55.000000 jtreg-test-output/jdk/1/JTreport/text/other_errors.txt │ │ │ │ │ +-rw-r--r-- 0 sbuild (999) sbuild (999) 19 2026-10-27 17:12:55.000000 jtreg-test-output/jdk/1/JTreport/text/fail2missing.txt │ │ │ │ │ +-rw-r--r-- 0 sbuild (999) sbuild (999) 101 2026-10-27 17:12:55.000000 jtreg-test-output/jdk/1/JTreport/text/stats.txt │ │ │ │ │ +-rw-r--r-- 0 sbuild (999) sbuild (999) 116 2026-10-27 17:12:55.000000 jtreg-test-output/jdk/1/JTreport/text/timeStats.txt │ │ │ │ │ +-rw-r--r-- 0 sbuild (999) sbuild (999) 16 2026-10-27 17:12:55.000000 jtreg-test-output/jdk/1/JTreport/text/fail2pass.txt │ │ │ │ │ +-rw-r--r-- 0 sbuild (999) sbuild (999) 547 2026-10-27 17:12:34.000000 jtreg-test-output/jdk/1/JTreport/text/cmdArgs.txt │ │ │ │ │ +-rw-r--r-- 0 sbuild (999) sbuild (999) 1023601 2026-10-27 17:12:55.000000 jtreg-test-output/jdk/1/JTreport/text/notRun.txt │ │ │ │ │ +-rw-r--r-- 0 sbuild (999) sbuild (999) 21 2026-10-27 17:12:55.000000 jtreg-test-output/jdk/1/JTreport/text/tc_fail2notrun.txt │ │ │ │ │ +-rw-r--r-- 0 sbuild (999) sbuild (999) 20 2026-10-27 17:12:55.000000 jtreg-test-output/jdk/1/JTreport/text/tc_fail2error.txt │ │ │ │ │ +-rw-r--r-- 0 sbuild (999) sbuild (999) 22 2026-10-27 17:12:55.000000 jtreg-test-output/jdk/1/JTreport/text/tc_fail2missing.txt │ │ │ │ │ +-rw-r--r-- 0 sbuild (999) sbuild (999) 878212 2026-10-27 17:12:55.000000 jtreg-test-output/jdk/1/JTreport/text/summary.txt │ │ │ │ │ +-rw-r--r-- 0 sbuild (999) sbuild (999) 132 2026-10-27 17:12:55.000000 jtreg-test-output/jdk/1/JTreport/text/testng.txt │ │ │ │ │ +-rw-r--r-- 0 sbuild (999) sbuild (999) 416 2026-10-27 17:12:55.000000 jtreg-test-output/jdk/1/JTreport/text/newfailures.txt │ │ │ │ │ +-rw-r--r-- 0 sbuild (999) sbuild (999) 18 2026-10-27 17:12:55.000000 jtreg-test-output/jdk/1/JTreport/text/fail2notrun.txt │ │ │ │ │ +-rw-r--r-- 0 sbuild (999) sbuild (999) 19 2026-10-27 17:12:55.000000 jtreg-test-output/jdk/1/JTreport/text/tc_fail2pass.txt │ │ │ │ │ +-rw-r--r-- 0 sbuild (999) sbuild (999) 21 2026-10-27 17:12:55.000000 jtreg-test-output/jdk/1/JTreport/text/tc_newfailures.txt │ │ │ │ │ +-rw-r--r-- 0 sbuild (999) sbuild (999) 708 2026-10-27 17:12:55.000000 jtreg-test-output/jdk/1/JTreport/index.html │ │ │ │ │ +-rw-r--r-- 0 sbuild (999) sbuild (999) 0 2026-10-27 17:12:55.000000 jtreg-test-output/jdk/1/JTreport/reportdir.dat │ │ │ │ │ +drwxr-xr-x 0 sbuild (999) sbuild (999) 0 2026-10-27 17:12:55.000000 jtreg-test-output/jdk/1/JTreport/html/ │ │ │ │ │ +-rw-r--r-- 0 sbuild (999) sbuild (999) 1233833 2026-10-27 17:12:55.000000 jtreg-test-output/jdk/1/JTreport/html/passed_gr.html │ │ │ │ │ +-rw-r--r-- 0 sbuild (999) sbuild (999) 1101291 2026-10-27 17:12:55.000000 jtreg-test-output/jdk/1/JTreport/html/index.html │ │ │ │ │ +-rw-r--r-- 0 sbuild (999) sbuild (999) 85437 2026-10-27 17:12:55.000000 jtreg-test-output/jdk/1/JTreport/html/excluded.html │ │ │ │ │ +-rw-r--r-- 0 sbuild (999) sbuild (999) 521 2026-10-27 17:12:55.000000 jtreg-test-output/jdk/1/JTreport/html/error_gr.html │ │ │ │ │ +-rw-r--r-- 0 sbuild (999) sbuild (999) 1101291 2026-10-27 17:12:55.000000 jtreg-test-output/jdk/1/JTreport/html/report.html │ │ │ │ │ +-rw-r--r-- 0 sbuild (999) sbuild (999) 762507 2026-10-27 17:12:55.000000 jtreg-test-output/jdk/1/JTreport/html/notRun.html │ │ │ │ │ +-rw-r--r-- 0 sbuild (999) sbuild (999) 2020 2026-10-27 17:12:55.000000 jtreg-test-output/jdk/1/JTreport/html/failed.html │ │ │ │ │ +-rw-r--r-- 0 sbuild (999) sbuild (999) 473 2026-10-27 17:12:55.000000 jtreg-test-output/jdk/1/JTreport/html/error.html │ │ │ │ │ +-rw-r--r-- 0 sbuild (999) sbuild (999) 762780 2026-10-27 17:12:55.000000 jtreg-test-output/jdk/1/JTreport/html/notRun_gr.html │ │ │ │ │ +-rw-r--r-- 0 sbuild (999) sbuild (999) 4126 2026-10-27 17:12:55.000000 jtreg-test-output/jdk/1/JTreport/html/env.html │ │ │ │ │ +-rw-r--r-- 0 sbuild (999) sbuild (999) 307 2026-10-27 17:12:54.000000 jtreg-test-output/jdk/1/JTreport/html/report.css │ │ │ │ │ +-rw-r--r-- 0 sbuild (999) sbuild (999) 2750 2026-10-27 17:12:55.000000 jtreg-test-output/jdk/1/JTreport/html/failed_gr.html │ │ │ │ │ +-rw-r--r-- 0 sbuild (999) sbuild (999) 24356 2026-10-27 17:12:55.000000 jtreg-test-output/jdk/1/JTreport/html/config.html │ │ │ │ │ +-rw-r--r-- 0 sbuild (999) sbuild (999) 1232386 2026-10-27 17:12:55.000000 jtreg-test-output/jdk/1/JTreport/html/passed.html │ │ │ │ │ +drwxr-xr-x 0 sbuild (999) sbuild (999) 0 2026-10-27 17:13:32.000000 jtreg-test-output/jdk/2/JTreport/ │ │ │ │ │ +drwxr-xr-x 0 sbuild (999) sbuild (999) 0 2026-10-27 17:13:32.000000 jtreg-test-output/jdk/2/JTreport/text/ │ │ │ │ │ +-rw-r--r-- 0 sbuild (999) sbuild (999) 17 2026-10-27 17:13:32.000000 jtreg-test-output/jdk/2/JTreport/text/faiL2error.txt │ │ │ │ │ +-rw-r--r-- 0 sbuild (999) sbuild (999) 16 2026-10-27 17:13:32.000000 jtreg-test-output/jdk/2/JTreport/text/fail2fail.txt │ │ │ │ │ +-rw-r--r-- 0 sbuild (999) sbuild (999) 19 2026-10-27 17:13:32.000000 jtreg-test-output/jdk/2/JTreport/text/other_errors.txt │ │ │ │ │ +-rw-r--r-- 0 sbuild (999) sbuild (999) 19 2026-10-27 17:13:32.000000 jtreg-test-output/jdk/2/JTreport/text/fail2missing.txt │ │ │ │ │ +-rw-r--r-- 0 sbuild (999) sbuild (999) 101 2026-10-27 17:13:32.000000 jtreg-test-output/jdk/2/JTreport/text/stats.txt │ │ │ │ │ +-rw-r--r-- 0 sbuild (999) sbuild (999) 116 2026-10-27 17:13:32.000000 jtreg-test-output/jdk/2/JTreport/text/timeStats.txt │ │ │ │ │ +-rw-r--r-- 0 sbuild (999) sbuild (999) 16 2026-10-27 17:13:32.000000 jtreg-test-output/jdk/2/JTreport/text/fail2pass.txt │ │ │ │ │ +-rw-r--r-- 0 sbuild (999) sbuild (999) 547 2026-10-27 17:13:14.000000 jtreg-test-output/jdk/2/JTreport/text/cmdArgs.txt │ │ │ │ │ +-rw-r--r-- 0 sbuild (999) sbuild (999) 1023601 2026-10-27 17:13:32.000000 jtreg-test-output/jdk/2/JTreport/text/notRun.txt │ │ │ │ │ +-rw-r--r-- 0 sbuild (999) sbuild (999) 21 2026-10-27 17:13:32.000000 jtreg-test-output/jdk/2/JTreport/text/tc_fail2notrun.txt │ │ │ │ │ +-rw-r--r-- 0 sbuild (999) sbuild (999) 20 2026-10-27 17:13:32.000000 jtreg-test-output/jdk/2/JTreport/text/tc_fail2error.txt │ │ │ │ │ +-rw-r--r-- 0 sbuild (999) sbuild (999) 22 2026-10-27 17:13:32.000000 jtreg-test-output/jdk/2/JTreport/text/tc_fail2missing.txt │ │ │ │ │ +-rw-r--r-- 0 sbuild (999) sbuild (999) 878212 2026-10-27 17:13:32.000000 jtreg-test-output/jdk/2/JTreport/text/summary.txt │ │ │ │ │ +-rw-r--r-- 0 sbuild (999) sbuild (999) 132 2026-10-27 17:13:32.000000 jtreg-test-output/jdk/2/JTreport/text/testng.txt │ │ │ │ │ +-rw-r--r-- 0 sbuild (999) sbuild (999) 416 2026-10-27 17:13:32.000000 jtreg-test-output/jdk/2/JTreport/text/newfailures.txt │ │ │ │ │ +-rw-r--r-- 0 sbuild (999) sbuild (999) 18 2026-10-27 17:13:32.000000 jtreg-test-output/jdk/2/JTreport/text/fail2notrun.txt │ │ │ │ │ +-rw-r--r-- 0 sbuild (999) sbuild (999) 19 2026-10-27 17:13:32.000000 jtreg-test-output/jdk/2/JTreport/text/tc_fail2pass.txt │ │ │ │ │ +-rw-r--r-- 0 sbuild (999) sbuild (999) 21 2026-10-27 17:13:32.000000 jtreg-test-output/jdk/2/JTreport/text/tc_newfailures.txt │ │ │ │ │ +-rw-r--r-- 0 sbuild (999) sbuild (999) 708 2026-10-27 17:13:32.000000 jtreg-test-output/jdk/2/JTreport/index.html │ │ │ │ │ +-rw-r--r-- 0 sbuild (999) sbuild (999) 0 2026-10-27 17:13:32.000000 jtreg-test-output/jdk/2/JTreport/reportdir.dat │ │ │ │ │ +drwxr-xr-x 0 sbuild (999) sbuild (999) 0 2026-10-27 17:13:32.000000 jtreg-test-output/jdk/2/JTreport/html/ │ │ │ │ │ +-rw-r--r-- 0 sbuild (999) sbuild (999) 1233833 2026-10-27 17:13:32.000000 jtreg-test-output/jdk/2/JTreport/html/passed_gr.html │ │ │ │ │ +-rw-r--r-- 0 sbuild (999) sbuild (999) 1101291 2026-10-27 17:13:32.000000 jtreg-test-output/jdk/2/JTreport/html/index.html │ │ │ │ │ +-rw-r--r-- 0 sbuild (999) sbuild (999) 85437 2026-10-27 17:13:32.000000 jtreg-test-output/jdk/2/JTreport/html/excluded.html │ │ │ │ │ +-rw-r--r-- 0 sbuild (999) sbuild (999) 521 2026-10-27 17:13:32.000000 jtreg-test-output/jdk/2/JTreport/html/error_gr.html │ │ │ │ │ +-rw-r--r-- 0 sbuild (999) sbuild (999) 1101291 2026-10-27 17:13:32.000000 jtreg-test-output/jdk/2/JTreport/html/report.html │ │ │ │ │ +-rw-r--r-- 0 sbuild (999) sbuild (999) 762507 2026-10-27 17:13:32.000000 jtreg-test-output/jdk/2/JTreport/html/notRun.html │ │ │ │ │ +-rw-r--r-- 0 sbuild (999) sbuild (999) 2020 2026-10-27 17:13:32.000000 jtreg-test-output/jdk/2/JTreport/html/failed.html │ │ │ │ │ +-rw-r--r-- 0 sbuild (999) sbuild (999) 473 2026-10-27 17:13:32.000000 jtreg-test-output/jdk/2/JTreport/html/error.html │ │ │ │ │ +-rw-r--r-- 0 sbuild (999) sbuild (999) 762780 2026-10-27 17:13:32.000000 jtreg-test-output/jdk/2/JTreport/html/notRun_gr.html │ │ │ │ │ +-rw-r--r-- 0 sbuild (999) sbuild (999) 4126 2026-10-27 17:13:32.000000 jtreg-test-output/jdk/2/JTreport/html/env.html │ │ │ │ │ +-rw-r--r-- 0 sbuild (999) sbuild (999) 307 2026-10-27 17:13:32.000000 jtreg-test-output/jdk/2/JTreport/html/report.css │ │ │ │ │ +-rw-r--r-- 0 sbuild (999) sbuild (999) 2750 2026-10-27 17:13:32.000000 jtreg-test-output/jdk/2/JTreport/html/failed_gr.html │ │ │ │ │ +-rw-r--r-- 0 sbuild (999) sbuild (999) 24356 2026-10-27 17:13:32.000000 jtreg-test-output/jdk/2/JTreport/html/config.html │ │ │ │ │ +-rw-r--r-- 0 sbuild (999) sbuild (999) 1232386 2026-10-27 17:13:32.000000 jtreg-test-output/jdk/2/JTreport/html/passed.html │ │ │ │ ├── jtreg-test-output/jdk/2/JTreport/index.html │ │ │ │ │ @@ -3,15 +3,15 @@ │ │ │ │ │ │ │ │ │ │ │ │ │ │ │ │ │ │ │ │ │ │ │ │ │ Report Index │ │ │ │ │ │ │ │ │ │

/build/reproducible-path/openjdk-21-21.0.13+9/test/jdk

│ │ │ │ │ -Date of report : 22 October 2026 15:16:32 │ │ │ │ │ +Date of report : 27 October 2026 17:13:32 │ │ │ │ │ │ │ │ │ │

│ │ │ │ │ HTML Report │ │ │ │ │
Standard JT Harness HTML report. Can show a summary of the results, configuration information, and environment values.

│ │ │ │ │

│ │ │ │ │ Plain Text Report │ │ │ │ │
Standard JT Harness text report showing only test names and their result status string. Suitable for parsing by external program.

│ │ │ │ │ ├── html2text {} │ │ │ │ │ │ @@ -1,8 +1,8 @@ │ │ │ │ │ │ ************ //bbuuiilldd//rreepprroodduucciibbllee--ppaatthh//ooppeennjjddkk--2211--2211..00..1133++99//tteesstt//jjddkk ************ │ │ │ │ │ │ -Date of report : 22 October 2026 15:16:32 │ │ │ │ │ │ +Date of report : 27 October 2026 17:13:32 │ │ │ │ │ │ _H_T_M_L_ _R_e_p_o_r_t │ │ │ │ │ │ Standard JT Harness HTML report. Can show a summary of the results, │ │ │ │ │ │ configuration information, and environment values. │ │ │ │ │ │ _P_l_a_i_n_ _T_e_x_t_ _R_e_p_o_r_t │ │ │ │ │ │ Standard JT Harness text report showing only test names and their result status │ │ │ │ │ │ string. Suitable for parsing by external program. │ │ │ │ ├── jtreg-test-output/jdk/2/JTreport/html/notRun_gr.html │ │ │ │ │ @@ -47657,16 +47657,16 @@ │ │ │ │ │ 000ba280: 6e20 6a61 7661 2e73 6563 7572 6974 792e n java.security. │ │ │ │ │ 000ba290: 6465 6275 6720 6f75 7470 7574 0a0a 3c6c debug output..tools/jlink/JL │ │ │ │ │ 000ba2b0: 696e 6b54 6573 742e 6a61 7661 3a20 5465 inkTest.java: Te │ │ │ │ │ 000ba2c0: 7374 2069 6d61 6765 2063 7265 6174 696f st image creatio │ │ │ │ │ 000ba2d0: 6e0a 3c2f 756c 3e0a 3c68 723e 0a3c 736d n..
.Report gener │ │ │ │ │ -000ba2f0: 6174 6564 206f 6e20 4f63 7420 3232 2c20 ated on Oct 22, │ │ │ │ │ -000ba300: 3230 3236 2033 3a31 363a 3332 e280 af50 2026 3:16:32...P │ │ │ │ │ +000ba2f0: 6174 6564 206f 6e20 4f63 7420 3237 2c20 ated on Oct 27, │ │ │ │ │ +000ba300: 3230 3236 2035 3a31 333a 3332 e280 af50 2026 5:13:32...P │ │ │ │ │ 000ba310: 4d0a 3c62 723e 5573 696e 6720 4a54 2048 M.
Using JT H │ │ │ │ │ 000ba320: 6172 6e65 7373 2036 2e30 2062 3236 3b20 arness 6.0 b26; │ │ │ │ │ 000ba330: 6275 696c 7420 6f6e 204d 6172 6368 2031 built on March 1 │ │ │ │ │ 000ba340: 382c 2032 3032 362c 2031 323a 3030 3a30 8, 2026, 12:00:0 │ │ │ │ │ 000ba350: 30e2 80af 414d 2055 5443 2077 6974 6820 0...AM UTC with │ │ │ │ │ 000ba360: 6f70 656e 6a64 6b20 7665 7273 696f 6e20 openjdk version │ │ │ │ │ 000ba370: 2232 352e 302e 332d 6561 2220 3230 3236 "25.0.3-ea" 2026 │ │ │ │ │ ├── html2text {} │ │ │ │ │ │ @@ -13395,10 +13395,10 @@ │ │ │ │ │ │ * sun/security/smartcardio/TestPresent.java: test that the isCardPresent()/ │ │ │ │ │ │ waitForX() APIs work correctly │ │ │ │ │ │ * sun/security/smartcardio/TestTransmit.java: test transmit() works │ │ │ │ │ │ * sun/security/util/Debug/DebugOptions.java: Option to print extra │ │ │ │ │ │ information in java.security.debug output │ │ │ │ │ │ * tools/jlink/JLinkTest.java: Test image creation │ │ │ │ │ │ =============================================================================== │ │ │ │ │ │ -Report generated on Oct 22, 2026 3:16:32 PM │ │ │ │ │ │ +Report generated on Oct 27, 2026 5:13:32 PM │ │ │ │ │ │ Using JT Harness 6.0 b26; built on March 18, 2026, 12:00:00 AM UTC with openjdk │ │ │ │ │ │ version "25.0.3-ea" 2026-04-21 │ │ │ │ ├── jtreg-test-output/jdk/2/JTreport/html/notRun.html │ │ │ │ │ @@ -47640,16 +47640,16 @@ │ │ │ │ │ 000ba170: 6f64 756c 6573 2f76 616c 6964 6174 652f odules/validate/ │ │ │ │ │ 000ba180: 5661 6c69 6461 7465 4d6f 6475 6c65 7354 ValidateModulesT │ │ │ │ │ 000ba190: 6573 742e 6a61 7661 3a20 4261 7369 6320 est.java: Basic │ │ │ │ │ 000ba1a0: 7465 7374 2066 6f72 206a 6176 6120 2d2d test for java -- │ │ │ │ │ 000ba1b0: 7661 6c69 6461 7465 2d6d 6f64 756c 6573 validate-modules │ │ │ │ │ 000ba1c0: 0a3c 6272 0a3e 0a3c 6872 3e0a 3c73 6d61 ..
.Report genera │ │ │ │ │ -000ba1e0: 7465 6420 6f6e 204f 6374 2032 322c 2032 ted on Oct 22, 2 │ │ │ │ │ -000ba1f0: 3032 3620 333a 3136 3a33 32e2 80af 504d 026 3:16:32...PM │ │ │ │ │ +000ba1e0: 7465 6420 6f6e 204f 6374 2032 372c 2032 ted on Oct 27, 2 │ │ │ │ │ +000ba1f0: 3032 3620 353a 3133 3a33 32e2 80af 504d 026 5:13:32...PM │ │ │ │ │ 000ba200: 0a3c 6272 3e55 7369 6e67 204a 5420 4861 .
Using JT Ha │ │ │ │ │ 000ba210: 726e 6573 7320 362e 3020 6232 363b 2062 rness 6.0 b26; b │ │ │ │ │ 000ba220: 7569 6c74 206f 6e20 4d61 7263 6820 3138 uilt on March 18 │ │ │ │ │ 000ba230: 2c20 3230 3236 2c20 3132 3a30 303a 3030 , 2026, 12:00:00 │ │ │ │ │ 000ba240: e280 af41 4d20 5554 4320 7769 7468 206f ...AM UTC with o │ │ │ │ │ 000ba250: 7065 6e6a 646b 2076 6572 7369 6f6e 2022 penjdk version " │ │ │ │ │ 000ba260: 3235 2e30 2e33 2d65 6122 2032 3032 362d 25.0.3-ea" 2026- │ │ │ │ │ ├── html2text {} │ │ │ │ │ │ @@ -12775,10 +12775,10 @@ │ │ │ │ │ │ tools/launcher/modules/patch/systemmodules/PatchSystemModules.java: Patch │ │ │ │ │ │ java.base and user module with ModuleHashes attribute │ │ │ │ │ │ tools/launcher/modules/showmoduleresolution/ShowModuleResolutionTest.java: │ │ │ │ │ │ Basic test for java --show-module-resolution │ │ │ │ │ │ tools/launcher/modules/validate/ValidateModulesTest.java: Basic test for java - │ │ │ │ │ │ -validate-modules │ │ │ │ │ │ =============================================================================== │ │ │ │ │ │ -Report generated on Oct 22, 2026 3:16:32 PM │ │ │ │ │ │ +Report generated on Oct 27, 2026 5:13:32 PM │ │ │ │ │ │ Using JT Harness 6.0 b26; built on March 18, 2026, 12:00:00 AM UTC with openjdk │ │ │ │ │ │ version "25.0.3-ea" 2026-04-21 │ │ │ │ ├── jtreg-test-output/jdk/2/JTreport/html/error_gr.html │ │ │ │ │ @@ -6,9 +6,9 @@ │ │ │ │ │ │ │ │ │ │ JT Harness : Tests that had errors │ │ │ │ │ │ │ │ │ │ │ │ │ │ │ │ │ │ │ │

JT Harness : Tests that had errors

Tests are grouped by their final status message. │ │ │ │ │
│ │ │ │ │ -Report generated on Oct 22, 2026 3:16:32 PM │ │ │ │ │ +Report generated on Oct 27, 2026 5:13:32 PM │ │ │ │ │
Using JT Harness 6.0 b26; built on March 18, 2026, 12:00:00 AM UTC with openjdk version "25.0.3-ea" 2026-04-21
│ │ │ │ │ ├── html2text {} │ │ │ │ │ │ @@ -1,6 +1,6 @@ │ │ │ │ │ │ ************ JJTT HHaarrnneessss :: TTeessttss tthhaatt hhaadd eerrrroorrss ************ │ │ │ │ │ │ Tests are grouped by their final status message. │ │ │ │ │ │ =============================================================================== │ │ │ │ │ │ -Report generated on Oct 22, 2026 3:16:32 PM │ │ │ │ │ │ +Report generated on Oct 27, 2026 5:13:32 PM │ │ │ │ │ │ Using JT Harness 6.0 b26; built on March 18, 2026, 12:00:00 AM UTC with openjdk │ │ │ │ │ │ version "25.0.3-ea" 2026-04-21 │ │ │ │ ├── jtreg-test-output/jdk/2/JTreport/html/error.html │ │ │ │ │ @@ -6,9 +6,9 @@ │ │ │ │ │ │ │ │ │ │ JT Harness : Tests that had errors │ │ │ │ │ │ │ │ │ │ │ │ │ │ │ │ │ │ │ │

JT Harness : Tests that had errors

│ │ │ │ │
│ │ │ │ │ -Report generated on Oct 22, 2026 3:16:32 PM │ │ │ │ │ +Report generated on Oct 27, 2026 5:13:32 PM │ │ │ │ │
Using JT Harness 6.0 b26; built on March 18, 2026, 12:00:00 AM UTC with openjdk version "25.0.3-ea" 2026-04-21
│ │ │ │ │ ├── html2text {} │ │ │ │ │ │ @@ -1,5 +1,5 @@ │ │ │ │ │ │ ************ JJTT HHaarrnneessss :: TTeessttss tthhaatt hhaadd eerrrroorrss ************ │ │ │ │ │ │ =============================================================================== │ │ │ │ │ │ -Report generated on Oct 22, 2026 3:16:32 PM │ │ │ │ │ │ +Report generated on Oct 27, 2026 5:13:32 PM │ │ │ │ │ │ Using JT Harness 6.0 b26; built on March 18, 2026, 12:00:00 AM UTC with openjdk │ │ │ │ │ │ version "25.0.3-ea" 2026-04-21 │ │ │ │ ├── jtreg-test-output/jdk/2/JTreport/html/failed_gr.html │ │ │ │ │ @@ -56,9 +56,9 @@ │ │ │ │ │
  • │ │ │ │ │ java/net/MulticastSocket/SetLoopbackMode.java: Test MulticastSocket.setLoopbackMode │ │ │ │ │ │ │ │ │ │
  • │ │ │ │ │ java/net/MulticastSocket/SetLoopbackModeIPv4.java: Test MulticastSocket.setLoopbackMode with IPv4 addresses │ │ │ │ │ │ │ │ │ │
    │ │ │ │ │ -Report generated on Oct 22, 2026 3:16:32 PM │ │ │ │ │ +Report generated on Oct 27, 2026 5:13:32 PM │ │ │ │ │
    Using JT Harness 6.0 b26; built on March 18, 2026, 12:00:00 AM UTC with openjdk version "25.0.3-ea" 2026-04-21
    │ │ │ │ │ ├── html2text {} │ │ │ │ │ │ @@ -25,10 +25,10 @@ │ │ │ │ │ │ * _j_a_v_a_/_n_e_t_/_M_u_l_t_i_c_a_s_t_S_o_c_k_e_t_/_N_o_L_o_o_p_b_a_c_k_P_a_c_k_e_t_s_._j_a_v_a: Re-test IPv6 (and │ │ │ │ │ │ specifically MulticastSocket) with latest Linux & USAGI code │ │ │ │ │ │ * _j_a_v_a_/_n_e_t_/_M_u_l_t_i_c_a_s_t_S_o_c_k_e_t_/_S_e_t_L_o_o_p_b_a_c_k_M_o_d_e_._j_a_v_a: Test │ │ │ │ │ │ MulticastSocket.setLoopbackMode │ │ │ │ │ │ * _j_a_v_a_/_n_e_t_/_M_u_l_t_i_c_a_s_t_S_o_c_k_e_t_/_S_e_t_L_o_o_p_b_a_c_k_M_o_d_e_I_P_v_4_._j_a_v_a: Test │ │ │ │ │ │ MulticastSocket.setLoopbackMode with IPv4 addresses │ │ │ │ │ │ =============================================================================== │ │ │ │ │ │ -Report generated on Oct 22, 2026 3:16:32 PM │ │ │ │ │ │ +Report generated on Oct 27, 2026 5:13:32 PM │ │ │ │ │ │ Using JT Harness 6.0 b26; built on March 18, 2026, 12:00:00 AM UTC with openjdk │ │ │ │ │ │ version "25.0.3-ea" 2026-04-21 │ │ │ │ ├── jtreg-test-output/jdk/2/JTreport/html/failed.html │ │ │ │ │ @@ -33,9 +33,9 @@ │ │ │ │ │ java/net/SocketPermission/SocketPermissionTest.java: SocketPermission tests for legacy socket types. │ │ │ │ │
    │ │ │ │ │ sun/security/krb5/auto/Addresses.java: fix krb5 caddr │ │ │ │ │
    │ │ │ │ │
    │ │ │ │ │ -Report generated on Oct 22, 2026 3:16:32 PM │ │ │ │ │ +Report generated on Oct 27, 2026 5:13:32 PM │ │ │ │ │
    Using JT Harness 6.0 b26; built on March 18, 2026, 12:00:00 AM UTC with openjdk version "25.0.3-ea" 2026-04-21
    │ │ │ │ │ ├── html2text {} │ │ │ │ │ │ @@ -11,10 +11,10 @@ │ │ │ │ │ │ MulticastSocket.setLoopbackMode with IPv4 addresses │ │ │ │ │ │ _j_a_v_a_/_n_e_t_/_M_u_l_t_i_c_a_s_t_S_o_c_k_e_t_/_T_e_s_t_._j_a_v_a: IPv4 and IPv6 multicasting broken on Linux │ │ │ │ │ │ _j_a_v_a_/_n_e_t_/_S_o_c_k_e_t_O_p_t_i_o_n_/_O_p_t_i_o_n_s_T_e_s_t_._j_a_v_a: │ │ │ │ │ │ _j_a_v_a_/_n_e_t_/_S_o_c_k_e_t_P_e_r_m_i_s_s_i_o_n_/_S_o_c_k_e_t_P_e_r_m_i_s_s_i_o_n_T_e_s_t_._j_a_v_a: SocketPermission tests for │ │ │ │ │ │ legacy socket types. │ │ │ │ │ │ _s_u_n_/_s_e_c_u_r_i_t_y_/_k_r_b_5_/_a_u_t_o_/_A_d_d_r_e_s_s_e_s_._j_a_v_a: fix krb5 caddr │ │ │ │ │ │ =============================================================================== │ │ │ │ │ │ -Report generated on Oct 22, 2026 3:16:32 PM │ │ │ │ │ │ +Report generated on Oct 27, 2026 5:13:32 PM │ │ │ │ │ │ Using JT Harness 6.0 b26; built on March 18, 2026, 12:00:00 AM UTC with openjdk │ │ │ │ │ │ version "25.0.3-ea" 2026-04-21 │ │ │ │ ├── jtreg-test-output/jdk/2/JTreport/html/passed_gr.html │ │ │ │ │ @@ -242,76878 +242,76874 @@ │ │ │ │ │ 00000f10: 7373 6669 6c65 2f65 7861 6d70 6c65 732f ssfile/examples/ │ │ │ │ │ 00000f20: 5472 616e 7366 6f72 6d45 7861 6d70 6c65 TransformExample │ │ │ │ │ 00000f30: 732e 6a61 7661 3c2f 613e 3a20 5465 7374 s.java: Test │ │ │ │ │ 00000f40: 696e 6720 436c 6173 7366 696c 6520 5472 ing Classfile Tr │ │ │ │ │ 00000f50: 616e 7366 6f72 6d45 7861 6d70 6c65 7320 ansformExamples │ │ │ │ │ 00000f60: 636f 6d70 696c 6174 696f 6e2e 0a3c 2f75 compilation....

    DEBUG: [ │ │ │ │ │ -00000f80: 4874 7470 436c 6965 6e74 2d31 2d53 656c HttpClient-1-Sel │ │ │ │ │ -00000f90: 6563 746f 724d 616e 6167 6572 5d20 5b33 ectorManager] [3 │ │ │ │ │ -00000fa0: 7320 3738 326d 735d 2053 6f63 6b65 7454 s 782ms] SocketT │ │ │ │ │ -00000fb0: 7562 6528 3133 2920 7369 676e 616c 2072 ube(13) signal r │ │ │ │ │ -00000fc0: 6561 6420 6572 726f 723a 206a 6176 612e ead error: java. │ │ │ │ │ -00000fd0: 696f 2e49 4f45 7863 6570 7469 6f6e 3a20 io.IOException: │ │ │ │ │ -00000fe0: 636f 6e6e 6563 7469 6f6e 2063 6c6f 7365 connection close │ │ │ │ │ -00000ff0: 6420 6c6f 6361 6c6c 793c 2f68 343e 0a0a d locally

    .. │ │ │ │ │ -00001000: 3c75 6c3e 0a3c 6c69 3e0a 3c61 2068 7265 ..

    DEBUG │ │ │ │ │ -00001080: 3a20 5b48 7474 7043 6c69 656e 742d 322d : [HttpClient-2- │ │ │ │ │ -00001090: 5365 6c65 6374 6f72 4d61 6e61 6765 725d SelectorManager] │ │ │ │ │ -000010a0: 205b 3136 7320 3633 326d 735d 2053 656c [16s 632ms] Sel │ │ │ │ │ -000010b0: 6563 746f 7241 7474 6163 686d 656e 7420 ectorAttachment │ │ │ │ │ -000010c0: 6b65 7920 6361 6e63 656c 6c65 6420 666f key cancelled fo │ │ │ │ │ -000010d0: 7220 6a61 7661 2e6e 696f 2e63 6861 6e6e r java.nio.chann │ │ │ │ │ -000010e0: 656c 732e 536f 636b 6574 4368 616e 6e65 els.SocketChanne │ │ │ │ │ -000010f0: 6c5b 636c 6f73 6564 5d3c 2f68 343e 0a0a l[closed]

    .. │ │ │ │ │ -00001100: 3c75 6c3e 0a3c 6c69 3e0a 3c61 2068 7265 . │ │ │ │ │ -00001190: 0a3c 6834 3e45 7865 6375 7469 6f6e 2066 .

    Execution f │ │ │ │ │ -000011a0: 6169 6c65 6420 6173 2065 7870 6563 7465 ailed as expecte │ │ │ │ │ -000011b0: 643c 2f68 343e 0a0a 3c75 6c3e 0a3c 6c69 d

    ....

    Exec │ │ │ │ │ -00001890: 7574 696f 6e20 7375 6363 6573 7366 756c ution successful │ │ │ │ │ -000018a0: 3c2f 6834 3e0a 0a3c 756c 3e0a 3c6c 693e

    ... │ │ │ │ │ +000010c0: 0a3c 6834 3e44 4542 5547 3a20 5b48 7474 .

    DEBUG: [Htt │ │ │ │ │ +000010d0: 7043 6c69 656e 742d 3331 2d57 6f72 6b65 pClient-31-Worke │ │ │ │ │ +000010e0: 722d 305d 205b 3273 2031 3835 6d73 5d20 r-0] [2s 185ms] │ │ │ │ │ +000010f0: 5353 4c20 5772 6974 6572 2853 6f63 6b65 SSL Writer(Socke │ │ │ │ │ +00001100: 7454 7562 6528 3331 2929 2053 534c 5265 tTube(31)) SSLRe │ │ │ │ │ +00001110: 7375 6c74 3a20 5374 6174 7573 203d 2043 sult: Status = C │ │ │ │ │ +00001120: 4c4f 5345 4420 4861 6e64 7368 616b 6553 LOSED HandshakeS │ │ │ │ │ +00001130: 7461 7475 7320 3d20 4e4f 545f 4841 4e44 tatus = NOT_HAND │ │ │ │ │ +00001140: 5348 414b 494e 473c 2f68 343e 0a0a 3c75 SHAKING

    ...
  • .j │ │ │ │ │ +000011a0: 6176 612f 6e65 742f 6874 7470 636c 6965 ava/net/httpclie │ │ │ │ │ +000011b0: 6e74 2f68 7474 7032 2f42 6164 4865 6164 nt/http2/BadHead │ │ │ │ │ +000011c0: 6572 7354 6573 742e 6a61 7661 3c2f 613e ersTest.java │ │ │ │ │ +000011d0: 3a20 200a 3c2f 756c 3e0a 0a3c 6834 3e45 : ...

    E │ │ │ │ │ +000011e0: 7865 6375 7469 6f6e 2066 6169 6c65 6420 xecution failed │ │ │ │ │ +000011f0: 6173 2065 7870 6563 7465 643c 2f68 343e as expected

    │ │ │ │ │ +00001200: 0a0a 3c75 6c3e 0a3c 6c69 3e0a 3c61 2068 .. │ │ │ │ │ +000018d0: 0a0a 3c68 343e 4578 6563 7574 696f 6e20 ..

    Execution │ │ │ │ │ +000018e0: 7375 6363 6573 7366 756c 3c2f 6834 3e0a successful

    . │ │ │ │ │ +000018f0: 0a3c 756c 3e0a 3c6c 693e 0a3c 6120 6872 .