--- /srv/rebuilderd/tmp/rebuilderd3fsieM/inputs/openjdk-21-jdk_21.0.13~6ea-1_ppc64el.deb +++ /srv/rebuilderd/tmp/rebuilderd3fsieM/out/openjdk-21-jdk_21.0.13~6ea-1_ppc64el.deb ├── file list │ @@ -1,3 +1,3 @@ │ -rw-r--r-- 0 0 0 4 2026-09-15 20:41:53.000000 debian-binary │ -rw-r--r-- 0 0 0 1844 2026-09-15 20:41:53.000000 control.tar.xz │ --rw-r--r-- 0 0 0 3600072 2026-09-15 20:41:53.000000 data.tar.xz │ +-rw-r--r-- 0 0 0 4541384 2026-09-15 20:41:53.000000 data.tar.xz ├── control.tar.xz │ ├── control.tar │ │ ├── ./control │ │ │ @@ -1,13 +1,13 @@ │ │ │ Package: openjdk-21-jdk │ │ │ Source: openjdk-21 │ │ │ Version: 21.0.13~6ea-1 │ │ │ Architecture: ppc64el │ │ │ Maintainer: OpenJDK Team │ │ │ -Installed-Size: 3774 │ │ │ +Installed-Size: 4835 │ │ │ Depends: openjdk-21-jre (= 21.0.13~6ea-1), openjdk-21-jdk-headless (= 21.0.13~6ea-1), libc6 (>= 2.34), zlib1g (>= 1:1.1.4) │ │ │ Recommends: libxt-dev │ │ │ Suggests: openjdk-21-demo, openjdk-21-source, visualvm │ │ │ Provides: java-compiler, java-sdk (= 21), java10-sdk, java11-sdk, java12-sdk, java13-sdk, java14-sdk, java15-sdk, java16-sdk, java17-sdk, java18-sdk, java19-sdk, java2-sdk, java20-sdk, java21-sdk, java5-sdk, java6-sdk, java7-sdk, java8-sdk, java9-sdk │ │ │ Section: java │ │ │ Priority: optional │ │ │ Multi-Arch: same │ │ ├── ./md5sums │ │ │ ├── ./md5sums │ │ │ │┄ Files differ ├── data.tar.xz │ ├── data.tar │ │ ├── file list │ │ │ @@ -13,17 +13,17 @@ │ │ │ drwxr-xr-x 0 root (0) root (0) 0 2026-09-15 20:41:53.000000 ./usr/lib/jvm/java-21-openjdk-ppc64el/man/man1/ │ │ │ -rw-r--r-- 0 root (0) root (0) 1723 2026-09-15 20:41:53.000000 ./usr/lib/jvm/java-21-openjdk-ppc64el/man/man1/jconsole.1.gz │ │ │ drwxr-xr-x 0 root (0) root (0) 0 2026-09-15 20:41:53.000000 ./usr/lib/jvm/openjdk-21/ │ │ │ drwxr-xr-x 0 root (0) root (0) 0 2026-09-15 20:41:53.000000 ./usr/share/ │ │ │ drwxr-xr-x 0 root (0) root (0) 0 2026-09-15 20:41:53.000000 ./usr/share/doc/ │ │ │ drwxr-xr-x 0 root (0) root (0) 0 2026-09-15 20:41:53.000000 ./usr/share/doc/openjdk-21-jre-headless/ │ │ │ drwxr-xr-x 0 root (0) root (0) 0 2026-09-15 20:41:53.000000 ./usr/share/doc/openjdk-21-jre-headless/test-ppc64el/ │ │ │ --rw-r--r-- 0 root (0) root (0) 27532 2026-09-15 20:41:53.000000 ./usr/share/doc/openjdk-21-jre-headless/test-ppc64el/check-hotspot-hotspot.log.gz │ │ │ +-rw-r--r-- 0 root (0) root (0) 27563 2026-09-15 20:41:53.000000 ./usr/share/doc/openjdk-21-jre-headless/test-ppc64el/check-hotspot-hotspot.log.gz │ │ │ -rw-r--r-- 0 root (0) root (0) 3924 2026-09-15 20:41:53.000000 ./usr/share/doc/openjdk-21-jre-headless/test-ppc64el/check-jaxp-hotspot.log.gz │ │ │ --rw-r--r-- 0 root (0) root (0) 55699 2026-09-15 20:41:53.000000 ./usr/share/doc/openjdk-21-jre-headless/test-ppc64el/check-jdk-hotspot.log.gz │ │ │ +-rw-r--r-- 0 root (0) root (0) 55687 2026-09-15 20:41:53.000000 ./usr/share/doc/openjdk-21-jre-headless/test-ppc64el/check-jdk-hotspot.log.gz │ │ │ -rw-r--r-- 0 root (0) root (0) 35232 2026-09-15 20:41:53.000000 ./usr/share/doc/openjdk-21-jre-headless/test-ppc64el/check-langtools-hotspot.log.gz │ │ │ --rw-r--r-- 0 root (0) root (0) 8598 2026-09-15 20:41:53.000000 ./usr/share/doc/openjdk-21-jre-headless/test-ppc64el/failed_tests-hotspot.tar.gz │ │ │ --rw-r--r-- 0 root (0) root (0) 3443 2026-09-15 20:41:53.000000 ./usr/share/doc/openjdk-21-jre-headless/test-ppc64el/jtreg-summary-hotspot.log │ │ │ --rw-r--r-- 0 root (0) root (0) 126561 2026-09-15 20:41:53.000000 ./usr/share/doc/openjdk-21-jre-headless/test-ppc64el/jtreg_output-hotspot.log.gz │ │ │ --rw-r--r-- 0 root (0) root (0) 3492309 2026-09-15 20:41:53.000000 ./usr/share/doc/openjdk-21-jre-headless/test-ppc64el/jtreport-hotspot.tar.gz │ │ │ +-rw-r--r-- 0 root (0) root (0) 12658 2026-09-15 20:41:53.000000 ./usr/share/doc/openjdk-21-jre-headless/test-ppc64el/failed_tests-hotspot.tar.gz │ │ │ +-rw-r--r-- 0 root (0) root (0) 3721 2026-09-15 20:41:53.000000 ./usr/share/doc/openjdk-21-jre-headless/test-ppc64el/jtreg-summary-hotspot.log │ │ │ +-rw-r--r-- 0 root (0) root (0) 126691 2026-09-15 20:41:53.000000 ./usr/share/doc/openjdk-21-jre-headless/test-ppc64el/jtreg_output-hotspot.log.gz │ │ │ +-rw-r--r-- 0 root (0) root (0) 4574334 2026-09-15 20:41:53.000000 ./usr/share/doc/openjdk-21-jre-headless/test-ppc64el/jtreport-hotspot.tar.gz │ │ │ lrwxrwxrwx 0 root (0) root (0) 0 2026-09-15 20:41:53.000000 ./usr/lib/jvm/openjdk-21/src.zip -> lib/src.zip │ │ │ lrwxrwxrwx 0 root (0) root (0) 0 2026-09-15 20:41:53.000000 ./usr/share/doc/openjdk-21-jdk -> openjdk-21-jre │ │ ├── ./usr/share/doc/openjdk-21-jre-headless/test-ppc64el/check-hotspot-hotspot.log.gz │ │ │ ├── check-hotspot-hotspot.log │ │ │ │ @@ -2243,15 +2243,15 @@ │ │ │ │ Passed: runtime/cds/appcds/dynamicArchive/RegularHiddenClass.java │ │ │ │ Passed: runtime/cds/appcds/dynamicArchive/RelativePath.java │ │ │ │ Passed: runtime/cds/appcds/dynamicArchive/SharedArchiveFileOption.java │ │ │ │ Passed: runtime/cds/appcds/dynamicArchive/SharedBaseAddressOption.java │ │ │ │ Passed: runtime/cds/appcds/dynamicArchive/StaticInnerTest.java │ │ │ │ Passed: runtime/cds/appcds/dynamicArchive/TestAutoCreateSharedArchive.java │ │ │ │ Passed: runtime/cds/appcds/dynamicArchive/TestAutoCreateSharedArchiveNoDefaultArchive.java │ │ │ │ -Passed: runtime/cds/appcds/dynamicArchive/TestAutoCreateSharedArchiveUpgrade.java │ │ │ │ +FAILED: runtime/cds/appcds/dynamicArchive/TestAutoCreateSharedArchiveUpgrade.java │ │ │ │ Passed: runtime/cds/appcds/dynamicArchive/TestDynamicDumpAtOom.java │ │ │ │ Passed: runtime/cds/appcds/dynamicArchive/TestDynamicRegenerateHolderClasses.java │ │ │ │ Passed: runtime/cds/appcds/dynamicArchive/TestLambdaInvokers.java │ │ │ │ Passed: runtime/cds/appcds/dynamicArchive/UnsupportedBaseArchive.java │ │ │ │ Passed: runtime/cds/appcds/dynamicArchive/UnusedCPDuringDump.java │ │ │ │ Passed: runtime/cds/appcds/dynamicArchive/UsedAllArchivedLambdas.java │ │ │ │ Passed: runtime/cds/appcds/dynamicArchive/VerifyObjArrayCloneTest.java │ │ │ │ @@ -2998,14 +2998,22 @@ │ │ │ │ Passed: serviceability/tmtools/jstat/GcCapacityTest.java │ │ │ │ Passed: serviceability/tmtools/jstat/GcCauseTest01.java │ │ │ │ Passed: serviceability/tmtools/jstat/GcCauseTest02.java │ │ │ │ Passed: serviceability/tmtools/jstat/GcCauseTest03.java │ │ │ │ Passed: serviceability/tmtools/jstat/GcNewTest.java │ │ │ │ Passed: serviceability/tmtools/jstat/GcTest01.java │ │ │ │ Passed: serviceability/tmtools/jstat/GcTest02.java │ │ │ │ -Test results: passed: 3,002; skipped: 4; excluded: 43; did not match keywords: 75; did not meet module requirements: 85; did not meet platform requirements: 239 │ │ │ │ +Test results: passed: 3,001; failed: 1; skipped: 4; excluded: 43; did not match keywords: 75; did not meet module requirements: 85; did not meet platform requirements: 239 │ │ │ │ Framework-based tests: 448 = 409 TestNG + 39 JUnit │ │ │ │ Report written to /build/reproducible-path/openjdk-21-21.0.13~6ea/jtreg-test-output/hotspot/0/JTreport/html/report.html │ │ │ │ Results written to /tmp/hotspot/JTwork │ │ │ │ +Directory "jtreg-test-output/hotspot/1/JTreport" not found: creating │ │ │ │ +FAILED: runtime/cds/appcds/dynamicArchive/TestAutoCreateSharedArchiveUpgrade.java │ │ │ │ +Test results: failed: 1; excluded: 43; did not match keywords: 75; did not match prior status: 3,325 │ │ │ │ +Report written to /build/reproducible-path/openjdk-21-21.0.13~6ea/jtreg-test-output/hotspot/1/JTreport/html/report.html │ │ │ │ +Results written to /tmp/hotspot/JTwork │ │ │ │ +Directory "jtreg-test-output/hotspot/2/JTreport" not found: creating │ │ │ │ +FAILED: runtime/cds/appcds/dynamicArchive/TestAutoCreateSharedArchiveUpgrade.java │ │ │ │ +Test results: failed: 1; excluded: 43; did not match keywords: 75; did not match prior status: 3,325 │ │ │ │ +Report written to /build/reproducible-path/openjdk-21-21.0.13~6ea/jtreg-test-output/hotspot/2/JTreport/html/report.html │ │ │ │ +Results written to /tmp/hotspot/JTwork │ │ │ │ [debian/tests/jtreg-autopkgtest.sh] nothing to cleanup │ │ │ │ -Unable to compare jtreg results: no build jtreport found for hotspot/ppc64el. │ │ │ │ -Reason: '/usr/share/doc/openjdk-21-jre-headless//test-ppc64el/jtreport-hotspot.tar.gz' does not exist. │ │ ├── ./usr/share/doc/openjdk-21-jre-headless/test-ppc64el/check-jdk-hotspot.log.gz │ │ │ ├── check-jdk-hotspot.log │ │ │ │ @@ -666,15 +666,14 @@ │ │ │ │ Passed: java/io/File/ListRoots.java │ │ │ │ Passed: java/io/File/ListSpace.java │ │ │ │ Passed: java/io/File/MaxPathLength.java │ │ │ │ Passed: java/io/File/Mkdir.java │ │ │ │ Passed: java/io/File/NulFile.java │ │ │ │ Passed: java/io/File/NullArgs.java │ │ │ │ Passed: java/io/File/SetAccess.java │ │ │ │ -Passed: java/io/File/SetLastModified.java │ │ │ │ Passed: java/io/File/SetReadOnly.java │ │ │ │ Passed: java/io/File/SymLinks.java │ │ │ │ Passed: java/io/File/TempDirDoesNotExist.java │ │ │ │ Passed: java/io/File/TimeZoneLastModified.java │ │ │ │ Passed: java/io/File/ToURI.java │ │ │ │ Passed: java/io/File/ToURL.java │ │ │ │ Passed: java/io/File/Unicode.java │ │ │ │ @@ -2670,15 +2669,14 @@ │ │ │ │ Passed: java/nio/channels/AsynchronousSocketChannel/StressLoopback.java │ │ │ │ Passed: java/nio/channels/Channels/Basic.java │ │ │ │ Passed: java/nio/channels/Channels/Basic2.java │ │ │ │ Passed: java/nio/channels/Channels/CloseWriterOnFailedFlush.java │ │ │ │ Passed: java/nio/channels/Channels/EncodingTest.java │ │ │ │ Passed: java/nio/channels/Channels/ReadByte.java │ │ │ │ Passed: java/nio/channels/Channels/ReadOffset.java │ │ │ │ -Passed: java/nio/channels/Channels/ReadXBytes.java │ │ │ │ Passed: java/nio/channels/Channels/ShortWrite.java │ │ │ │ Passed: java/nio/channels/Channels/SocketChannelStreams.java │ │ │ │ Passed: java/nio/channels/Channels/TinyBuffers.java │ │ │ │ Passed: java/nio/channels/Channels/TransferTo_2GB_transferFrom.java │ │ │ │ Passed: java/nio/channels/Channels/TransferTo_2GB_transferTo.java │ │ │ │ Passed: java/nio/channels/Channels/TransferTo.java │ │ │ │ Passed: java/nio/channels/Channels/TransferTo2.java │ │ │ │ @@ -6504,16 +6502,16 @@ │ │ │ │ Passed: tools/launcher/TestXcheckJNIWarnings.java#jdwp-agent │ │ │ │ Passed: tools/launcher/TestXcheckJNIWarnings.java#noagent │ │ │ │ Passed: tools/launcher/ToolsOpts.java │ │ │ │ Passed: tools/launcher/TooSmallStackSize.java │ │ │ │ Passed: tools/launcher/UnicodeTest.java │ │ │ │ Passed: tools/launcher/UnresolvedExceptions.java │ │ │ │ Passed: tools/launcher/VersionCheck.java │ │ │ │ -Test results: passed: 6,499; failed: 9; skipped: 114; excluded: 39; did not match keywords: 37; did not meet module requirements: 3; did not meet platform requirements: 100 │ │ │ │ -Framework-based tests: 335,199 = 164,249 TestNG + 170,950 JUnit │ │ │ │ +Test results: passed: 6,497; failed: 9; skipped: 114; excluded: 39; did not match keywords: 37; did not meet module requirements: 3; did not meet platform requirements: 102 │ │ │ │ +Framework-based tests: 335,180 = 164,230 TestNG + 170,950 JUnit │ │ │ │ Report written to /build/reproducible-path/openjdk-21-21.0.13~6ea/jtreg-test-output/jdk/0/JTreport/html/report.html │ │ │ │ Results written to /tmp/jdk/JTwork │ │ │ │ Directory "jtreg-test-output/jdk/1/JTreport" not found: creating │ │ │ │ FAILED: java/net/MulticastSocket/B6427403.java │ │ │ │ FAILED: java/net/MulticastSocket/NoLoopbackPackets.java │ │ │ │ FAILED: java/net/MulticastSocket/Promiscuous.java │ │ │ │ FAILED: java/net/MulticastSocket/SetLoopbackMode.java │ │ ├── ./usr/share/doc/openjdk-21-jre-headless/test-ppc64el/failed_tests-hotspot.tar.gz │ │ │ ├── failed_tests-hotspot.tar │ │ │ │ ├── file list │ │ │ │ │ @@ -1,9 +1,10 @@ │ │ │ │ │ --rw-r--r-- 0 sbuild (999) sbuild (999) 6836 2026-09-16 09:11:24.000000 jtreg-test-output/jdk/JTwork/java/net/MulticastSocket/B6427403.jtr │ │ │ │ │ --rw-r--r-- 0 sbuild (999) sbuild (999) 7863 2026-09-16 09:11:24.000000 jtreg-test-output/jdk/JTwork/java/net/MulticastSocket/NoLoopbackPackets.jtr │ │ │ │ │ --rw-r--r-- 0 sbuild (999) sbuild (999) 7873 2026-09-16 09:11:24.000000 jtreg-test-output/jdk/JTwork/java/net/MulticastSocket/Promiscuous.jtr │ │ │ │ │ --rw-r--r-- 0 sbuild (999) sbuild (999) 8488 2026-09-16 09:11:24.000000 jtreg-test-output/jdk/JTwork/java/net/MulticastSocket/SetLoopbackMode.jtr │ │ │ │ │ --rw-r--r-- 0 sbuild (999) sbuild (999) 8905 2026-09-16 09:11:25.000000 jtreg-test-output/jdk/JTwork/java/net/MulticastSocket/SetLoopbackModeIPv4.jtr │ │ │ │ │ --rw-r--r-- 0 sbuild (999) sbuild (999) 9757 2026-09-16 09:11:25.000000 jtreg-test-output/jdk/JTwork/java/net/MulticastSocket/Test.jtr │ │ │ │ │ --rw-r--r-- 0 sbuild (999) sbuild (999) 7512 2026-09-16 09:11:25.000000 jtreg-test-output/jdk/JTwork/java/net/SocketOption/OptionsTest.jtr │ │ │ │ │ --rw-r--r-- 0 sbuild (999) sbuild (999) 15196 2026-09-16 09:11:29.000000 jtreg-test-output/jdk/JTwork/java/net/SocketPermission/SocketPermissionTest.jtr │ │ │ │ │ --rw-r--r-- 0 sbuild (999) sbuild (999) 25823 2026-09-16 09:11:32.000000 jtreg-test-output/jdk/JTwork/sun/security/krb5/auto/Addresses.jtr │ │ │ │ │ +-rw-r--r-- 0 sbuild (996) sbuild (996) 32453 2026-09-17 04:17:32.000000 jtreg-test-output/hotspot/JTwork/runtime/cds/appcds/dynamicArchive/TestAutoCreateSharedArchiveUpgrade.jtr │ │ │ │ │ +-rw-r--r-- 0 sbuild (996) sbuild (996) 6848 2026-09-17 09:00:20.000000 jtreg-test-output/jdk/JTwork/java/net/MulticastSocket/B6427403.jtr │ │ │ │ │ +-rw-r--r-- 0 sbuild (996) sbuild (996) 7876 2026-09-17 09:00:21.000000 jtreg-test-output/jdk/JTwork/java/net/MulticastSocket/NoLoopbackPackets.jtr │ │ │ │ │ +-rw-r--r-- 0 sbuild (996) sbuild (996) 7882 2026-09-17 09:00:21.000000 jtreg-test-output/jdk/JTwork/java/net/MulticastSocket/Promiscuous.jtr │ │ │ │ │ +-rw-r--r-- 0 sbuild (996) sbuild (996) 8499 2026-09-17 09:00:21.000000 jtreg-test-output/jdk/JTwork/java/net/MulticastSocket/SetLoopbackMode.jtr │ │ │ │ │ +-rw-r--r-- 0 sbuild (996) sbuild (996) 8916 2026-09-17 09:00:21.000000 jtreg-test-output/jdk/JTwork/java/net/MulticastSocket/SetLoopbackModeIPv4.jtr │ │ │ │ │ +-rw-r--r-- 0 sbuild (996) sbuild (996) 9770 2026-09-17 09:00:21.000000 jtreg-test-output/jdk/JTwork/java/net/MulticastSocket/Test.jtr │ │ │ │ │ +-rw-r--r-- 0 sbuild (996) sbuild (996) 7521 2026-09-17 09:00:21.000000 jtreg-test-output/jdk/JTwork/java/net/SocketOption/OptionsTest.jtr │ │ │ │ │ +-rw-r--r-- 0 sbuild (996) sbuild (996) 15202 2026-09-17 09:00:24.000000 jtreg-test-output/jdk/JTwork/java/net/SocketPermission/SocketPermissionTest.jtr │ │ │ │ │ +-rw-r--r-- 0 sbuild (996) sbuild (996) 25839 2026-09-17 09:00:26.000000 jtreg-test-output/jdk/JTwork/sun/security/krb5/auto/Addresses.jtr │ │ │ │ ├── jtreg-test-output/jdk/JTwork/java/net/MulticastSocket/B6427403.jtr │ │ │ │ │ @@ -1,70 +1,70 @@ │ │ │ │ │ #Test Results (version 2) │ │ │ │ │ -#Wed Sep 16 09:11:24 UTC 2026 │ │ │ │ │ +#Thu Sep 17 09:00:20 UTC 2026 │ │ │ │ │ #-----testdescription----- │ │ │ │ │ $file=/build/reproducible-path/openjdk-21-21.0.13~6ea/test/jdk/java/net/MulticastSocket/B6427403.java │ │ │ │ │ $root=/build/reproducible-path/openjdk-21-21.0.13~6ea/test/jdk │ │ │ │ │ keywords=bug6427403 │ │ │ │ │ run=USER_SPECIFIED main B6427403\n │ │ │ │ │ source=B6427403.java │ │ │ │ │ title=java.net.MulticastSocket.joinGroup() reports 'socket closed' │ │ │ │ │ │ │ │ │ │ #-----environment----- │ │ │ │ │ │ │ │ │ │ #-----testresult----- │ │ │ │ │ description=file\:/build/reproducible-path/openjdk-21-21.0.13~6ea/test/jdk/java/net/MulticastSocket/B6427403.java │ │ │ │ │ -elapsed=635 0\:00\:00.635 │ │ │ │ │ -end=Wed Sep 16 09\:11\:24 UTC 2026 │ │ │ │ │ +elapsed=378 0\:00\:00.378 │ │ │ │ │ +end=Thu Sep 17 09\:00\:20 UTC 2026 │ │ │ │ │ environment=regtest │ │ │ │ │ execStatus=Failed. Execution failed\: `main' threw exception\: java.net.SocketException\: No such device (setsockopt failed) │ │ │ │ │ harnessLoaderMode=Classpath Loader │ │ │ │ │ harnessVariety=Full Bundle │ │ │ │ │ hostname=sbuild │ │ │ │ │ -javatestOS=Linux 6.12.107+deb13-powerpc64le (ppc64le) │ │ │ │ │ +javatestOS=Linux 6.12.107+deb13-powerpc64le-64k (ppc64le) │ │ │ │ │ javatestVersion=6.0-ea+b26-2026-03-18-${BUILT_FROM_COMMIT} │ │ │ │ │ jtregVersion=jtreg 8.3 src 1 │ │ │ │ │ script=com.sun.javatest.regtest.exec.RegressionScript │ │ │ │ │ sections=script_messages build main │ │ │ │ │ -start=Wed Sep 16 09\:11\:23 UTC 2026 │ │ │ │ │ +start=Thu Sep 17 09\:00\:20 UTC 2026 │ │ │ │ │ test=java/net/MulticastSocket/B6427403.java │ │ │ │ │ testJDK=/build/reproducible-path/openjdk-21-21.0.13~6ea/build/bootcycle-build/images/jdk │ │ │ │ │ -testJDK_OS=[name\:Linux,arch\:ppc64le,version\:6.12.107+deb13-powerpc64le,family\:linux,simple_arch\:ppc64le,simple_version\:6.12,processors\:8,maxMemory\:33706758144,maxSwap\:182536105984] │ │ │ │ │ +testJDK_OS=[name\:Linux,arch\:ppc64le,version\:6.12.107+deb13-powerpc64le-64k,family\:linux,simple_arch\:ppc64le,simple_version\:6.12,processors\:4,maxMemory\:16541614080,maxSwap\:25769738240] │ │ │ │ │ testJDK_os.arch=ppc64le │ │ │ │ │ testJDK_os.name=Linux │ │ │ │ │ -testJDK_os.version=6.12.107+deb13-powerpc64le │ │ │ │ │ -totalTime=639 │ │ │ │ │ +testJDK_os.version=6.12.107+deb13-powerpc64le-64k │ │ │ │ │ +totalTime=380 │ │ │ │ │ user.name=sbuild │ │ │ │ │ work=/tmp/jdk/JTwork/java/net/MulticastSocket │ │ │ │ │ │ │ │ │ │ #section:script_messages │ │ │ │ │ ----------messages:(4/271)---------- │ │ │ │ │ JDK under test: /build/reproducible-path/openjdk-21-21.0.13~6ea/build/bootcycle-build/images/jdk │ │ │ │ │ openjdk version "21.0.13-ea" 2026-10-20 │ │ │ │ │ OpenJDK Runtime Environment (build 21.0.13-ea+6-1-Debian) │ │ │ │ │ OpenJDK 64-Bit Server VM (build 21.0.13-ea+6-1-Debian, mixed mode, sharing) │ │ │ │ │ │ │ │ │ │ #section:build │ │ │ │ │ -----------messages:(5/178)---------- │ │ │ │ │ +----------messages:(5/177)---------- │ │ │ │ │ command: build B6427403 │ │ │ │ │ reason: Named class compiled on demand │ │ │ │ │ -started: Wed Sep 16 09:11:23.935 UTC 2026 │ │ │ │ │ -finished: Wed Sep 16 09:11:23.968 UTC 2026 │ │ │ │ │ -elapsed time (seconds): 0.033 │ │ │ │ │ +started: Thu Sep 17 09:00:20.647 UTC 2026 │ │ │ │ │ +finished: Thu Sep 17 09:00:20.657 UTC 2026 │ │ │ │ │ +elapsed time (seconds): 0.01 │ │ │ │ │ result: Passed. All files up to date │ │ │ │ │ │ │ │ │ │ #section:main │ │ │ │ │ -----------messages:(8/232)---------- │ │ │ │ │ +----------messages:(8/234)---------- │ │ │ │ │ command: main B6427403 │ │ │ │ │ reason: User specified action: run main B6427403 │ │ │ │ │ -started: Wed Sep 16 09:11:23.970 UTC 2026 │ │ │ │ │ +started: Thu Sep 17 09:00:20.659 UTC 2026 │ │ │ │ │ Mode: agentvm │ │ │ │ │ Agent id: 1 │ │ │ │ │ -Process id: 2451199 │ │ │ │ │ -finished: Wed Sep 16 09:11:24.470 UTC 2026 │ │ │ │ │ -elapsed time (seconds): 0.5 │ │ │ │ │ +Process id: 2546846 │ │ │ │ │ +finished: Thu Sep 17 09:00:20.968 UTC 2026 │ │ │ │ │ +elapsed time (seconds): 0.309 │ │ │ │ │ ----------configuration:(15/668)---------- │ │ │ │ │ Boot Layer │ │ │ │ │ class path: /usr/share/jtreg/lib/javatest.jar │ │ │ │ │ /usr/share/jtreg/lib/jtreg.jar │ │ │ │ │ /usr/share/jtreg/lib/junit-platform-console-standalone.jar │ │ │ │ │ /usr/share/jtreg/lib/testng.jar │ │ │ │ │ /usr/share/jtreg/lib/guice.jar │ │ │ │ ├── jtreg-test-output/jdk/JTwork/java/net/MulticastSocket/NoLoopbackPackets.jtr │ │ │ │ │ @@ -1,75 +1,75 @@ │ │ │ │ │ #Test Results (version 2) │ │ │ │ │ -#Wed Sep 16 09:11:24 UTC 2026 │ │ │ │ │ +#Thu Sep 17 09:00:21 UTC 2026 │ │ │ │ │ #-----testdescription----- │ │ │ │ │ $file=/build/reproducible-path/openjdk-21-21.0.13~6ea/test/jdk/java/net/MulticastSocket/NoLoopbackPackets.java │ │ │ │ │ $root=/build/reproducible-path/openjdk-21-21.0.13~6ea/test/jdk │ │ │ │ │ keywords=bug4742177 │ │ │ │ │ library=/test/lib │ │ │ │ │ requires=os.family \!\= "windows" │ │ │ │ │ run=ASSUMED_ACTION main NoLoopbackPackets\n │ │ │ │ │ source=NoLoopbackPackets.java │ │ │ │ │ title=Re-test IPv6 (and specifically MulticastSocket) with latest Linux & USAGI code │ │ │ │ │ │ │ │ │ │ #-----environment----- │ │ │ │ │ │ │ │ │ │ #-----testresult----- │ │ │ │ │ description=file\:/build/reproducible-path/openjdk-21-21.0.13~6ea/test/jdk/java/net/MulticastSocket/NoLoopbackPackets.java │ │ │ │ │ -elapsed=83 0\:00\:00.083 │ │ │ │ │ -end=Wed Sep 16 09\:11\:24 UTC 2026 │ │ │ │ │ +elapsed=86 0\:00\:00.086 │ │ │ │ │ +end=Thu Sep 17 09\:00\:21 UTC 2026 │ │ │ │ │ environment=regtest │ │ │ │ │ execStatus=Failed. Execution failed\: `main' threw exception\: java.net.SocketException\: No such device (setsockopt failed) │ │ │ │ │ harnessLoaderMode=Classpath Loader │ │ │ │ │ harnessVariety=Full Bundle │ │ │ │ │ hostname=sbuild │ │ │ │ │ -javatestOS=Linux 6.12.107+deb13-powerpc64le (ppc64le) │ │ │ │ │ +javatestOS=Linux 6.12.107+deb13-powerpc64le-64k (ppc64le) │ │ │ │ │ javatestVersion=6.0-ea+b26-2026-03-18-${BUILT_FROM_COMMIT} │ │ │ │ │ jtregVersion=jtreg 8.3 src 1 │ │ │ │ │ script=com.sun.javatest.regtest.exec.RegressionScript │ │ │ │ │ sections=script_messages build main │ │ │ │ │ -start=Wed Sep 16 09\:11\:24 UTC 2026 │ │ │ │ │ +start=Thu Sep 17 09\:00\:20 UTC 2026 │ │ │ │ │ test=java/net/MulticastSocket/NoLoopbackPackets.java │ │ │ │ │ testJDK=/build/reproducible-path/openjdk-21-21.0.13~6ea/build/bootcycle-build/images/jdk │ │ │ │ │ -testJDK_OS=[name\:Linux,arch\:ppc64le,version\:6.12.107+deb13-powerpc64le,family\:linux,simple_arch\:ppc64le,simple_version\:6.12,processors\:8,maxMemory\:33706758144,maxSwap\:182536105984] │ │ │ │ │ +testJDK_OS=[name\:Linux,arch\:ppc64le,version\:6.12.107+deb13-powerpc64le-64k,family\:linux,simple_arch\:ppc64le,simple_version\:6.12,processors\:4,maxMemory\:16541614080,maxSwap\:25769738240] │ │ │ │ │ testJDK_os.arch=ppc64le │ │ │ │ │ testJDK_os.name=Linux │ │ │ │ │ -testJDK_os.version=6.12.107+deb13-powerpc64le │ │ │ │ │ -totalTime=84 │ │ │ │ │ +testJDK_os.version=6.12.107+deb13-powerpc64le-64k │ │ │ │ │ +totalTime=88 │ │ │ │ │ user.name=sbuild │ │ │ │ │ work=/tmp/jdk/JTwork/java/net/MulticastSocket │ │ │ │ │ │ │ │ │ │ #section:script_messages │ │ │ │ │ ----------messages:(7/481)---------- │ │ │ │ │ JDK under test: /build/reproducible-path/openjdk-21-21.0.13~6ea/build/bootcycle-build/images/jdk │ │ │ │ │ openjdk version "21.0.13-ea" 2026-10-20 │ │ │ │ │ OpenJDK Runtime Environment (build 21.0.13-ea+6-1-Debian) │ │ │ │ │ OpenJDK 64-Bit Server VM (build 21.0.13-ea+6-1-Debian, mixed mode, sharing) │ │ │ │ │ Library /test/lib; kind: packages │ │ │ │ │ source directory: /build/reproducible-path/openjdk-21-21.0.13~6ea/test/lib │ │ │ │ │ class directory: /tmp/jdk/JTwork/classes/java/net/MulticastSocket/NoLoopbackPackets.d/test/lib │ │ │ │ │ │ │ │ │ │ #section:build │ │ │ │ │ -----------messages:(5/185)---------- │ │ │ │ │ +----------messages:(5/187)---------- │ │ │ │ │ command: build NoLoopbackPackets │ │ │ │ │ reason: Named class compiled on demand │ │ │ │ │ -started: Wed Sep 16 09:11:24.480 UTC 2026 │ │ │ │ │ -finished: Wed Sep 16 09:11:24.480 UTC 2026 │ │ │ │ │ -elapsed time (seconds): 0.0 │ │ │ │ │ +started: Thu Sep 17 09:00:20.975 UTC 2026 │ │ │ │ │ +finished: Thu Sep 17 09:00:20.976 UTC 2026 │ │ │ │ │ +elapsed time (seconds): 0.001 │ │ │ │ │ result: Passed. All files up to date │ │ │ │ │ │ │ │ │ │ #section:main │ │ │ │ │ ----------messages:(8/264)---------- │ │ │ │ │ command: main NoLoopbackPackets │ │ │ │ │ reason: Assumed action based on file name: run main NoLoopbackPackets │ │ │ │ │ -started: Wed Sep 16 09:11:24.481 UTC 2026 │ │ │ │ │ +started: Thu Sep 17 09:00:20.976 UTC 2026 │ │ │ │ │ Mode: agentvm │ │ │ │ │ Agent id: 1 │ │ │ │ │ -Process id: 2451199 │ │ │ │ │ -finished: Wed Sep 16 09:11:24.560 UTC 2026 │ │ │ │ │ -elapsed time (seconds): 0.079 │ │ │ │ │ +Process id: 2546846 │ │ │ │ │ +finished: Thu Sep 17 09:00:21.060 UTC 2026 │ │ │ │ │ +elapsed time (seconds): 0.084 │ │ │ │ │ ----------configuration:(17/840)---------- │ │ │ │ │ Boot Layer │ │ │ │ │ class path: /usr/share/jtreg/lib/javatest.jar │ │ │ │ │ /usr/share/jtreg/lib/jtreg.jar │ │ │ │ │ /usr/share/jtreg/lib/junit-platform-console-standalone.jar │ │ │ │ │ /usr/share/jtreg/lib/testng.jar │ │ │ │ │ /usr/share/jtreg/lib/guice.jar │ │ │ │ │ @@ -113,15 +113,15 @@ │ │ │ │ │ -Dtest.class.path=/tmp/jdk/JTwork/classes/java/net/MulticastSocket/NoLoopbackPackets.d:/tmp/jdk/JTwork/classes/java/net/MulticastSocket/NoLoopbackPackets.d/test/lib \\ │ │ │ │ │ -Dtest.class.path.prefix=/tmp/jdk/JTwork/classes/java/net/MulticastSocket/NoLoopbackPackets.d:/build/reproducible-path/openjdk-21-21.0.13~6ea/test/jdk/java/net/MulticastSocket:/tmp/jdk/JTwork/classes/java/net/MulticastSocket/NoLoopbackPackets.d/test/lib \\ │ │ │ │ │ -classpath /tmp/jdk/JTwork/classes/java/net/MulticastSocket/NoLoopbackPackets.d:/build/reproducible-path/openjdk-21-21.0.13~6ea/test/jdk/java/net/MulticastSocket:/tmp/jdk/JTwork/classes/java/net/MulticastSocket/NoLoopbackPackets.d/test/lib:/build/reproducible-path/openjdk-21-21.0.13~6ea/test/lib:/usr/share/jtreg/lib/javatest.jar:/usr/share/jtreg/lib/jtreg.jar \\ │ │ │ │ │ NoLoopbackPackets │ │ │ │ │ ----------stdout:(0/0)---------- │ │ │ │ │ ----------stderr:(0/0)---------- │ │ │ │ │ ----------System.out:(1/32)---------- │ │ │ │ │ -joining group: /224.1.1.1:57269 │ │ │ │ │ +joining group: /224.1.1.1:49684 │ │ │ │ │ ----------System.err:(17/1050)---------- │ │ │ │ │ java.net.SocketException: No such device (setsockopt failed) │ │ │ │ │ at java.base/sun.nio.ch.Net.joinOrDrop4(Native Method) │ │ │ │ │ at java.base/sun.nio.ch.Net.join4(Net.java:720) │ │ │ │ │ at java.base/sun.nio.ch.DatagramChannelImpl.innerJoin(DatagramChannelImpl.java:1676) │ │ │ │ │ at java.base/sun.nio.ch.DatagramChannelImpl.join(DatagramChannelImpl.java:1694) │ │ │ │ │ at java.base/sun.nio.ch.DatagramSocketAdaptor.joinGroup(DatagramSocketAdaptor.java:494) │ │ │ │ ├── jtreg-test-output/jdk/JTwork/java/net/MulticastSocket/Promiscuous.jtr │ │ │ │ │ @@ -1,74 +1,74 @@ │ │ │ │ │ #Test Results (version 2) │ │ │ │ │ -#Wed Sep 16 09:11:24 UTC 2026 │ │ │ │ │ +#Thu Sep 17 09:00:21 UTC 2026 │ │ │ │ │ #-----testdescription----- │ │ │ │ │ $file=/build/reproducible-path/openjdk-21-21.0.13~6ea/test/jdk/java/net/MulticastSocket/Promiscuous.java │ │ │ │ │ $root=/build/reproducible-path/openjdk-21-21.0.13~6ea/test/jdk │ │ │ │ │ keywords=bug8014499 bug8219804 othervm │ │ │ │ │ library=/test/lib │ │ │ │ │ run=USER_SPECIFIED main Promiscuous\nUSER_SPECIFIED main/othervm -Djava.net.preferIPv4Stack\=true Promiscuous\n │ │ │ │ │ source=Promiscuous.java │ │ │ │ │ title=Test for interference when two sockets are bound to the same port but joined to different multicast groups │ │ │ │ │ │ │ │ │ │ #-----environment----- │ │ │ │ │ │ │ │ │ │ #-----testresult----- │ │ │ │ │ description=file\:/build/reproducible-path/openjdk-21-21.0.13~6ea/test/jdk/java/net/MulticastSocket/Promiscuous.java │ │ │ │ │ -elapsed=124 0\:00\:00.124 │ │ │ │ │ -end=Wed Sep 16 09\:11\:24 UTC 2026 │ │ │ │ │ +elapsed=105 0\:00\:00.105 │ │ │ │ │ +end=Thu Sep 17 09\:00\:21 UTC 2026 │ │ │ │ │ environment=regtest │ │ │ │ │ execStatus=Failed. Execution failed\: `main' threw exception\: java.net.SocketException\: Network is unreachable │ │ │ │ │ harnessLoaderMode=Classpath Loader │ │ │ │ │ harnessVariety=Full Bundle │ │ │ │ │ hostname=sbuild │ │ │ │ │ -javatestOS=Linux 6.12.107+deb13-powerpc64le (ppc64le) │ │ │ │ │ +javatestOS=Linux 6.12.107+deb13-powerpc64le-64k (ppc64le) │ │ │ │ │ javatestVersion=6.0-ea+b26-2026-03-18-${BUILT_FROM_COMMIT} │ │ │ │ │ jtregVersion=jtreg 8.3 src 1 │ │ │ │ │ script=com.sun.javatest.regtest.exec.RegressionScript │ │ │ │ │ sections=script_messages build main │ │ │ │ │ -start=Wed Sep 16 09\:11\:24 UTC 2026 │ │ │ │ │ +start=Thu Sep 17 09\:00\:21 UTC 2026 │ │ │ │ │ test=java/net/MulticastSocket/Promiscuous.java │ │ │ │ │ testJDK=/build/reproducible-path/openjdk-21-21.0.13~6ea/build/bootcycle-build/images/jdk │ │ │ │ │ -testJDK_OS=[name\:Linux,arch\:ppc64le,version\:6.12.107+deb13-powerpc64le,family\:linux,simple_arch\:ppc64le,simple_version\:6.12,processors\:8,maxMemory\:33706758144,maxSwap\:182536105984] │ │ │ │ │ +testJDK_OS=[name\:Linux,arch\:ppc64le,version\:6.12.107+deb13-powerpc64le-64k,family\:linux,simple_arch\:ppc64le,simple_version\:6.12,processors\:4,maxMemory\:16541614080,maxSwap\:25769738240] │ │ │ │ │ testJDK_os.arch=ppc64le │ │ │ │ │ testJDK_os.name=Linux │ │ │ │ │ -testJDK_os.version=6.12.107+deb13-powerpc64le │ │ │ │ │ -totalTime=125 │ │ │ │ │ +testJDK_os.version=6.12.107+deb13-powerpc64le-64k │ │ │ │ │ +totalTime=105 │ │ │ │ │ user.name=sbuild │ │ │ │ │ work=/tmp/jdk/JTwork/java/net/MulticastSocket │ │ │ │ │ │ │ │ │ │ #section:script_messages │ │ │ │ │ ----------messages:(7/475)---------- │ │ │ │ │ JDK under test: /build/reproducible-path/openjdk-21-21.0.13~6ea/build/bootcycle-build/images/jdk │ │ │ │ │ openjdk version "21.0.13-ea" 2026-10-20 │ │ │ │ │ OpenJDK Runtime Environment (build 21.0.13-ea+6-1-Debian) │ │ │ │ │ OpenJDK 64-Bit Server VM (build 21.0.13-ea+6-1-Debian, mixed mode, sharing) │ │ │ │ │ Library /test/lib; kind: packages │ │ │ │ │ source directory: /build/reproducible-path/openjdk-21-21.0.13~6ea/test/lib │ │ │ │ │ class directory: /tmp/jdk/JTwork/classes/java/net/MulticastSocket/Promiscuous.d/test/lib │ │ │ │ │ │ │ │ │ │ #section:build │ │ │ │ │ -----------messages:(5/181)---------- │ │ │ │ │ +----------messages:(5/179)---------- │ │ │ │ │ command: build Promiscuous │ │ │ │ │ reason: Named class compiled on demand │ │ │ │ │ -started: Wed Sep 16 09:11:24.566 UTC 2026 │ │ │ │ │ -finished: Wed Sep 16 09:11:24.567 UTC 2026 │ │ │ │ │ -elapsed time (seconds): 0.001 │ │ │ │ │ +started: Thu Sep 17 09:00:21.067 UTC 2026 │ │ │ │ │ +finished: Thu Sep 17 09:00:21.067 UTC 2026 │ │ │ │ │ +elapsed time (seconds): 0.0 │ │ │ │ │ result: Passed. All files up to date │ │ │ │ │ │ │ │ │ │ #section:main │ │ │ │ │ ----------messages:(8/240)---------- │ │ │ │ │ command: main Promiscuous │ │ │ │ │ reason: User specified action: run main Promiscuous │ │ │ │ │ -started: Wed Sep 16 09:11:24.567 UTC 2026 │ │ │ │ │ +started: Thu Sep 17 09:00:21.067 UTC 2026 │ │ │ │ │ Mode: agentvm │ │ │ │ │ Agent id: 1 │ │ │ │ │ -Process id: 2451199 │ │ │ │ │ -finished: Wed Sep 16 09:11:24.688 UTC 2026 │ │ │ │ │ -elapsed time (seconds): 0.121 │ │ │ │ │ +Process id: 2546846 │ │ │ │ │ +finished: Thu Sep 17 09:00:21.170 UTC 2026 │ │ │ │ │ +elapsed time (seconds): 0.103 │ │ │ │ │ ----------configuration:(17/828)---------- │ │ │ │ │ Boot Layer │ │ │ │ │ class path: /usr/share/jtreg/lib/javatest.jar │ │ │ │ │ /usr/share/jtreg/lib/jtreg.jar │ │ │ │ │ /usr/share/jtreg/lib/junit-platform-console-standalone.jar │ │ │ │ │ /usr/share/jtreg/lib/testng.jar │ │ │ │ │ /usr/share/jtreg/lib/guice.jar │ │ │ │ │ @@ -112,16 +112,16 @@ │ │ │ │ │ -Dtest.class.path=/tmp/jdk/JTwork/classes/java/net/MulticastSocket/Promiscuous.d:/tmp/jdk/JTwork/classes/java/net/MulticastSocket/Promiscuous.d/test/lib \\ │ │ │ │ │ -Dtest.class.path.prefix=/tmp/jdk/JTwork/classes/java/net/MulticastSocket/Promiscuous.d:/build/reproducible-path/openjdk-21-21.0.13~6ea/test/jdk/java/net/MulticastSocket:/tmp/jdk/JTwork/classes/java/net/MulticastSocket/Promiscuous.d/test/lib \\ │ │ │ │ │ -classpath /tmp/jdk/JTwork/classes/java/net/MulticastSocket/Promiscuous.d:/build/reproducible-path/openjdk-21-21.0.13~6ea/test/jdk/java/net/MulticastSocket:/tmp/jdk/JTwork/classes/java/net/MulticastSocket/Promiscuous.d/test/lib:/build/reproducible-path/openjdk-21-21.0.13~6ea/test/lib:/usr/share/jtreg/lib/javatest.jar:/usr/share/jtreg/lib/jtreg.jar \\ │ │ │ │ │ Promiscuous │ │ │ │ │ ----------stdout:(0/0)---------- │ │ │ │ │ ----------stderr:(0/0)---------- │ │ │ │ │ ----------System.out:(2/58)---------- │ │ │ │ │ -Using port: 38207 │ │ │ │ │ -Sending datagram to: /224.1.1.120/38207 │ │ │ │ │ +Using port: 42218 │ │ │ │ │ +Sending datagram to: /224.1.1.120/42218 │ │ │ │ │ ----------System.err:(18/1123)---------- │ │ │ │ │ java.net.SocketException: Network is unreachable │ │ │ │ │ at java.base/sun.nio.ch.DatagramChannelImpl.send0(Native Method) │ │ │ │ │ at java.base/sun.nio.ch.DatagramChannelImpl.sendFromNativeBuffer(DatagramChannelImpl.java:1005) │ │ │ │ │ at java.base/sun.nio.ch.DatagramChannelImpl.send(DatagramChannelImpl.java:966) │ │ │ │ │ at java.base/sun.nio.ch.DatagramChannelImpl.send(DatagramChannelImpl.java:889) │ │ │ │ │ at java.base/sun.nio.ch.DatagramChannelImpl.blockingSend(DatagramChannelImpl.java:952) │ │ │ │ ├── jtreg-test-output/jdk/JTwork/java/net/MulticastSocket/SetLoopbackMode.jtr │ │ │ │ │ @@ -1,44 +1,44 @@ │ │ │ │ │ #Test Results (version 2) │ │ │ │ │ -#Wed Sep 16 09:11:24 UTC 2026 │ │ │ │ │ +#Thu Sep 17 09:00:21 UTC 2026 │ │ │ │ │ #-----testdescription----- │ │ │ │ │ $file=/build/reproducible-path/openjdk-21-21.0.13~6ea/test/jdk/java/net/MulticastSocket/SetLoopbackMode.java │ │ │ │ │ $root=/build/reproducible-path/openjdk-21-21.0.13~6ea/test/jdk │ │ │ │ │ keywords=bug4686717 othervm │ │ │ │ │ library=/test/lib │ │ │ │ │ modules=java.base/java.net\:+open │ │ │ │ │ run=USER_SPECIFIED build jdk.test.lib.NetworkConfiguration jdk.test.lib.Platform\nUSER_SPECIFIED main/othervm SetLoopbackMode\n │ │ │ │ │ source=SetLoopbackMode.java │ │ │ │ │ title=Test MulticastSocket.setLoopbackMode │ │ │ │ │ │ │ │ │ │ #-----environment----- │ │ │ │ │ │ │ │ │ │ #-----testresult----- │ │ │ │ │ description=file\:/build/reproducible-path/openjdk-21-21.0.13~6ea/test/jdk/java/net/MulticastSocket/SetLoopbackMode.java │ │ │ │ │ -elapsed=194 0\:00\:00.194 │ │ │ │ │ -end=Wed Sep 16 09\:11\:24 UTC 2026 │ │ │ │ │ +elapsed=140 0\:00\:00.140 │ │ │ │ │ +end=Thu Sep 17 09\:00\:21 UTC 2026 │ │ │ │ │ environment=regtest │ │ │ │ │ execStatus=Failed. Execution failed\: `main' threw exception\: java.net.SocketException\: No such device (setsockopt failed) │ │ │ │ │ harnessLoaderMode=Classpath Loader │ │ │ │ │ harnessVariety=Full Bundle │ │ │ │ │ hostname=sbuild │ │ │ │ │ -javatestOS=Linux 6.12.107+deb13-powerpc64le (ppc64le) │ │ │ │ │ +javatestOS=Linux 6.12.107+deb13-powerpc64le-64k (ppc64le) │ │ │ │ │ javatestVersion=6.0-ea+b26-2026-03-18-${BUILT_FROM_COMMIT} │ │ │ │ │ jtregVersion=jtreg 8.3 src 1 │ │ │ │ │ modules=java.base/java.net\:+open │ │ │ │ │ script=com.sun.javatest.regtest.exec.RegressionScript │ │ │ │ │ sections=script_messages build build main │ │ │ │ │ -start=Wed Sep 16 09\:11\:24 UTC 2026 │ │ │ │ │ +start=Thu Sep 17 09\:00\:21 UTC 2026 │ │ │ │ │ test=java/net/MulticastSocket/SetLoopbackMode.java │ │ │ │ │ testJDK=/build/reproducible-path/openjdk-21-21.0.13~6ea/build/bootcycle-build/images/jdk │ │ │ │ │ -testJDK_OS=[name\:Linux,arch\:ppc64le,version\:6.12.107+deb13-powerpc64le,family\:linux,simple_arch\:ppc64le,simple_version\:6.12,processors\:8,maxMemory\:33706758144,maxSwap\:182536105984] │ │ │ │ │ +testJDK_OS=[name\:Linux,arch\:ppc64le,version\:6.12.107+deb13-powerpc64le-64k,family\:linux,simple_arch\:ppc64le,simple_version\:6.12,processors\:4,maxMemory\:16541614080,maxSwap\:25769738240] │ │ │ │ │ testJDK_os.arch=ppc64le │ │ │ │ │ testJDK_os.name=Linux │ │ │ │ │ -testJDK_os.version=6.12.107+deb13-powerpc64le │ │ │ │ │ -totalTime=195 │ │ │ │ │ +testJDK_os.version=6.12.107+deb13-powerpc64le-64k │ │ │ │ │ +totalTime=140 │ │ │ │ │ user.name=sbuild │ │ │ │ │ work=/tmp/jdk/JTwork/java/net/MulticastSocket │ │ │ │ │ │ │ │ │ │ #section:script_messages │ │ │ │ │ ----------messages:(7/479)---------- │ │ │ │ │ JDK under test: /build/reproducible-path/openjdk-21-21.0.13~6ea/build/bootcycle-build/images/jdk │ │ │ │ │ openjdk version "21.0.13-ea" 2026-10-20 │ │ │ │ │ @@ -48,38 +48,38 @@ │ │ │ │ │ source directory: /build/reproducible-path/openjdk-21-21.0.13~6ea/test/lib │ │ │ │ │ class directory: /tmp/jdk/JTwork/classes/java/net/MulticastSocket/SetLoopbackMode.d/test/lib │ │ │ │ │ │ │ │ │ │ #section:build │ │ │ │ │ ----------messages:(5/284)---------- │ │ │ │ │ command: build jdk.test.lib.NetworkConfiguration jdk.test.lib.Platform │ │ │ │ │ reason: User specified action: run build jdk.test.lib.NetworkConfiguration jdk.test.lib.Platform │ │ │ │ │ -started: Wed Sep 16 09:11:24.695 UTC 2026 │ │ │ │ │ -finished: Wed Sep 16 09:11:24.696 UTC 2026 │ │ │ │ │ +started: Thu Sep 17 09:00:21.179 UTC 2026 │ │ │ │ │ +finished: Thu Sep 17 09:00:21.180 UTC 2026 │ │ │ │ │ elapsed time (seconds): 0.001 │ │ │ │ │ result: Passed. All files up to date │ │ │ │ │ │ │ │ │ │ #section:build │ │ │ │ │ ----------messages:(5/183)---------- │ │ │ │ │ command: build SetLoopbackMode │ │ │ │ │ reason: Named class compiled on demand │ │ │ │ │ -started: Wed Sep 16 09:11:24.696 UTC 2026 │ │ │ │ │ -finished: Wed Sep 16 09:11:24.696 UTC 2026 │ │ │ │ │ +started: Thu Sep 17 09:00:21.180 UTC 2026 │ │ │ │ │ +finished: Thu Sep 17 09:00:21.180 UTC 2026 │ │ │ │ │ elapsed time (seconds): 0.0 │ │ │ │ │ result: Passed. All files up to date │ │ │ │ │ │ │ │ │ │ #section:main │ │ │ │ │ ----------messages:(8/411)---------- │ │ │ │ │ command: main SetLoopbackMode │ │ │ │ │ reason: User specified action: run main/othervm SetLoopbackMode │ │ │ │ │ -started: Wed Sep 16 09:11:24.697 UTC 2026 │ │ │ │ │ +started: Thu Sep 17 09:00:21.180 UTC 2026 │ │ │ │ │ Mode: othervm [/othervm specified] │ │ │ │ │ Additional options from @modules: --add-modules java.base --add-exports java.base/java.net=ALL-UNNAMED --add-opens java.base/java.net=ALL-UNNAMED │ │ │ │ │ -Process id: 2451228 │ │ │ │ │ -finished: Wed Sep 16 09:11:24.886 UTC 2026 │ │ │ │ │ -elapsed time (seconds): 0.189 │ │ │ │ │ +Process id: 2546873 │ │ │ │ │ +finished: Thu Sep 17 09:00:21.317 UTC 2026 │ │ │ │ │ +elapsed time (seconds): 0.137 │ │ │ │ │ ----------configuration:(5/139)---------- │ │ │ │ │ Boot Layer │ │ │ │ │ add modules: java.base │ │ │ │ │ add exports: java.base/java.net ALL-UNNAMED │ │ │ │ │ add opens: java.base/java.net ALL-UNNAMED │ │ │ │ │ │ │ │ │ │ ----------System.out:(5/155)---------- │ │ │ │ ├── jtreg-test-output/jdk/JTwork/java/net/MulticastSocket/SetLoopbackModeIPv4.jtr │ │ │ │ │ @@ -1,44 +1,44 @@ │ │ │ │ │ #Test Results (version 2) │ │ │ │ │ -#Wed Sep 16 09:11:25 UTC 2026 │ │ │ │ │ +#Thu Sep 17 09:00:21 UTC 2026 │ │ │ │ │ #-----testdescription----- │ │ │ │ │ $file=/build/reproducible-path/openjdk-21-21.0.13~6ea/test/jdk/java/net/MulticastSocket/SetLoopbackModeIPv4.java │ │ │ │ │ $root=/build/reproducible-path/openjdk-21-21.0.13~6ea/test/jdk │ │ │ │ │ keywords=bug4686717 bug8241786 othervm │ │ │ │ │ library=/test/lib │ │ │ │ │ modules=java.base/java.net\:+open │ │ │ │ │ run=USER_SPECIFIED build jdk.test.lib.NetworkConfiguration jdk.test.lib.Platform SetLoopbackMode SetLoopbackModeIPv4\nUSER_SPECIFIED main/othervm -Djava.net.preferIPv4Stack\=true SetLoopbackModeIPv4\n │ │ │ │ │ source=SetLoopbackModeIPv4.java │ │ │ │ │ title=Test MulticastSocket.setLoopbackMode with IPv4 addresses │ │ │ │ │ │ │ │ │ │ #-----environment----- │ │ │ │ │ │ │ │ │ │ #-----testresult----- │ │ │ │ │ description=file\:/build/reproducible-path/openjdk-21-21.0.13~6ea/test/jdk/java/net/MulticastSocket/SetLoopbackModeIPv4.java │ │ │ │ │ -elapsed=186 0\:00\:00.186 │ │ │ │ │ -end=Wed Sep 16 09\:11\:25 UTC 2026 │ │ │ │ │ +elapsed=123 0\:00\:00.123 │ │ │ │ │ +end=Thu Sep 17 09\:00\:21 UTC 2026 │ │ │ │ │ environment=regtest │ │ │ │ │ execStatus=Failed. Execution failed\: `main' threw exception\: java.net.SocketException\: No such device (setsockopt failed) │ │ │ │ │ harnessLoaderMode=Classpath Loader │ │ │ │ │ harnessVariety=Full Bundle │ │ │ │ │ hostname=sbuild │ │ │ │ │ -javatestOS=Linux 6.12.107+deb13-powerpc64le (ppc64le) │ │ │ │ │ +javatestOS=Linux 6.12.107+deb13-powerpc64le-64k (ppc64le) │ │ │ │ │ javatestVersion=6.0-ea+b26-2026-03-18-${BUILT_FROM_COMMIT} │ │ │ │ │ jtregVersion=jtreg 8.3 src 1 │ │ │ │ │ modules=java.base/java.net\:+open │ │ │ │ │ script=com.sun.javatest.regtest.exec.RegressionScript │ │ │ │ │ sections=script_messages build build main │ │ │ │ │ -start=Wed Sep 16 09\:11\:24 UTC 2026 │ │ │ │ │ +start=Thu Sep 17 09\:00\:21 UTC 2026 │ │ │ │ │ test=java/net/MulticastSocket/SetLoopbackModeIPv4.java │ │ │ │ │ testJDK=/build/reproducible-path/openjdk-21-21.0.13~6ea/build/bootcycle-build/images/jdk │ │ │ │ │ -testJDK_OS=[name\:Linux,arch\:ppc64le,version\:6.12.107+deb13-powerpc64le,family\:linux,simple_arch\:ppc64le,simple_version\:6.12,processors\:8,maxMemory\:33706758144,maxSwap\:182536105984] │ │ │ │ │ +testJDK_OS=[name\:Linux,arch\:ppc64le,version\:6.12.107+deb13-powerpc64le-64k,family\:linux,simple_arch\:ppc64le,simple_version\:6.12,processors\:4,maxMemory\:16541614080,maxSwap\:25769738240] │ │ │ │ │ testJDK_os.arch=ppc64le │ │ │ │ │ testJDK_os.name=Linux │ │ │ │ │ -testJDK_os.version=6.12.107+deb13-powerpc64le │ │ │ │ │ -totalTime=186 │ │ │ │ │ +testJDK_os.version=6.12.107+deb13-powerpc64le-64k │ │ │ │ │ +totalTime=123 │ │ │ │ │ user.name=sbuild │ │ │ │ │ work=/tmp/jdk/JTwork/java/net/MulticastSocket │ │ │ │ │ │ │ │ │ │ #section:script_messages │ │ │ │ │ ----------messages:(7/483)---------- │ │ │ │ │ JDK under test: /build/reproducible-path/openjdk-21-21.0.13~6ea/build/bootcycle-build/images/jdk │ │ │ │ │ openjdk version "21.0.13-ea" 2026-10-20 │ │ │ │ │ @@ -48,38 +48,38 @@ │ │ │ │ │ source directory: /build/reproducible-path/openjdk-21-21.0.13~6ea/test/lib │ │ │ │ │ class directory: /tmp/jdk/JTwork/classes/java/net/MulticastSocket/SetLoopbackModeIPv4.d/test/lib │ │ │ │ │ │ │ │ │ │ #section:build │ │ │ │ │ ----------messages:(5/356)---------- │ │ │ │ │ command: build jdk.test.lib.NetworkConfiguration jdk.test.lib.Platform SetLoopbackMode SetLoopbackModeIPv4 │ │ │ │ │ reason: User specified action: run build jdk.test.lib.NetworkConfiguration jdk.test.lib.Platform SetLoopbackMode SetLoopbackModeIPv4 │ │ │ │ │ -started: Wed Sep 16 09:11:24.892 UTC 2026 │ │ │ │ │ -finished: Wed Sep 16 09:11:24.893 UTC 2026 │ │ │ │ │ +started: Thu Sep 17 09:00:21.321 UTC 2026 │ │ │ │ │ +finished: Thu Sep 17 09:00:21.322 UTC 2026 │ │ │ │ │ elapsed time (seconds): 0.001 │ │ │ │ │ result: Passed. All files up to date │ │ │ │ │ │ │ │ │ │ #section:build │ │ │ │ │ ----------messages:(5/187)---------- │ │ │ │ │ command: build SetLoopbackModeIPv4 │ │ │ │ │ reason: Named class compiled on demand │ │ │ │ │ -started: Wed Sep 16 09:11:24.893 UTC 2026 │ │ │ │ │ -finished: Wed Sep 16 09:11:24.893 UTC 2026 │ │ │ │ │ +started: Thu Sep 17 09:00:21.322 UTC 2026 │ │ │ │ │ +finished: Thu Sep 17 09:00:21.322 UTC 2026 │ │ │ │ │ elapsed time (seconds): 0.0 │ │ │ │ │ result: Passed. All files up to date │ │ │ │ │ │ │ │ │ │ #section:main │ │ │ │ │ ----------messages:(8/483)---------- │ │ │ │ │ command: main -Djava.net.preferIPv4Stack=true SetLoopbackModeIPv4 │ │ │ │ │ reason: User specified action: run main/othervm -Djava.net.preferIPv4Stack=true SetLoopbackModeIPv4 │ │ │ │ │ -started: Wed Sep 16 09:11:24.894 UTC 2026 │ │ │ │ │ +started: Thu Sep 17 09:00:21.322 UTC 2026 │ │ │ │ │ Mode: othervm [/othervm specified] │ │ │ │ │ Additional options from @modules: --add-modules java.base --add-exports java.base/java.net=ALL-UNNAMED --add-opens java.base/java.net=ALL-UNNAMED │ │ │ │ │ -Process id: 2451251 │ │ │ │ │ -finished: Wed Sep 16 09:11:25.075 UTC 2026 │ │ │ │ │ -elapsed time (seconds): 0.181 │ │ │ │ │ +Process id: 2546896 │ │ │ │ │ +finished: Thu Sep 17 09:00:21.443 UTC 2026 │ │ │ │ │ +elapsed time (seconds): 0.121 │ │ │ │ │ ----------configuration:(5/139)---------- │ │ │ │ │ Boot Layer │ │ │ │ │ add modules: java.base │ │ │ │ │ add exports: java.base/java.net ALL-UNNAMED │ │ │ │ │ add opens: java.base/java.net ALL-UNNAMED │ │ │ │ │ │ │ │ │ │ ----------System.out:(5/155)---------- │ │ │ │ ├── jtreg-test-output/jdk/JTwork/java/net/MulticastSocket/Test.jtr │ │ │ │ │ @@ -1,83 +1,83 @@ │ │ │ │ │ #Test Results (version 2) │ │ │ │ │ -#Wed Sep 16 09:11:25 UTC 2026 │ │ │ │ │ +#Thu Sep 17 09:00:21 UTC 2026 │ │ │ │ │ #-----testdescription----- │ │ │ │ │ $file=/build/reproducible-path/openjdk-21-21.0.13~6ea/test/jdk/java/net/MulticastSocket/Test.java │ │ │ │ │ $root=/build/reproducible-path/openjdk-21-21.0.13~6ea/test/jdk │ │ │ │ │ keywords=bug4488458 othervm │ │ │ │ │ library=/test/lib │ │ │ │ │ run=USER_SPECIFIED build jdk.test.lib.NetworkConfiguration jdk.test.lib.Platform\nUSER_SPECIFIED main Test\nUSER_SPECIFIED main/othervm -Djava.net.preferIPv4Stack\=true Test\n │ │ │ │ │ source=Test.java │ │ │ │ │ title=IPv4 and IPv6 multicasting broken on Linux │ │ │ │ │ │ │ │ │ │ #-----environment----- │ │ │ │ │ │ │ │ │ │ #-----testresult----- │ │ │ │ │ description=file\:/build/reproducible-path/openjdk-21-21.0.13~6ea/test/jdk/java/net/MulticastSocket/Test.java │ │ │ │ │ -elapsed=85 0\:00\:00.085 │ │ │ │ │ -end=Wed Sep 16 09\:11\:25 UTC 2026 │ │ │ │ │ +elapsed=77 0\:00\:00.077 │ │ │ │ │ +end=Thu Sep 17 09\:00\:21 UTC 2026 │ │ │ │ │ environment=regtest │ │ │ │ │ execStatus=Failed. Execution failed\: `main' threw exception\: java.lang.Exception\: Test failed - see log file for details │ │ │ │ │ harnessLoaderMode=Classpath Loader │ │ │ │ │ harnessVariety=Full Bundle │ │ │ │ │ hostname=sbuild │ │ │ │ │ -javatestOS=Linux 6.12.107+deb13-powerpc64le (ppc64le) │ │ │ │ │ +javatestOS=Linux 6.12.107+deb13-powerpc64le-64k (ppc64le) │ │ │ │ │ javatestVersion=6.0-ea+b26-2026-03-18-${BUILT_FROM_COMMIT} │ │ │ │ │ jtregVersion=jtreg 8.3 src 1 │ │ │ │ │ script=com.sun.javatest.regtest.exec.RegressionScript │ │ │ │ │ sections=script_messages build build main │ │ │ │ │ -start=Wed Sep 16 09\:11\:25 UTC 2026 │ │ │ │ │ +start=Thu Sep 17 09\:00\:21 UTC 2026 │ │ │ │ │ test=java/net/MulticastSocket/Test.java │ │ │ │ │ testJDK=/build/reproducible-path/openjdk-21-21.0.13~6ea/build/bootcycle-build/images/jdk │ │ │ │ │ -testJDK_OS=[name\:Linux,arch\:ppc64le,version\:6.12.107+deb13-powerpc64le,family\:linux,simple_arch\:ppc64le,simple_version\:6.12,processors\:8,maxMemory\:33706758144,maxSwap\:182536105984] │ │ │ │ │ +testJDK_OS=[name\:Linux,arch\:ppc64le,version\:6.12.107+deb13-powerpc64le-64k,family\:linux,simple_arch\:ppc64le,simple_version\:6.12,processors\:4,maxMemory\:16541614080,maxSwap\:25769738240] │ │ │ │ │ testJDK_os.arch=ppc64le │ │ │ │ │ testJDK_os.name=Linux │ │ │ │ │ -testJDK_os.version=6.12.107+deb13-powerpc64le │ │ │ │ │ -totalTime=87 │ │ │ │ │ +testJDK_os.version=6.12.107+deb13-powerpc64le-64k │ │ │ │ │ +totalTime=79 │ │ │ │ │ user.name=sbuild │ │ │ │ │ work=/tmp/jdk/JTwork/java/net/MulticastSocket │ │ │ │ │ │ │ │ │ │ #section:script_messages │ │ │ │ │ ----------messages:(7/468)---------- │ │ │ │ │ JDK under test: /build/reproducible-path/openjdk-21-21.0.13~6ea/build/bootcycle-build/images/jdk │ │ │ │ │ openjdk version "21.0.13-ea" 2026-10-20 │ │ │ │ │ OpenJDK Runtime Environment (build 21.0.13-ea+6-1-Debian) │ │ │ │ │ OpenJDK 64-Bit Server VM (build 21.0.13-ea+6-1-Debian, mixed mode, sharing) │ │ │ │ │ Library /test/lib; kind: packages │ │ │ │ │ source directory: /build/reproducible-path/openjdk-21-21.0.13~6ea/test/lib │ │ │ │ │ class directory: /tmp/jdk/JTwork/classes/java/net/MulticastSocket/Test.d/test/lib │ │ │ │ │ │ │ │ │ │ #section:build │ │ │ │ │ -----------messages:(5/282)---------- │ │ │ │ │ +----------messages:(5/284)---------- │ │ │ │ │ command: build jdk.test.lib.NetworkConfiguration jdk.test.lib.Platform │ │ │ │ │ reason: User specified action: run build jdk.test.lib.NetworkConfiguration jdk.test.lib.Platform │ │ │ │ │ -started: Wed Sep 16 09:11:25.082 UTC 2026 │ │ │ │ │ -finished: Wed Sep 16 09:11:25.082 UTC 2026 │ │ │ │ │ -elapsed time (seconds): 0.0 │ │ │ │ │ +started: Thu Sep 17 09:00:21.448 UTC 2026 │ │ │ │ │ +finished: Thu Sep 17 09:00:21.449 UTC 2026 │ │ │ │ │ +elapsed time (seconds): 0.001 │ │ │ │ │ result: Passed. All files up to date │ │ │ │ │ │ │ │ │ │ #section:build │ │ │ │ │ ----------messages:(5/172)---------- │ │ │ │ │ command: build Test │ │ │ │ │ reason: Named class compiled on demand │ │ │ │ │ -started: Wed Sep 16 09:11:25.083 UTC 2026 │ │ │ │ │ -finished: Wed Sep 16 09:11:25.083 UTC 2026 │ │ │ │ │ +started: Thu Sep 17 09:00:21.449 UTC 2026 │ │ │ │ │ +finished: Thu Sep 17 09:00:21.449 UTC 2026 │ │ │ │ │ elapsed time (seconds): 0.0 │ │ │ │ │ result: Passed. All files up to date │ │ │ │ │ │ │ │ │ │ #section:main │ │ │ │ │ ----------messages:(8/226)---------- │ │ │ │ │ command: main Test │ │ │ │ │ reason: User specified action: run main Test │ │ │ │ │ -started: Wed Sep 16 09:11:25.083 UTC 2026 │ │ │ │ │ +started: Thu Sep 17 09:00:21.449 UTC 2026 │ │ │ │ │ Mode: agentvm │ │ │ │ │ Agent id: 1 │ │ │ │ │ -Process id: 2451199 │ │ │ │ │ -finished: Wed Sep 16 09:11:25.165 UTC 2026 │ │ │ │ │ -elapsed time (seconds): 0.082 │ │ │ │ │ +Process id: 2546846 │ │ │ │ │ +finished: Thu Sep 17 09:00:21.524 UTC 2026 │ │ │ │ │ +elapsed time (seconds): 0.075 │ │ │ │ │ ----------configuration:(17/814)---------- │ │ │ │ │ Boot Layer │ │ │ │ │ class path: /usr/share/jtreg/lib/javatest.jar │ │ │ │ │ /usr/share/jtreg/lib/jtreg.jar │ │ │ │ │ /usr/share/jtreg/lib/junit-platform-console-standalone.jar │ │ │ │ │ /usr/share/jtreg/lib/testng.jar │ │ │ │ │ /usr/share/jtreg/lib/guice.jar │ │ │ │ ├── jtreg-test-output/jdk/JTwork/java/net/SocketOption/OptionsTest.jtr │ │ │ │ │ @@ -1,74 +1,74 @@ │ │ │ │ │ #Test Results (version 2) │ │ │ │ │ -#Wed Sep 16 09:11:25 UTC 2026 │ │ │ │ │ +#Thu Sep 17 09:00:21 UTC 2026 │ │ │ │ │ #-----testdescription----- │ │ │ │ │ $file=/build/reproducible-path/openjdk-21-21.0.13~6ea/test/jdk/java/net/SocketOption/OptionsTest.java │ │ │ │ │ $root=/build/reproducible-path/openjdk-21-21.0.13~6ea/test/jdk │ │ │ │ │ keywords=bug8036979 bug8072384 bug8044773 bug8225214 bug8233296 bug8234083 othervm │ │ │ │ │ library=/test/lib │ │ │ │ │ requires=\!vm.graal.enabled │ │ │ │ │ run=USER_SPECIFIED main/othervm -Xcheck\:jni OptionsTest\nUSER_SPECIFIED main/othervm -Xcheck\:jni -Djava.net.preferIPv4Stack\=true OptionsTest\nUSER_SPECIFIED main/othervm --limit-modules\=java.base OptionsTest\nUSER_SPECIFIED main/othervm/policy\=options.policy OptionsTest\n │ │ │ │ │ source=OptionsTest.java │ │ │ │ │ title=\ │ │ │ │ │ │ │ │ │ │ #-----environment----- │ │ │ │ │ │ │ │ │ │ #-----testresult----- │ │ │ │ │ description=file\:/build/reproducible-path/openjdk-21-21.0.13~6ea/test/jdk/java/net/SocketOption/OptionsTest.java │ │ │ │ │ -elapsed=210 0\:00\:00.210 │ │ │ │ │ -end=Wed Sep 16 09\:11\:25 UTC 2026 │ │ │ │ │ +elapsed=125 0\:00\:00.125 │ │ │ │ │ +end=Thu Sep 17 09\:00\:21 UTC 2026 │ │ │ │ │ environment=regtest │ │ │ │ │ execStatus=Failed. Execution failed\: `main' threw exception\: java.lang.IllegalArgumentException\: Invalid value 'null' │ │ │ │ │ harnessLoaderMode=Classpath Loader │ │ │ │ │ harnessVariety=Full Bundle │ │ │ │ │ hostname=sbuild │ │ │ │ │ -javatestOS=Linux 6.12.107+deb13-powerpc64le (ppc64le) │ │ │ │ │ +javatestOS=Linux 6.12.107+deb13-powerpc64le-64k (ppc64le) │ │ │ │ │ javatestVersion=6.0-ea+b26-2026-03-18-${BUILT_FROM_COMMIT} │ │ │ │ │ jtregVersion=jtreg 8.3 src 1 │ │ │ │ │ script=com.sun.javatest.regtest.exec.RegressionScript │ │ │ │ │ sections=script_messages build main │ │ │ │ │ -start=Wed Sep 16 09\:11\:25 UTC 2026 │ │ │ │ │ +start=Thu Sep 17 09\:00\:21 UTC 2026 │ │ │ │ │ test=java/net/SocketOption/OptionsTest.java │ │ │ │ │ testJDK=/build/reproducible-path/openjdk-21-21.0.13~6ea/build/bootcycle-build/images/jdk │ │ │ │ │ -testJDK_OS=[name\:Linux,arch\:ppc64le,version\:6.12.107+deb13-powerpc64le,family\:linux,simple_arch\:ppc64le,simple_version\:6.12,processors\:8,maxMemory\:33706758144,maxSwap\:182536105984] │ │ │ │ │ +testJDK_OS=[name\:Linux,arch\:ppc64le,version\:6.12.107+deb13-powerpc64le-64k,family\:linux,simple_arch\:ppc64le,simple_version\:6.12,processors\:4,maxMemory\:16541614080,maxSwap\:25769738240] │ │ │ │ │ testJDK_os.arch=ppc64le │ │ │ │ │ testJDK_os.name=Linux │ │ │ │ │ -testJDK_os.version=6.12.107+deb13-powerpc64le │ │ │ │ │ -totalTime=211 │ │ │ │ │ +testJDK_os.version=6.12.107+deb13-powerpc64le-64k │ │ │ │ │ +totalTime=126 │ │ │ │ │ user.name=sbuild │ │ │ │ │ work=/tmp/jdk/JTwork/java/net/SocketOption │ │ │ │ │ │ │ │ │ │ #section:script_messages │ │ │ │ │ ----------messages:(7/472)---------- │ │ │ │ │ JDK under test: /build/reproducible-path/openjdk-21-21.0.13~6ea/build/bootcycle-build/images/jdk │ │ │ │ │ openjdk version "21.0.13-ea" 2026-10-20 │ │ │ │ │ OpenJDK Runtime Environment (build 21.0.13-ea+6-1-Debian) │ │ │ │ │ OpenJDK 64-Bit Server VM (build 21.0.13-ea+6-1-Debian, mixed mode, sharing) │ │ │ │ │ Library /test/lib; kind: packages │ │ │ │ │ source directory: /build/reproducible-path/openjdk-21-21.0.13~6ea/test/lib │ │ │ │ │ class directory: /tmp/jdk/JTwork/classes/java/net/SocketOption/OptionsTest.d/test/lib │ │ │ │ │ │ │ │ │ │ #section:build │ │ │ │ │ -----------messages:(5/181)---------- │ │ │ │ │ +----------messages:(5/179)---------- │ │ │ │ │ command: build OptionsTest │ │ │ │ │ reason: Named class compiled on demand │ │ │ │ │ -started: Wed Sep 16 09:11:25.171 UTC 2026 │ │ │ │ │ -finished: Wed Sep 16 09:11:25.172 UTC 2026 │ │ │ │ │ -elapsed time (seconds): 0.001 │ │ │ │ │ +started: Thu Sep 17 09:00:21.530 UTC 2026 │ │ │ │ │ +finished: Thu Sep 17 09:00:21.530 UTC 2026 │ │ │ │ │ +elapsed time (seconds): 0.0 │ │ │ │ │ result: Passed. All files up to date │ │ │ │ │ │ │ │ │ │ #section:main │ │ │ │ │ ----------messages:(7/281)---------- │ │ │ │ │ command: main -Xcheck:jni OptionsTest │ │ │ │ │ reason: User specified action: run main/othervm -Xcheck:jni OptionsTest │ │ │ │ │ -started: Wed Sep 16 09:11:25.172 UTC 2026 │ │ │ │ │ +started: Thu Sep 17 09:00:21.530 UTC 2026 │ │ │ │ │ Mode: othervm [/othervm specified] │ │ │ │ │ -Process id: 2451273 │ │ │ │ │ -finished: Wed Sep 16 09:11:25.379 UTC 2026 │ │ │ │ │ -elapsed time (seconds): 0.207 │ │ │ │ │ +Process id: 2546918 │ │ │ │ │ +finished: Thu Sep 17 09:00:21.653 UTC 2026 │ │ │ │ │ +elapsed time (seconds): 0.123 │ │ │ │ │ ----------configuration:(0/0)---------- │ │ │ │ │ ----------System.out:(7/201)---------- │ │ │ │ │ Testing SO_LINGER with:-1 │ │ │ │ │ Testing SO_LINGER with:-2 │ │ │ │ │ Testing SO_LINGER with:-100 │ │ │ │ │ Testing SO_LINGER with:-65534 │ │ │ │ │ Testing SO_LINGER with:-65535 │ │ │ │ ├── jtreg-test-output/jdk/JTwork/java/net/SocketPermission/SocketPermissionTest.jtr │ │ │ │ │ @@ -1,92 +1,92 @@ │ │ │ │ │ #Test Results (version 2) │ │ │ │ │ -#Wed Sep 16 09:11:29 UTC 2026 │ │ │ │ │ +#Thu Sep 17 09:00:24 UTC 2026 │ │ │ │ │ #-----testdescription----- │ │ │ │ │ $file=/build/reproducible-path/openjdk-21-21.0.13~6ea/test/jdk/java/net/SocketPermission/SocketPermissionTest.java │ │ │ │ │ $root=/build/reproducible-path/openjdk-21-21.0.13~6ea/test/jdk │ │ │ │ │ keywords=bug8047031 intermittent othervm testng │ │ │ │ │ library=/test/lib │ │ │ │ │ run=USER_SPECIFIED build jdk.test.lib.NetworkConfiguration jdk.test.lib.Platform\nUSER_SPECIFIED testng/othervm -Djava.security.manager\=allow SocketPermissionTest\n │ │ │ │ │ source=SocketPermissionTest.java │ │ │ │ │ title=SocketPermission tests for legacy socket types. │ │ │ │ │ │ │ │ │ │ #-----environment----- │ │ │ │ │ │ │ │ │ │ #-----testresult----- │ │ │ │ │ description=file\:/build/reproducible-path/openjdk-21-21.0.13~6ea/test/jdk/java/net/SocketPermission/SocketPermissionTest.java │ │ │ │ │ -elapsed=656 0\:00\:00.656 │ │ │ │ │ -end=Wed Sep 16 09\:11\:29 UTC 2026 │ │ │ │ │ +elapsed=422 0\:00\:00.422 │ │ │ │ │ +end=Thu Sep 17 09\:00\:24 UTC 2026 │ │ │ │ │ environment=regtest │ │ │ │ │ execStatus=Failed. Execution failed\: `main' threw exception\: java.lang.Exception\: config failures\: 0, test failures\: 2 │ │ │ │ │ harnessLoaderMode=Classpath Loader │ │ │ │ │ harnessVariety=Full Bundle │ │ │ │ │ hostname=sbuild │ │ │ │ │ -javatestOS=Linux 6.12.107+deb13-powerpc64le (ppc64le) │ │ │ │ │ +javatestOS=Linux 6.12.107+deb13-powerpc64le-64k (ppc64le) │ │ │ │ │ javatestVersion=6.0-ea+b26-2026-03-18-${BUILT_FROM_COMMIT} │ │ │ │ │ jtregVersion=jtreg 8.3 src 1 │ │ │ │ │ script=com.sun.javatest.regtest.exec.RegressionScript │ │ │ │ │ sections=script_messages build build testng │ │ │ │ │ -start=Wed Sep 16 09\:11\:28 UTC 2026 │ │ │ │ │ +start=Thu Sep 17 09\:00\:23 UTC 2026 │ │ │ │ │ test=java/net/SocketPermission/SocketPermissionTest.java │ │ │ │ │ testJDK=/build/reproducible-path/openjdk-21-21.0.13~6ea/build/bootcycle-build/images/jdk │ │ │ │ │ -testJDK_OS=[name\:Linux,arch\:ppc64le,version\:6.12.107+deb13-powerpc64le,family\:linux,simple_arch\:ppc64le,simple_version\:6.12,processors\:8,maxMemory\:33706758144,maxSwap\:182536105984] │ │ │ │ │ +testJDK_OS=[name\:Linux,arch\:ppc64le,version\:6.12.107+deb13-powerpc64le-64k,family\:linux,simple_arch\:ppc64le,simple_version\:6.12,processors\:4,maxMemory\:16541614080,maxSwap\:25769738240] │ │ │ │ │ testJDK_os.arch=ppc64le │ │ │ │ │ testJDK_os.name=Linux │ │ │ │ │ -testJDK_os.version=6.12.107+deb13-powerpc64le │ │ │ │ │ -totalTime=658 │ │ │ │ │ +testJDK_os.version=6.12.107+deb13-powerpc64le-64k │ │ │ │ │ +totalTime=424 │ │ │ │ │ user.name=sbuild │ │ │ │ │ work=/tmp/jdk/JTwork/java/net/SocketPermission │ │ │ │ │ │ │ │ │ │ #section:script_messages │ │ │ │ │ ----------messages:(7/485)---------- │ │ │ │ │ JDK under test: /build/reproducible-path/openjdk-21-21.0.13~6ea/build/bootcycle-build/images/jdk │ │ │ │ │ openjdk version "21.0.13-ea" 2026-10-20 │ │ │ │ │ OpenJDK Runtime Environment (build 21.0.13-ea+6-1-Debian) │ │ │ │ │ OpenJDK 64-Bit Server VM (build 21.0.13-ea+6-1-Debian, mixed mode, sharing) │ │ │ │ │ Library /test/lib; kind: packages │ │ │ │ │ source directory: /build/reproducible-path/openjdk-21-21.0.13~6ea/test/lib │ │ │ │ │ class directory: /tmp/jdk/JTwork/classes/java/net/SocketPermission/SocketPermissionTest.d/test/lib │ │ │ │ │ │ │ │ │ │ #section:build │ │ │ │ │ -----------messages:(5/284)---------- │ │ │ │ │ +----------messages:(5/282)---------- │ │ │ │ │ command: build jdk.test.lib.NetworkConfiguration jdk.test.lib.Platform │ │ │ │ │ reason: User specified action: run build jdk.test.lib.NetworkConfiguration jdk.test.lib.Platform │ │ │ │ │ -started: Wed Sep 16 09:11:28.615 UTC 2026 │ │ │ │ │ -finished: Wed Sep 16 09:11:28.616 UTC 2026 │ │ │ │ │ -elapsed time (seconds): 0.001 │ │ │ │ │ +started: Thu Sep 17 09:00:23.738 UTC 2026 │ │ │ │ │ +finished: Thu Sep 17 09:00:23.738 UTC 2026 │ │ │ │ │ +elapsed time (seconds): 0.0 │ │ │ │ │ result: Passed. All files up to date │ │ │ │ │ │ │ │ │ │ #section:build │ │ │ │ │ -----------messages:(5/190)---------- │ │ │ │ │ +----------messages:(5/188)---------- │ │ │ │ │ command: build SocketPermissionTest │ │ │ │ │ reason: Named class compiled on demand │ │ │ │ │ -started: Wed Sep 16 09:11:28.616 UTC 2026 │ │ │ │ │ -finished: Wed Sep 16 09:11:28.617 UTC 2026 │ │ │ │ │ -elapsed time (seconds): 0.001 │ │ │ │ │ +started: Thu Sep 17 09:00:23.738 UTC 2026 │ │ │ │ │ +finished: Thu Sep 17 09:00:23.738 UTC 2026 │ │ │ │ │ +elapsed time (seconds): 0.0 │ │ │ │ │ result: Passed. All files up to date │ │ │ │ │ │ │ │ │ │ #section:testng │ │ │ │ │ ----------messages:(7/339)---------- │ │ │ │ │ command: testng -Djava.security.manager=allow SocketPermissionTest │ │ │ │ │ reason: User specified action: run testng/othervm -Djava.security.manager=allow SocketPermissionTest │ │ │ │ │ -started: Wed Sep 16 09:11:28.617 UTC 2026 │ │ │ │ │ +started: Thu Sep 17 09:00:23.739 UTC 2026 │ │ │ │ │ Mode: othervm [/othervm specified] │ │ │ │ │ -Process id: 2451294 │ │ │ │ │ -finished: Wed Sep 16 09:11:29.261 UTC 2026 │ │ │ │ │ -elapsed time (seconds): 0.644 │ │ │ │ │ +Process id: 2546939 │ │ │ │ │ +finished: Thu Sep 17 09:00:24.156 UTC 2026 │ │ │ │ │ +elapsed time (seconds): 0.417 │ │ │ │ │ ----------configuration:(0/0)---------- │ │ │ │ │ -----------System.out:(97/6918)---------- │ │ │ │ │ -[09:11:29.078] config SocketPermissionTest.setupSecurityManager(): success [0ms] │ │ │ │ │ -[09:11:29.111] test SocketPermissionTest.acceptServerSocketTest(): success [25ms] │ │ │ │ │ -[09:11:29.113] config SocketPermissionTest.setupSecurityManager(): success [0ms] │ │ │ │ │ -[09:11:29.128] test SocketPermissionTest.connectDatagramSocketTest(): success [14ms] │ │ │ │ │ -[09:11:29.129] config SocketPermissionTest.setupSecurityManager(): success [0ms] │ │ │ │ │ -[09:11:29.131] test SocketPermissionTest.connectSocketTest(): success [2ms] │ │ │ │ │ -[09:11:29.133] config SocketPermissionTest.setupSecurityManager(): success [0ms] │ │ │ │ │ -[09:11:29.143] test SocketPermissionTest.joinGroupMulticastTest(): failure [11ms] │ │ │ │ │ +----------System.out:(97/6917)---------- │ │ │ │ │ +[09:00:24.035] config SocketPermissionTest.setupSecurityManager(): success [0ms] │ │ │ │ │ +[09:00:24.054] test SocketPermissionTest.acceptServerSocketTest(): success [15ms] │ │ │ │ │ +[09:00:24.055] config SocketPermissionTest.setupSecurityManager(): success [0ms] │ │ │ │ │ +[09:00:24.069] test SocketPermissionTest.connectDatagramSocketTest(): success [13ms] │ │ │ │ │ +[09:00:24.070] config SocketPermissionTest.setupSecurityManager(): success [0ms] │ │ │ │ │ +[09:00:24.071] test SocketPermissionTest.connectSocketTest(): success [1ms] │ │ │ │ │ +[09:00:24.072] config SocketPermissionTest.setupSecurityManager(): success [0ms] │ │ │ │ │ +[09:00:24.078] test SocketPermissionTest.joinGroupMulticastTest(): failure [6ms] │ │ │ │ │ java.util.NoSuchElementException: No value present │ │ │ │ │ at java.base/java.util.Optional.get(Optional.java:143) │ │ │ │ │ at SocketPermissionTest.joinGroupMulticastTest(SocketPermissionTest.java:227) │ │ │ │ │ at java.base/jdk.internal.reflect.DirectMethodHandleAccessor.invoke(DirectMethodHandleAccessor.java:103) │ │ │ │ │ at java.base/java.lang.reflect.Method.invoke(Method.java:580) │ │ │ │ │ at org.testng.internal.invokers.MethodInvocationHelper.invokeMethod(MethodInvocationHelper.java:136) │ │ │ │ │ at org.testng.internal.invokers.TestInvoker.invokeMethod(TestInvoker.java:658) │ │ │ │ │ @@ -111,22 +111,22 @@ │ │ │ │ │ at org.testng.TestNG.run(TestNG.java:1060) │ │ │ │ │ at com.sun.javatest.regtest.agent.TestNGRunner.main(TestNGRunner.java:109) │ │ │ │ │ at com.sun.javatest.regtest.agent.TestNGRunner.main(TestNGRunner.java:65) │ │ │ │ │ at java.base/jdk.internal.reflect.DirectMethodHandleAccessor.invoke(DirectMethodHandleAccessor.java:103) │ │ │ │ │ at java.base/java.lang.reflect.Method.invoke(Method.java:580) │ │ │ │ │ at com.sun.javatest.regtest.agent.MainWrapper$MainTask.run(MainWrapper.java:143) │ │ │ │ │ at java.base/java.lang.Thread.run(Thread.java:1583) │ │ │ │ │ -[09:11:29.146] config SocketPermissionTest.setupSecurityManager(): success [0ms] │ │ │ │ │ -[09:11:29.148] test SocketPermissionTest.listenDatagramSocketTest(): success [1ms] │ │ │ │ │ -[09:11:29.149] config SocketPermissionTest.setupSecurityManager(): success [0ms] │ │ │ │ │ -[09:11:29.151] test SocketPermissionTest.listenMulticastSocketTest(): success [1ms] │ │ │ │ │ -[09:11:29.152] config SocketPermissionTest.setupSecurityManager(): success [0ms] │ │ │ │ │ -[09:11:29.153] test SocketPermissionTest.listenServerSocketTest(): success [1ms] │ │ │ │ │ -[09:11:29.154] config SocketPermissionTest.setupSecurityManager(): success [0ms] │ │ │ │ │ -[09:11:29.156] test SocketPermissionTest.sendDatagramPacketTest(): failure [2ms] │ │ │ │ │ +[09:00:24.080] config SocketPermissionTest.setupSecurityManager(): success [0ms] │ │ │ │ │ +[09:00:24.081] test SocketPermissionTest.listenDatagramSocketTest(): success [1ms] │ │ │ │ │ +[09:00:24.082] config SocketPermissionTest.setupSecurityManager(): success [0ms] │ │ │ │ │ +[09:00:24.083] test SocketPermissionTest.listenMulticastSocketTest(): success [0ms] │ │ │ │ │ +[09:00:24.084] config SocketPermissionTest.setupSecurityManager(): success [0ms] │ │ │ │ │ +[09:00:24.085] test SocketPermissionTest.listenServerSocketTest(): success [0ms] │ │ │ │ │ +[09:00:24.085] config SocketPermissionTest.setupSecurityManager(): success [0ms] │ │ │ │ │ +[09:00:24.086] test SocketPermissionTest.sendDatagramPacketTest(): failure [1ms] │ │ │ │ │ java.security.PrivilegedActionException: java.net.SocketException: Network is unreachable │ │ │ │ │ at java.base/java.security.AccessController.doPrivileged(AccessController.java:718) │ │ │ │ │ at SocketPermissionTest.sendDatagramPacketTest(SocketPermissionTest.java:195) │ │ │ │ │ at java.base/jdk.internal.reflect.DirectMethodHandleAccessor.invoke(DirectMethodHandleAccessor.java:103) │ │ │ │ │ at java.base/java.lang.reflect.Method.invoke(Method.java:580) │ │ │ │ │ at org.testng.internal.invokers.MethodInvocationHelper.invokeMethod(MethodInvocationHelper.java:136) │ │ │ │ │ at org.testng.internal.invokers.TestInvoker.invokeMethod(TestInvoker.java:658) │ │ │ │ ├── jtreg-test-output/jdk/JTwork/sun/security/krb5/auto/Addresses.jtr │ │ │ │ │ @@ -1,44 +1,44 @@ │ │ │ │ │ #Test Results (version 2) │ │ │ │ │ -#Wed Sep 16 09:11:32 UTC 2026 │ │ │ │ │ +#Thu Sep 17 09:00:26 UTC 2026 │ │ │ │ │ #-----testdescription----- │ │ │ │ │ $file=/build/reproducible-path/openjdk-21-21.0.13~6ea/test/jdk/sun/security/krb5/auto/Addresses.java │ │ │ │ │ $root=/build/reproducible-path/openjdk-21-21.0.13~6ea/test/jdk │ │ │ │ │ keywords=bug8031111 bug8194486 othervm │ │ │ │ │ library=/test/lib │ │ │ │ │ modules=java.base/jdk.internal.misc java.base/sun.security.util java.security.jgss/sun.security.jgss java.security.jgss/sun.security.jgss.krb5 java.security.jgss/sun.security.krb5\:+open java.security.jgss/sun.security.krb5.internal\:+open java.security.jgss/sun.security.krb5.internal.ccache java.security.jgss/sun.security.krb5.internal.rcache java.security.jgss/sun.security.krb5.internal.crypto java.security.jgss/sun.security.krb5.internal.ktab jdk.security.auth jdk.security.jgss │ │ │ │ │ run=USER_SPECIFIED compile -XDignore.symbol.file Addresses.java\nUSER_SPECIFIED main jdk.test.lib.FileInstaller TestHosts TestHosts\nUSER_SPECIFIED main/othervm -Djdk.net.hosts.file\=TestHosts Addresses\n │ │ │ │ │ source=Addresses.java │ │ │ │ │ title=fix krb5 caddr │ │ │ │ │ │ │ │ │ │ #-----environment----- │ │ │ │ │ │ │ │ │ │ #-----testresult----- │ │ │ │ │ description=file\:/build/reproducible-path/openjdk-21-21.0.13~6ea/test/jdk/sun/security/krb5/auto/Addresses.java │ │ │ │ │ -elapsed=3014 0\:00\:03.014 │ │ │ │ │ -end=Wed Sep 16 09\:11\:32 UTC 2026 │ │ │ │ │ +elapsed=2227 0\:00\:02.227 │ │ │ │ │ +end=Thu Sep 17 09\:00\:26 UTC 2026 │ │ │ │ │ environment=regtest │ │ │ │ │ execStatus=Failed. Execution failed\: `main' threw exception\: java.lang.Exception │ │ │ │ │ harnessLoaderMode=Classpath Loader │ │ │ │ │ harnessVariety=Full Bundle │ │ │ │ │ hostname=sbuild │ │ │ │ │ -javatestOS=Linux 6.12.107+deb13-powerpc64le (ppc64le) │ │ │ │ │ +javatestOS=Linux 6.12.107+deb13-powerpc64le-64k (ppc64le) │ │ │ │ │ javatestVersion=6.0-ea+b26-2026-03-18-${BUILT_FROM_COMMIT} │ │ │ │ │ jtregVersion=jtreg 8.3 src 1 │ │ │ │ │ modules=java.base/jdk.internal.misc java.base/sun.security.util java.security.jgss/sun.security.jgss java.security.jgss/sun.security.jgss.krb5 java.security.jgss/sun.security.krb5\:+open java.security.jgss/sun.security.krb5.internal\:+open java.security.jgss/sun.security.krb5.internal.ccache java.security.jgss/sun.security.krb5.internal.rcache java.security.jgss/sun.security.krb5.internal.crypto java.security.jgss/sun.security.krb5.internal.ktab jdk.security.auth jdk.security.jgss │ │ │ │ │ script=com.sun.javatest.regtest.exec.RegressionScript │ │ │ │ │ sections=script_messages compile build main build main │ │ │ │ │ -start=Wed Sep 16 09\:11\:29 UTC 2026 │ │ │ │ │ +start=Thu Sep 17 09\:00\:24 UTC 2026 │ │ │ │ │ test=sun/security/krb5/auto/Addresses.java │ │ │ │ │ testJDK=/build/reproducible-path/openjdk-21-21.0.13~6ea/build/bootcycle-build/images/jdk │ │ │ │ │ -testJDK_OS=[name\:Linux,arch\:ppc64le,version\:6.12.107+deb13-powerpc64le,family\:linux,simple_arch\:ppc64le,simple_version\:6.12,processors\:8,maxMemory\:33706758144,maxSwap\:182536105984] │ │ │ │ │ +testJDK_OS=[name\:Linux,arch\:ppc64le,version\:6.12.107+deb13-powerpc64le-64k,family\:linux,simple_arch\:ppc64le,simple_version\:6.12,processors\:4,maxMemory\:16541614080,maxSwap\:25769738240] │ │ │ │ │ testJDK_os.arch=ppc64le │ │ │ │ │ testJDK_os.name=Linux │ │ │ │ │ -testJDK_os.version=6.12.107+deb13-powerpc64le │ │ │ │ │ -totalTime=3017 │ │ │ │ │ +testJDK_os.version=6.12.107+deb13-powerpc64le-64k │ │ │ │ │ +totalTime=2229 │ │ │ │ │ user.name=sbuild │ │ │ │ │ work=/tmp/jdk/JTwork/sun/security/krb5/auto │ │ │ │ │ │ │ │ │ │ #section:script_messages │ │ │ │ │ ----------messages:(7/471)---------- │ │ │ │ │ JDK under test: /build/reproducible-path/openjdk-21-21.0.13~6ea/build/bootcycle-build/images/jdk │ │ │ │ │ openjdk version "21.0.13-ea" 2026-10-20 │ │ │ │ │ @@ -48,21 +48,21 @@ │ │ │ │ │ source directory: /build/reproducible-path/openjdk-21-21.0.13~6ea/test/lib │ │ │ │ │ class directory: /tmp/jdk/JTwork/classes/sun/security/krb5/auto/Addresses.d/test/lib │ │ │ │ │ │ │ │ │ │ #section:compile │ │ │ │ │ ----------messages:(9/1177)---------- │ │ │ │ │ command: compile -XDignore.symbol.file /build/reproducible-path/openjdk-21-21.0.13~6ea/test/jdk/sun/security/krb5/auto/Addresses.java │ │ │ │ │ reason: User specified action: run compile -XDignore.symbol.file Addresses.java │ │ │ │ │ -started: Wed Sep 16 09:11:29.697 UTC 2026 │ │ │ │ │ +started: Thu Sep 17 09:00:24.428 UTC 2026 │ │ │ │ │ Additional options from @modules: --add-modules java.base,java.security.jgss,jdk.security.auth,jdk.security.jgss --add-exports java.base/jdk.internal.misc=ALL-UNNAMED --add-exports java.base/sun.security.util=ALL-UNNAMED --add-exports java.security.jgss/sun.security.jgss=ALL-UNNAMED --add-exports java.security.jgss/sun.security.jgss.krb5=ALL-UNNAMED --add-exports java.security.jgss/sun.security.krb5=ALL-UNNAMED --add-exports java.security.jgss/sun.security.krb5.internal=ALL-UNNAMED --add-exports java.security.jgss/sun.security.krb5.internal.ccache=ALL-UNNAMED --add-exports java.security.jgss/sun.security.krb5.internal.rcache=ALL-UNNAMED --add-exports java.security.jgss/sun.security.krb5.internal.crypto=ALL-UNNAMED --add-exports java.security.jgss/sun.security.krb5.internal.ktab=ALL-UNNAMED │ │ │ │ │ Mode: agentvm │ │ │ │ │ Agent id: 2 │ │ │ │ │ -Process id: 2451323 │ │ │ │ │ -finished: Wed Sep 16 09:11:30.806 UTC 2026 │ │ │ │ │ -elapsed time (seconds): 1.109 │ │ │ │ │ +Process id: 2546967 │ │ │ │ │ +finished: Thu Sep 17 09:00:25.185 UTC 2026 │ │ │ │ │ +elapsed time (seconds): 0.757 │ │ │ │ │ ----------configuration:(23/1529)---------- │ │ │ │ │ Boot Layer (javac runtime environment) │ │ │ │ │ class path: /usr/share/jtreg/lib/javatest.jar │ │ │ │ │ /usr/share/jtreg/lib/jtreg.jar │ │ │ │ │ patch: java.base /tmp/jdk/JTwork/patches/java.base │ │ │ │ │ │ │ │ │ │ javac compilation environment │ │ │ │ │ @@ -135,31 +135,31 @@ │ │ │ │ │ ----------stderr:(0/0)---------- │ │ │ │ │ result: Passed. Compilation successful │ │ │ │ │ │ │ │ │ │ #section:build │ │ │ │ │ ----------messages:(5/194)---------- │ │ │ │ │ command: build jdk.test.lib.FileInstaller │ │ │ │ │ reason: Named class compiled on demand │ │ │ │ │ -started: Wed Sep 16 09:11:30.806 UTC 2026 │ │ │ │ │ -finished: Wed Sep 16 09:11:30.806 UTC 2026 │ │ │ │ │ +started: Thu Sep 17 09:00:25.186 UTC 2026 │ │ │ │ │ +finished: Thu Sep 17 09:00:25.186 UTC 2026 │ │ │ │ │ elapsed time (seconds): 0.0 │ │ │ │ │ result: Passed. All files up to date │ │ │ │ │ │ │ │ │ │ #section:main │ │ │ │ │ ----------messages:(10/925)---------- │ │ │ │ │ command: main jdk.test.lib.FileInstaller TestHosts TestHosts │ │ │ │ │ reason: User specified action: run main jdk.test.lib.FileInstaller TestHosts TestHosts │ │ │ │ │ -started: Wed Sep 16 09:11:30.807 UTC 2026 │ │ │ │ │ +started: Thu Sep 17 09:00:25.186 UTC 2026 │ │ │ │ │ Mode: agentvm │ │ │ │ │ Agent id: 1 │ │ │ │ │ -Process id: 2451199 │ │ │ │ │ +Process id: 2546846 │ │ │ │ │ Additional exports to unnamed modules from @modules: java.base/jdk.internal.misc java.base/sun.security.util java.security.jgss/sun.security.jgss java.security.jgss/sun.security.jgss.krb5 java.security.jgss/sun.security.krb5 java.security.jgss/sun.security.krb5.internal java.security.jgss/sun.security.krb5.internal.ccache java.security.jgss/sun.security.krb5.internal.rcache java.security.jgss/sun.security.krb5.internal.crypto java.security.jgss/sun.security.krb5.internal.ktab │ │ │ │ │ Additional opens to unnamed modules from @modules: java.security.jgss/sun.security.krb5 java.security.jgss/sun.security.krb5.internal │ │ │ │ │ -finished: Wed Sep 16 09:11:30.878 UTC 2026 │ │ │ │ │ -elapsed time (seconds): 0.071 │ │ │ │ │ +finished: Thu Sep 17 09:00:25.250 UTC 2026 │ │ │ │ │ +elapsed time (seconds): 0.064 │ │ │ │ │ ----------configuration:(29/1786)---------- │ │ │ │ │ Boot Layer │ │ │ │ │ class path: /usr/share/jtreg/lib/javatest.jar │ │ │ │ │ /usr/share/jtreg/lib/jtreg.jar │ │ │ │ │ /usr/share/jtreg/lib/junit-platform-console-standalone.jar │ │ │ │ │ /usr/share/jtreg/lib/testng.jar │ │ │ │ │ /usr/share/jtreg/lib/guice.jar │ │ │ │ │ @@ -224,32 +224,32 @@ │ │ │ │ │ ----------System.err:(3/35)---------- │ │ │ │ │ │ │ │ │ │ JavaTest Message: Test complete. │ │ │ │ │ │ │ │ │ │ result: Passed. Execution successful │ │ │ │ │ │ │ │ │ │ #section:build │ │ │ │ │ -----------messages:(5/177)---------- │ │ │ │ │ +----------messages:(5/179)---------- │ │ │ │ │ command: build Addresses │ │ │ │ │ reason: Named class compiled on demand │ │ │ │ │ -started: Wed Sep 16 09:11:30.879 UTC 2026 │ │ │ │ │ -finished: Wed Sep 16 09:11:30.879 UTC 2026 │ │ │ │ │ -elapsed time (seconds): 0.0 │ │ │ │ │ +started: Thu Sep 17 09:00:25.250 UTC 2026 │ │ │ │ │ +finished: Thu Sep 17 09:00:25.251 UTC 2026 │ │ │ │ │ +elapsed time (seconds): 0.001 │ │ │ │ │ result: Passed. All files up to date │ │ │ │ │ │ │ │ │ │ #section:main │ │ │ │ │ ----------messages:(8/1247)---------- │ │ │ │ │ command: main -Djdk.net.hosts.file=TestHosts Addresses │ │ │ │ │ reason: User specified action: run main/othervm -Djdk.net.hosts.file=TestHosts Addresses │ │ │ │ │ -started: Wed Sep 16 09:11:30.879 UTC 2026 │ │ │ │ │ +started: Thu Sep 17 09:00:25.251 UTC 2026 │ │ │ │ │ Mode: othervm [/othervm specified] │ │ │ │ │ Additional options from @modules: --add-modules java.base,java.security.jgss,jdk.security.auth,jdk.security.jgss --add-exports java.base/jdk.internal.misc=ALL-UNNAMED --add-exports java.base/sun.security.util=ALL-UNNAMED --add-exports java.security.jgss/sun.security.jgss=ALL-UNNAMED --add-exports java.security.jgss/sun.security.jgss.krb5=ALL-UNNAMED --add-exports java.security.jgss/sun.security.krb5=ALL-UNNAMED --add-opens java.security.jgss/sun.security.krb5=ALL-UNNAMED --add-exports java.security.jgss/sun.security.krb5.internal=ALL-UNNAMED --add-opens java.security.jgss/sun.security.krb5.internal=ALL-UNNAMED --add-exports java.security.jgss/sun.security.krb5.internal.ccache=ALL-UNNAMED --add-exports java.security.jgss/sun.security.krb5.internal.rcache=ALL-UNNAMED --add-exports java.security.jgss/sun.security.krb5.internal.crypto=ALL-UNNAMED --add-exports java.security.jgss/sun.security.krb5.internal.ktab=ALL-UNNAMED │ │ │ │ │ -Process id: 2451354 │ │ │ │ │ -finished: Wed Sep 16 09:11:32.704 UTC 2026 │ │ │ │ │ -elapsed time (seconds): 1.825 │ │ │ │ │ +Process id: 2546993 │ │ │ │ │ +finished: Thu Sep 17 09:00:26.652 UTC 2026 │ │ │ │ │ +elapsed time (seconds): 1.401 │ │ │ │ │ ----------configuration:(15/1053)---------- │ │ │ │ │ Boot Layer │ │ │ │ │ add modules: java.base java.security.jgss jdk.security.auth jdk.security.jgss │ │ │ │ │ add exports: java.base/jdk.internal.misc ALL-UNNAMED │ │ │ │ │ java.base/sun.security.util ALL-UNNAMED │ │ │ │ │ java.security.jgss/sun.security.jgss ALL-UNNAMED │ │ │ │ │ java.security.jgss/sun.security.jgss.krb5 ALL-UNNAMED │ │ │ │ │ @@ -258,28 +258,28 @@ │ │ │ │ │ java.security.jgss/sun.security.krb5.internal.ccache ALL-UNNAMED │ │ │ │ │ java.security.jgss/sun.security.krb5.internal.crypto ALL-UNNAMED │ │ │ │ │ java.security.jgss/sun.security.krb5.internal.ktab ALL-UNNAMED │ │ │ │ │ java.security.jgss/sun.security.krb5.internal.rcache ALL-UNNAMED │ │ │ │ │ add opens: java.security.jgss/sun.security.krb5 ALL-UNNAMED │ │ │ │ │ java.security.jgss/sun.security.krb5.internal ALL-UNNAMED │ │ │ │ │ │ │ │ │ │ -----------System.out:(24/849)---------- │ │ │ │ │ -Start KDC on 9647 │ │ │ │ │ +----------System.out:(24/852)---------- │ │ │ │ │ +Start KDC on 17959 │ │ │ │ │ ----------------------------------------------- │ │ │ │ │ >>>>> UDP packet received │ │ │ │ │ -RABBIT.HOLE:9647> dummy@RABBIT.HOLE sends AS-REQ for krbtgt/RABBIT.HOLE@RABBIT.HOLE, KDCOptions: │ │ │ │ │ +RABBIT.HOLE:17959> dummy@RABBIT.HOLE sends AS-REQ for krbtgt/RABBIT.HOLE@RABBIT.HOLE, KDCOptions: │ │ │ │ │ KrbException: Additional pre-authentication required (25) │ │ │ │ │ at KDC.processAsReq(KDC.java:1335) │ │ │ │ │ at KDC.processMessage(KDC.java:809) │ │ │ │ │ at KDC$1.run(KDC.java:1565) │ │ │ │ │ Error 25 Additional pre-authentication required │ │ │ │ │ >>>>> UDP request honored │ │ │ │ │ ----------------------------------------------- │ │ │ │ │ >>>>> UDP packet received │ │ │ │ │ -RABBIT.HOLE:9647> dummy@RABBIT.HOLE sends AS-REQ for krbtgt/RABBIT.HOLE@RABBIT.HOLE, KDCOptions: │ │ │ │ │ +RABBIT.HOLE:17959> dummy@RABBIT.HOLE sends AS-REQ for krbtgt/RABBIT.HOLE@RABBIT.HOLE, KDCOptions: │ │ │ │ │ Return dummy@RABBIT.HOLE ticket for krbtgt/RABBIT.HOLE@RABBIT.HOLE, flags INITIAL;PRE-AUTHENT │ │ │ │ │ >>>>> UDP request honored │ │ │ │ │ /10.0.0.10 │ │ │ │ │ extra1 found │ │ │ │ │ /10.0.0.11 │ │ │ │ │ extra2 found │ │ │ │ │ /10.0.0.12 │ │ ├── ./usr/share/doc/openjdk-21-jre-headless/test-ppc64el/jtreg-summary-hotspot.log │ │ │ @@ -1,13 +1,16 @@ │ │ │ --------------- jtreg console summary for hotspot --------------- │ │ │ -Test results: passed: 3,002; skipped: 4; excluded: 43; did not match keywords: 75; did not meet module requirements: 85; did not meet platform requirements: 239 │ │ │ +FAILED: runtime/cds/appcds/dynamicArchive/TestAutoCreateSharedArchiveUpgrade.java │ │ │ +Test results: passed: 3,001; failed: 1; skipped: 4; excluded: 43; did not match keywords: 75; did not meet module requirements: 85; did not meet platform requirements: 239 │ │ │ Framework-based tests: 448 = 409 TestNG + 39 JUnit │ │ │ +FAILED: runtime/cds/appcds/dynamicArchive/TestAutoCreateSharedArchiveUpgrade.java │ │ │ +Test results: failed: 1; excluded: 43; did not match keywords: 75; did not match prior status: 3,325 │ │ │ +FAILED: runtime/cds/appcds/dynamicArchive/TestAutoCreateSharedArchiveUpgrade.java │ │ │ +Test results: failed: 1; excluded: 43; did not match keywords: 75; did not match prior status: 3,325 │ │ │ [debian/tests/jtreg-autopkgtest.sh] nothing to cleanup │ │ │ -Unable to compare jtreg results: no build jtreport found for hotspot/ppc64el. │ │ │ -Reason: '/usr/share/doc/openjdk-21-jre-headless//test-ppc64el/jtreport-hotspot.tar.gz' does not exist. │ │ │ --------------- jtreg console summary for langtools --------------- │ │ │ Test results: passed: 4,433; skipped: 1; excluded: 12; did not match keywords: 1; did not meet platform requirements: 1 │ │ │ Framework-based tests: 4,126 = 3,147 TestNG + 979 JUnit │ │ │ [debian/tests/jtreg-autopkgtest.sh] nothing to cleanup │ │ │ Unable to compare jtreg results: no build jtreport found for hotspot/ppc64el. │ │ │ Reason: '/usr/share/doc/openjdk-21-jre-headless//test-ppc64el/jtreport-hotspot.tar.gz' does not exist. │ │ │ --------------- jtreg console summary for jaxp --------------- │ │ │ @@ -22,16 +25,16 @@ │ │ │ FAILED: java/net/MulticastSocket/Promiscuous.java │ │ │ FAILED: java/net/MulticastSocket/SetLoopbackMode.java │ │ │ FAILED: java/net/MulticastSocket/SetLoopbackModeIPv4.java │ │ │ FAILED: java/net/MulticastSocket/Test.java │ │ │ FAILED: java/net/SocketOption/OptionsTest.java │ │ │ FAILED: java/net/SocketPermission/SocketPermissionTest.java │ │ │ FAILED: sun/security/krb5/auto/Addresses.java │ │ │ -Test results: passed: 6,499; failed: 9; skipped: 114; excluded: 39; did not match keywords: 37; did not meet module requirements: 3; did not meet platform requirements: 100 │ │ │ -Framework-based tests: 335,199 = 164,249 TestNG + 170,950 JUnit │ │ │ +Test results: passed: 6,497; failed: 9; skipped: 114; excluded: 39; did not match keywords: 37; did not meet module requirements: 3; did not meet platform requirements: 102 │ │ │ +Framework-based tests: 335,180 = 164,230 TestNG + 170,950 JUnit │ │ │ FAILED: java/net/MulticastSocket/B6427403.java │ │ │ FAILED: java/net/MulticastSocket/NoLoopbackPackets.java │ │ │ FAILED: java/net/MulticastSocket/Promiscuous.java │ │ │ FAILED: java/net/MulticastSocket/SetLoopbackMode.java │ │ │ FAILED: java/net/MulticastSocket/SetLoopbackModeIPv4.java │ │ │ FAILED: java/net/MulticastSocket/Test.java │ │ │ FAILED: java/net/SocketOption/OptionsTest.java │ │ ├── ./usr/share/doc/openjdk-21-jre-headless/test-ppc64el/jtreg_output-hotspot.log.gz │ │ │ ├── jtreg_output-hotspot.log │ │ │ │ @@ -2258,15 +2258,15 @@ │ │ │ │ Passed: runtime/cds/appcds/dynamicArchive/RegularHiddenClass.java │ │ │ │ Passed: runtime/cds/appcds/dynamicArchive/RelativePath.java │ │ │ │ Passed: runtime/cds/appcds/dynamicArchive/SharedArchiveFileOption.java │ │ │ │ Passed: runtime/cds/appcds/dynamicArchive/SharedBaseAddressOption.java │ │ │ │ Passed: runtime/cds/appcds/dynamicArchive/StaticInnerTest.java │ │ │ │ Passed: runtime/cds/appcds/dynamicArchive/TestAutoCreateSharedArchive.java │ │ │ │ Passed: runtime/cds/appcds/dynamicArchive/TestAutoCreateSharedArchiveNoDefaultArchive.java │ │ │ │ -Passed: runtime/cds/appcds/dynamicArchive/TestAutoCreateSharedArchiveUpgrade.java │ │ │ │ +FAILED: runtime/cds/appcds/dynamicArchive/TestAutoCreateSharedArchiveUpgrade.java │ │ │ │ Passed: runtime/cds/appcds/dynamicArchive/TestDynamicDumpAtOom.java │ │ │ │ Passed: runtime/cds/appcds/dynamicArchive/TestDynamicRegenerateHolderClasses.java │ │ │ │ Passed: runtime/cds/appcds/dynamicArchive/TestLambdaInvokers.java │ │ │ │ Passed: runtime/cds/appcds/dynamicArchive/UnsupportedBaseArchive.java │ │ │ │ Passed: runtime/cds/appcds/dynamicArchive/UnusedCPDuringDump.java │ │ │ │ Passed: runtime/cds/appcds/dynamicArchive/UsedAllArchivedLambdas.java │ │ │ │ Passed: runtime/cds/appcds/dynamicArchive/VerifyObjArrayCloneTest.java │ │ │ │ @@ -3013,46 +3013,56 @@ │ │ │ │ Passed: serviceability/tmtools/jstat/GcCapacityTest.java │ │ │ │ Passed: serviceability/tmtools/jstat/GcCauseTest01.java │ │ │ │ Passed: serviceability/tmtools/jstat/GcCauseTest02.java │ │ │ │ Passed: serviceability/tmtools/jstat/GcCauseTest03.java │ │ │ │ Passed: serviceability/tmtools/jstat/GcNewTest.java │ │ │ │ Passed: serviceability/tmtools/jstat/GcTest01.java │ │ │ │ Passed: serviceability/tmtools/jstat/GcTest02.java │ │ │ │ -Test results: passed: 3,002; skipped: 4; excluded: 43; did not match keywords: 75; did not meet module requirements: 85; did not meet platform requirements: 239 │ │ │ │ +Test results: passed: 3,001; failed: 1; skipped: 4; excluded: 43; did not match keywords: 75; did not meet module requirements: 85; did not meet platform requirements: 239 │ │ │ │ Framework-based tests: 448 = 409 TestNG + 39 JUnit │ │ │ │ +Error: Some tests failed or other problems occurred. │ │ │ │ Report written to /build/reproducible-path/openjdk-21-21.0.13~6ea/jtreg-test-output/hotspot/0/JTreport/html/report.html │ │ │ │ Results written to /tmp/hotspot/JTwork │ │ │ │ +Directory "jtreg-test-output/hotspot/1/JTreport" not found: creating │ │ │ │ +FAILED: runtime/cds/appcds/dynamicArchive/TestAutoCreateSharedArchiveUpgrade.java │ │ │ │ +Test results: failed: 1; excluded: 43; did not match keywords: 75; did not match prior status: 3,325 │ │ │ │ +Error: Some tests failed or other problems occurred. │ │ │ │ +Report written to /build/reproducible-path/openjdk-21-21.0.13~6ea/jtreg-test-output/hotspot/1/JTreport/html/report.html │ │ │ │ +Results written to /tmp/hotspot/JTwork │ │ │ │ +Directory "jtreg-test-output/hotspot/2/JTreport" not found: creating │ │ │ │ +FAILED: runtime/cds/appcds/dynamicArchive/TestAutoCreateSharedArchiveUpgrade.java │ │ │ │ +Test results: failed: 1; excluded: 43; did not match keywords: 75; did not match prior status: 3,325 │ │ │ │ +Report written to /build/reproducible-path/openjdk-21-21.0.13~6ea/jtreg-test-output/hotspot/2/JTreport/html/report.html │ │ │ │ +Results written to /tmp/hotspot/JTwork │ │ │ │ +Error: Some tests failed or other problems occurred. │ │ │ │ [debian/tests/jtreg-autopkgtest.sh] nothing to cleanup │ │ │ │ -grep: debian/tests/hotspot-archs: No such file or directory │ │ │ │ -Unable to compare jtreg results: no build jtreport found for hotspot/ppc64el. │ │ │ │ -Reason: '/usr/share/doc/openjdk-21-jre-headless//test-ppc64el/jtreport-hotspot.tar.gz' does not exist. │ │ │ │ -Command exited with non-zero status 77 │ │ │ │ +Command exited with non-zero status 2 │ │ │ │ Command being timed: "debian/tests/hotspot" │ │ │ │ - User time (seconds): 15355.51 │ │ │ │ - System time (seconds): 1288.03 │ │ │ │ - Percent of CPU this job got: 127% │ │ │ │ - Elapsed (wall clock) time (h:mm:ss or m:ss): 3:37:33 │ │ │ │ + User time (seconds): 14193.06 │ │ │ │ + System time (seconds): 1153.25 │ │ │ │ + Percent of CPU this job got: 138% │ │ │ │ + Elapsed (wall clock) time (h:mm:ss or m:ss): 3:04:35 │ │ │ │ Average shared text size (kbytes): 0 │ │ │ │ Average unshared data size (kbytes): 0 │ │ │ │ Average stack size (kbytes): 0 │ │ │ │ Average total size (kbytes): 0 │ │ │ │ - Maximum resident set size (kbytes): 4413256 │ │ │ │ + Maximum resident set size (kbytes): 4011520 │ │ │ │ Average resident set size (kbytes): 0 │ │ │ │ - Major (requiring I/O) page faults: 579 │ │ │ │ - Minor (reclaiming a frame) page faults: 122497544 │ │ │ │ - Voluntary context switches: 38874922 │ │ │ │ - Involuntary context switches: 5746772 │ │ │ │ + Major (requiring I/O) page faults: 1605 │ │ │ │ + Minor (reclaiming a frame) page faults: 15378231 │ │ │ │ + Voluntary context switches: 36580552 │ │ │ │ + Involuntary context switches: 27195385 │ │ │ │ Swaps: 0 │ │ │ │ - File system inputs: 185288 │ │ │ │ - File system outputs: 0 │ │ │ │ + File system inputs: 1964912 │ │ │ │ + File system outputs: 38623104 │ │ │ │ Socket messages sent: 0 │ │ │ │ Socket messages received: 0 │ │ │ │ Signals delivered: 0 │ │ │ │ - Page size (bytes): 4096 │ │ │ │ - Exit status: 77 │ │ │ │ + Page size (bytes): 65536 │ │ │ │ + Exit status: 2 │ │ │ │ ===== END check-hotspot ===== │ │ │ │ ===== START check-langtools ===== │ │ │ │ mkdir -p jtreg-test-output/langtools │ │ │ │ BOOTJDK_HOME=/usr/lib/jvm/java-21-openjdk-ppc64el JTREG_OPTIONS= VMNAME=hotspot JDK_TO_TEST=build/bootcycle-build/images/jdk \ │ │ │ │ AUTOPKGTEST_TMP=/tmp/ AUTOPKGTEST_ARTIFACTS=jtreg-test-output/ \ │ │ │ │ /usr/bin/time -v debian/tests/langtools | tee jtreg-test-output/check-langtools.log │ │ │ │ dpkg: error: --compare-versions takes three arguments: │ │ │ │ @@ -7505,35 +7515,35 @@ │ │ │ │ Results written to /tmp/langtools/JTwork │ │ │ │ [debian/tests/jtreg-autopkgtest.sh] nothing to cleanup │ │ │ │ grep: debian/tests/hotspot-archs: No such file or directory │ │ │ │ Unable to compare jtreg results: no build jtreport found for hotspot/ppc64el. │ │ │ │ Reason: '/usr/share/doc/openjdk-21-jre-headless//test-ppc64el/jtreport-hotspot.tar.gz' does not exist. │ │ │ │ Command exited with non-zero status 77 │ │ │ │ Command being timed: "debian/tests/langtools" │ │ │ │ - User time (seconds): 3312.05 │ │ │ │ - System time (seconds): 227.46 │ │ │ │ - Percent of CPU this job got: 118% │ │ │ │ - Elapsed (wall clock) time (h:mm:ss or m:ss): 49:34.85 │ │ │ │ + User time (seconds): 2583.44 │ │ │ │ + System time (seconds): 186.28 │ │ │ │ + Percent of CPU this job got: 117% │ │ │ │ + Elapsed (wall clock) time (h:mm:ss or m:ss): 39:24.17 │ │ │ │ Average shared text size (kbytes): 0 │ │ │ │ Average unshared data size (kbytes): 0 │ │ │ │ Average stack size (kbytes): 0 │ │ │ │ Average total size (kbytes): 0 │ │ │ │ - Maximum resident set size (kbytes): 7660572 │ │ │ │ + Maximum resident set size (kbytes): 3347648 │ │ │ │ Average resident set size (kbytes): 0 │ │ │ │ - Major (requiring I/O) page faults: 130 │ │ │ │ - Minor (reclaiming a frame) page faults: 15771903 │ │ │ │ - Voluntary context switches: 3080331 │ │ │ │ - Involuntary context switches: 360446 │ │ │ │ + Major (requiring I/O) page faults: 272 │ │ │ │ + Minor (reclaiming a frame) page faults: 2700785 │ │ │ │ + Voluntary context switches: 3099903 │ │ │ │ + Involuntary context switches: 789121 │ │ │ │ Swaps: 0 │ │ │ │ - File system inputs: 110136 │ │ │ │ - File system outputs: 0 │ │ │ │ + File system inputs: 305920 │ │ │ │ + File system outputs: 29463808 │ │ │ │ Socket messages sent: 0 │ │ │ │ Socket messages received: 0 │ │ │ │ Signals delivered: 0 │ │ │ │ - Page size (bytes): 4096 │ │ │ │ + Page size (bytes): 65536 │ │ │ │ Exit status: 77 │ │ │ │ ===== END check-langtools ===== │ │ │ │ ===== START check-jaxp ===== │ │ │ │ mkdir -p jtreg-test-output/jaxp │ │ │ │ BOOTJDK_HOME=/usr/lib/jvm/java-21-openjdk-ppc64el JTREG_OPTIONS= VMNAME=hotspot JDK_TO_TEST=build/bootcycle-build/images/jdk \ │ │ │ │ AUTOPKGTEST_TMP=/tmp/ AUTOPKGTEST_ARTIFACTS=jtreg-test-output/ \ │ │ │ │ /usr/bin/time -v debian/tests/jaxp | tee jtreg-test-output/check-jaxp.log │ │ │ │ @@ -8055,69 +8065,69 @@ │ │ │ │ Results written to /tmp/jaxp/JTwork │ │ │ │ [debian/tests/jtreg-autopkgtest.sh] nothing to cleanup │ │ │ │ grep: debian/tests/hotspot-archs: No such file or directory │ │ │ │ Unable to compare jtreg results: no build jtreport found for hotspot/ppc64el. │ │ │ │ Reason: '/usr/share/doc/openjdk-21-jre-headless//test-ppc64el/jtreport-hotspot.tar.gz' does not exist. │ │ │ │ Command exited with non-zero status 77 │ │ │ │ Command being timed: "debian/tests/jaxp" │ │ │ │ - User time (seconds): 2995.95 │ │ │ │ - System time (seconds): 135.30 │ │ │ │ - Percent of CPU this job got: 199% │ │ │ │ - Elapsed (wall clock) time (h:mm:ss or m:ss): 26:09.13 │ │ │ │ + User time (seconds): 2002.61 │ │ │ │ + System time (seconds): 93.03 │ │ │ │ + Percent of CPU this job got: 230% │ │ │ │ + Elapsed (wall clock) time (h:mm:ss or m:ss): 15:07.87 │ │ │ │ Average shared text size (kbytes): 0 │ │ │ │ Average unshared data size (kbytes): 0 │ │ │ │ Average stack size (kbytes): 0 │ │ │ │ Average total size (kbytes): 0 │ │ │ │ - Maximum resident set size (kbytes): 460508 │ │ │ │ + Maximum resident set size (kbytes): 364224 │ │ │ │ Average resident set size (kbytes): 0 │ │ │ │ - Major (requiring I/O) page faults: 13 │ │ │ │ - Minor (reclaiming a frame) page faults: 20346974 │ │ │ │ - Voluntary context switches: 2957114 │ │ │ │ - Involuntary context switches: 112745 │ │ │ │ + Major (requiring I/O) page faults: 1 │ │ │ │ + Minor (reclaiming a frame) page faults: 2421265 │ │ │ │ + Voluntary context switches: 2527328 │ │ │ │ + Involuntary context switches: 162782 │ │ │ │ Swaps: 0 │ │ │ │ - File system inputs: 275952 │ │ │ │ - File system outputs: 0 │ │ │ │ + File system inputs: 1009080 │ │ │ │ + File system outputs: 3772288 │ │ │ │ Socket messages sent: 0 │ │ │ │ Socket messages received: 0 │ │ │ │ Signals delivered: 0 │ │ │ │ - Page size (bytes): 4096 │ │ │ │ + Page size (bytes): 65536 │ │ │ │ Exit status: 77 │ │ │ │ ===== END check-jaxp ===== │ │ │ │ ===== START check-jdk ===== │ │ │ │ mkdir -p jtreg-test-output/jdk │ │ │ │ BOOTJDK_HOME=/usr/lib/jvm/java-21-openjdk-ppc64el JTREG_OPTIONS= VMNAME=hotspot JDK_TO_TEST=build/bootcycle-build/images/jdk \ │ │ │ │ AUTOPKGTEST_TMP=/tmp/ AUTOPKGTEST_ARTIFACTS=jtreg-test-output/ \ │ │ │ │ /usr/bin/time -v debian/tests/jdk | tee jtreg-test-output/check-jdk.log │ │ │ │ + │ │ │ │ +(xfwm4:2082006): atspi-WARNING **: 05:12:14.984: AT-SPI: Error retrieving accessibility bus address: org.freedesktop.DBus.Error.ServiceUnknown: The name org.a11y.Bus was not provided by any .service files │ │ │ │ +dbus-daemon[2081995]: [session uid=996 pid=2081995 pidfd=5] Activating service name='org.xfce.Xfconf' requested by ':1.1' (uid=996 pid=2082006 comm="xfwm4") │ │ │ │ +dbus-daemon[2081995]: [session uid=996 pid=2081995 pidfd=5] Successfully activated service 'org.xfce.Xfconf' │ │ │ │ +WARNING: Glycin running without sandbox. │ │ │ │ + │ │ │ │ +(xfwm4:2082006): xfwm4-WARNING **: 05:12:16.804: Another compositing manager is running on screen 0 │ │ │ │ + │ │ │ │ +(xfwm4:2082006): xfwm4-WARNING **: 05:12:16.806: Failed to connect to session manager: Failed to connect to the session manager: SESSION_MANAGER environment variable not defined │ │ │ │ dpkg: error: --compare-versions takes three arguments: │ │ │ │ │ │ │ │ Type dpkg --help for help about installing and deinstalling packages [*]; │ │ │ │ Use 'apt' or 'aptitude' for user-friendly package management; │ │ │ │ Type dpkg -Dhelp for a list of dpkg debug flag values; │ │ │ │ Type dpkg --force-help for a list of forcing options; │ │ │ │ Type dpkg-deb --help for help about manipulating *.deb files; │ │ │ │ │ │ │ │ Options marked [*] produce a lot of output - pipe it through 'less' or 'more' ! │ │ │ │ Directory "/tmp/jdk/JTwork" not found: creating │ │ │ │ Directory "jtreg-test-output/jdk/0/JTreport" not found: creating │ │ │ │ - │ │ │ │ -(xfwm4:1969121): atspi-WARNING **: 04:20:02.215: AT-SPI: Error retrieving accessibility bus address: org.freedesktop.DBus.Error.ServiceUnknown: The name org.a11y.Bus was not provided by any .service files │ │ │ │ -dbus-daemon[1968996]: [session uid=999 pid=1968996 pidfd=5] Activating service name='org.xfce.Xfconf' requested by ':1.1' (uid=999 pid=1969121 comm="xfwm4") │ │ │ │ -dbus-daemon[1968996]: [session uid=999 pid=1968996 pidfd=5] Successfully activated service 'org.xfce.Xfconf' │ │ │ │ Passed: com/sun/jdi/AcceptTimeout.java │ │ │ │ -WARNING: Glycin running without sandbox. │ │ │ │ Passed: com/sun/jdi/AccessSpecifierTest.java │ │ │ │ Passed: com/sun/jdi/AfterThreadDeathTest.java │ │ │ │ Passed: com/sun/jdi/ArrayRangeTest.java │ │ │ │ Passed: com/sun/jdi/ConstantPoolInfo.java │ │ │ │ Passed: com/sun/jdi/CountFilterTest.java │ │ │ │ Passed: com/sun/jdi/EarlyReturnNegativeTest.java │ │ │ │ - │ │ │ │ -(xfwm4:1969121): xfwm4-WARNING **: 04:20:24.203: Another compositing manager is running on screen 0 │ │ │ │ - │ │ │ │ -(xfwm4:1969121): xfwm4-WARNING **: 04:20:24.483: Failed to connect to session manager: Failed to connect to the session manager: SESSION_MANAGER environment variable not defined │ │ │ │ Passed: com/sun/jdi/EarlyReturnTest.java │ │ │ │ Passed: com/sun/jdi/FieldWatchpoints.java │ │ │ │ Passed: com/sun/jdi/FramesTest.java │ │ │ │ Passed: com/sun/jdi/InstanceFilter.java │ │ │ │ Passed: com/sun/jdi/InterfaceMethodsTest.java │ │ │ │ Passed: com/sun/jdi/InvokeTest.java │ │ │ │ Passed: com/sun/jdi/LocalVariableEqual.java │ │ │ │ @@ -8773,15 +8783,14 @@ │ │ │ │ Passed: java/io/File/ListRoots.java │ │ │ │ Passed: java/io/File/ListSpace.java │ │ │ │ Passed: java/io/File/MaxPathLength.java │ │ │ │ Passed: java/io/File/Mkdir.java │ │ │ │ Passed: java/io/File/NulFile.java │ │ │ │ Passed: java/io/File/NullArgs.java │ │ │ │ Passed: java/io/File/SetAccess.java │ │ │ │ -Passed: java/io/File/SetLastModified.java │ │ │ │ Passed: java/io/File/SetReadOnly.java │ │ │ │ Passed: java/io/File/SymLinks.java │ │ │ │ Passed: java/io/File/TempDirDoesNotExist.java │ │ │ │ Passed: java/io/File/TimeZoneLastModified.java │ │ │ │ Passed: java/io/File/ToURI.java │ │ │ │ Passed: java/io/File/ToURL.java │ │ │ │ Passed: java/io/File/Unicode.java │ │ │ │ @@ -10777,15 +10786,14 @@ │ │ │ │ Passed: java/nio/channels/AsynchronousSocketChannel/StressLoopback.java │ │ │ │ Passed: java/nio/channels/Channels/Basic.java │ │ │ │ Passed: java/nio/channels/Channels/Basic2.java │ │ │ │ Passed: java/nio/channels/Channels/CloseWriterOnFailedFlush.java │ │ │ │ Passed: java/nio/channels/Channels/EncodingTest.java │ │ │ │ Passed: java/nio/channels/Channels/ReadByte.java │ │ │ │ Passed: java/nio/channels/Channels/ReadOffset.java │ │ │ │ -Passed: java/nio/channels/Channels/ReadXBytes.java │ │ │ │ Passed: java/nio/channels/Channels/ShortWrite.java │ │ │ │ Passed: java/nio/channels/Channels/SocketChannelStreams.java │ │ │ │ Passed: java/nio/channels/Channels/TinyBuffers.java │ │ │ │ Passed: java/nio/channels/Channels/TransferTo_2GB_transferFrom.java │ │ │ │ Passed: java/nio/channels/Channels/TransferTo_2GB_transferTo.java │ │ │ │ Passed: java/nio/channels/Channels/TransferTo.java │ │ │ │ Passed: java/nio/channels/Channels/TransferTo2.java │ │ │ │ @@ -14611,16 +14619,16 @@ │ │ │ │ Passed: tools/launcher/TestXcheckJNIWarnings.java#jdwp-agent │ │ │ │ Passed: tools/launcher/TestXcheckJNIWarnings.java#noagent │ │ │ │ Passed: tools/launcher/ToolsOpts.java │ │ │ │ Passed: tools/launcher/TooSmallStackSize.java │ │ │ │ Passed: tools/launcher/UnicodeTest.java │ │ │ │ Passed: tools/launcher/UnresolvedExceptions.java │ │ │ │ Passed: tools/launcher/VersionCheck.java │ │ │ │ -Test results: passed: 6,499; failed: 9; skipped: 114; excluded: 39; did not match keywords: 37; did not meet module requirements: 3; did not meet platform requirements: 100 │ │ │ │ -Framework-based tests: 335,199 = 164,249 TestNG + 170,950 JUnit │ │ │ │ +Test results: passed: 6,497; failed: 9; skipped: 114; excluded: 39; did not match keywords: 37; did not meet module requirements: 3; did not meet platform requirements: 102 │ │ │ │ +Framework-based tests: 335,180 = 164,230 TestNG + 170,950 JUnit │ │ │ │ Report written to /build/reproducible-path/openjdk-21-21.0.13~6ea/jtreg-test-output/jdk/0/JTreport/html/report.html │ │ │ │ Results written to /tmp/jdk/JTwork │ │ │ │ Error: Some tests failed or other problems occurred. │ │ │ │ Directory "jtreg-test-output/jdk/1/JTreport" not found: creating │ │ │ │ FAILED: java/net/MulticastSocket/B6427403.java │ │ │ │ FAILED: java/net/MulticastSocket/NoLoopbackPackets.java │ │ │ │ FAILED: java/net/MulticastSocket/Promiscuous.java │ │ │ │ @@ -14642,55 +14650,58 @@ │ │ │ │ FAILED: java/net/MulticastSocket/SetLoopbackMode.java │ │ │ │ FAILED: java/net/MulticastSocket/SetLoopbackModeIPv4.java │ │ │ │ FAILED: java/net/MulticastSocket/Test.java │ │ │ │ FAILED: java/net/SocketOption/OptionsTest.java │ │ │ │ FAILED: java/net/SocketPermission/SocketPermissionTest.java │ │ │ │ FAILED: sun/security/krb5/auto/Addresses.java │ │ │ │ Test results: failed: 9; excluded: 39; did not match keywords: 37; did not match prior status: 6,602 │ │ │ │ +Error: Some tests failed or other problems occurred. │ │ │ │ Framework-based tests: 8 = 8 TestNG + 0 JUnit │ │ │ │ Report written to /build/reproducible-path/openjdk-21-21.0.13~6ea/jtreg-test-output/jdk/2/JTreport/html/report.html │ │ │ │ Results written to /tmp/jdk/JTwork │ │ │ │ -Error: Some tests failed or other problems occurred. │ │ │ │ [debian/tests/jtreg-autopkgtest.sh] nothing to cleanup │ │ │ │ +Killed │ │ │ │ Command exited with non-zero status 2 │ │ │ │ Command being timed: "debian/tests/jdk" │ │ │ │ - User time (seconds): 20821.96 │ │ │ │ - System time (seconds): 1286.54 │ │ │ │ - Percent of CPU this job got: 126% │ │ │ │ - Elapsed (wall clock) time (h:mm:ss or m:ss): 4:52:20 │ │ │ │ + User time (seconds): 14741.47 │ │ │ │ + System time (seconds): 957.17 │ │ │ │ + Percent of CPU this job got: 114% │ │ │ │ + Elapsed (wall clock) time (h:mm:ss or m:ss): 3:48:25 │ │ │ │ Average shared text size (kbytes): 0 │ │ │ │ Average unshared data size (kbytes): 0 │ │ │ │ Average stack size (kbytes): 0 │ │ │ │ Average total size (kbytes): 0 │ │ │ │ - Maximum resident set size (kbytes): 15566452 │ │ │ │ + Maximum resident set size (kbytes): 7575552 │ │ │ │ Average resident set size (kbytes): 0 │ │ │ │ - Major (requiring I/O) page faults: 606 │ │ │ │ - Minor (reclaiming a frame) page faults: 112724711 │ │ │ │ - Voluntary context switches: 31483102 │ │ │ │ - Involuntary context switches: 3021150 │ │ │ │ + Major (requiring I/O) page faults: 54296 │ │ │ │ + Minor (reclaiming a frame) page faults: 16645234 │ │ │ │ + Voluntary context switches: 27445360 │ │ │ │ + Involuntary context switches: 3613378 │ │ │ │ Swaps: 0 │ │ │ │ - File system inputs: 386832 │ │ │ │ - File system outputs: 0 │ │ │ │ + File system inputs: 2990776 │ │ │ │ + File system outputs: 114129280 │ │ │ │ Socket messages sent: 0 │ │ │ │ Socket messages received: 0 │ │ │ │ Signals delivered: 0 │ │ │ │ - Page size (bytes): 4096 │ │ │ │ + Page size (bytes): 65536 │ │ │ │ Exit status: 2 │ │ │ │ -Killed │ │ │ │ ===== END check-jdk ===== │ │ │ │ for i in hotspot langtools jaxp jdk; do \ │ │ │ │ echo "--------------- jtreg console summary for $i ---------------"; \ │ │ │ │ egrep -v '^(Passed:|Directory|Re[a-z]+\ written\ to)' jtreg-test-output/check-$i.log; \ │ │ │ │ done | tee jtreg-test-output/jtreg-summary.log │ │ │ │ --------------- jtreg console summary for hotspot --------------- │ │ │ │ -Test results: passed: 3,002; skipped: 4; excluded: 43; did not match keywords: 75; did not meet module requirements: 85; did not meet platform requirements: 239 │ │ │ │ +FAILED: runtime/cds/appcds/dynamicArchive/TestAutoCreateSharedArchiveUpgrade.java │ │ │ │ +Test results: passed: 3,001; failed: 1; skipped: 4; excluded: 43; did not match keywords: 75; did not meet module requirements: 85; did not meet platform requirements: 239 │ │ │ │ Framework-based tests: 448 = 409 TestNG + 39 JUnit │ │ │ │ +FAILED: runtime/cds/appcds/dynamicArchive/TestAutoCreateSharedArchiveUpgrade.java │ │ │ │ +Test results: failed: 1; excluded: 43; did not match keywords: 75; did not match prior status: 3,325 │ │ │ │ +FAILED: runtime/cds/appcds/dynamicArchive/TestAutoCreateSharedArchiveUpgrade.java │ │ │ │ +Test results: failed: 1; excluded: 43; did not match keywords: 75; did not match prior status: 3,325 │ │ │ │ [debian/tests/jtreg-autopkgtest.sh] nothing to cleanup │ │ │ │ -Unable to compare jtreg results: no build jtreport found for hotspot/ppc64el. │ │ │ │ -Reason: '/usr/share/doc/openjdk-21-jre-headless//test-ppc64el/jtreport-hotspot.tar.gz' does not exist. │ │ │ │ --------------- jtreg console summary for langtools --------------- │ │ │ │ Test results: passed: 4,433; skipped: 1; excluded: 12; did not match keywords: 1; did not meet platform requirements: 1 │ │ │ │ Framework-based tests: 4,126 = 3,147 TestNG + 979 JUnit │ │ │ │ [debian/tests/jtreg-autopkgtest.sh] nothing to cleanup │ │ │ │ Unable to compare jtreg results: no build jtreport found for hotspot/ppc64el. │ │ │ │ Reason: '/usr/share/doc/openjdk-21-jre-headless//test-ppc64el/jtreport-hotspot.tar.gz' does not exist. │ │ │ │ --------------- jtreg console summary for jaxp --------------- │ │ │ │ @@ -14705,16 +14716,16 @@ │ │ │ │ FAILED: java/net/MulticastSocket/Promiscuous.java │ │ │ │ FAILED: java/net/MulticastSocket/SetLoopbackMode.java │ │ │ │ FAILED: java/net/MulticastSocket/SetLoopbackModeIPv4.java │ │ │ │ FAILED: java/net/MulticastSocket/Test.java │ │ │ │ FAILED: java/net/SocketOption/OptionsTest.java │ │ │ │ FAILED: java/net/SocketPermission/SocketPermissionTest.java │ │ │ │ FAILED: sun/security/krb5/auto/Addresses.java │ │ │ │ -Test results: passed: 6,499; failed: 9; skipped: 114; excluded: 39; did not match keywords: 37; did not meet module requirements: 3; did not meet platform requirements: 100 │ │ │ │ -Framework-based tests: 335,199 = 164,249 TestNG + 170,950 JUnit │ │ │ │ +Test results: passed: 6,497; failed: 9; skipped: 114; excluded: 39; did not match keywords: 37; did not meet module requirements: 3; did not meet platform requirements: 102 │ │ │ │ +Framework-based tests: 335,180 = 164,230 TestNG + 170,950 JUnit │ │ │ │ FAILED: java/net/MulticastSocket/B6427403.java │ │ │ │ FAILED: java/net/MulticastSocket/NoLoopbackPackets.java │ │ │ │ FAILED: java/net/MulticastSocket/Promiscuous.java │ │ │ │ FAILED: java/net/MulticastSocket/SetLoopbackMode.java │ │ │ │ FAILED: java/net/MulticastSocket/SetLoopbackModeIPv4.java │ │ │ │ FAILED: java/net/MulticastSocket/Test.java │ │ │ │ FAILED: java/net/SocketOption/OptionsTest.java │ │ │ │ @@ -14732,29 +14743,29 @@ │ │ │ │ FAILED: java/net/SocketPermission/SocketPermissionTest.java │ │ │ │ FAILED: sun/security/krb5/auto/Addresses.java │ │ │ │ Test results: failed: 9; excluded: 39; did not match keywords: 37; did not match prior status: 6,602 │ │ │ │ Framework-based tests: 8 = 8 TestNG + 0 JUnit │ │ │ │ [debian/tests/jtreg-autopkgtest.sh] nothing to cleanup │ │ │ │ make[2]: Leaving directory '/build/reproducible-path/openjdk-21-21.0.13~6ea' │ │ │ │ Command being timed: "/usr/bin/make -f debian/rules -k jtregcheck TEST_SUITES=hotspot langtools jaxp jdk JTREG_OPTIONS=" │ │ │ │ - User time (seconds): 42486.34 │ │ │ │ - System time (seconds): 2938.10 │ │ │ │ - Percent of CPU this job got: 129% │ │ │ │ - Elapsed (wall clock) time (h:mm:ss or m:ss): 9:45:38 │ │ │ │ + User time (seconds): 33521.25 │ │ │ │ + System time (seconds): 2390.71 │ │ │ │ + Percent of CPU this job got: 128% │ │ │ │ + Elapsed (wall clock) time (h:mm:ss or m:ss): 7:47:33 │ │ │ │ Average shared text size (kbytes): 0 │ │ │ │ Average unshared data size (kbytes): 0 │ │ │ │ Average stack size (kbytes): 0 │ │ │ │ Average total size (kbytes): 0 │ │ │ │ - Maximum resident set size (kbytes): 15566452 │ │ │ │ + Maximum resident set size (kbytes): 7575552 │ │ │ │ Average resident set size (kbytes): 0 │ │ │ │ - Major (requiring I/O) page faults: 1332 │ │ │ │ - Minor (reclaiming a frame) page faults: 271373650 │ │ │ │ - Voluntary context switches: 76410290 │ │ │ │ - Involuntary context switches: 9244233 │ │ │ │ + Major (requiring I/O) page faults: 56177 │ │ │ │ + Minor (reclaiming a frame) page faults: 37157154 │ │ │ │ + Voluntary context switches: 69667967 │ │ │ │ + Involuntary context switches: 31764599 │ │ │ │ Swaps: 0 │ │ │ │ - File system inputs: 958280 │ │ │ │ - File system outputs: 0 │ │ │ │ + File system inputs: 6272032 │ │ │ │ + File system outputs: 186107136 │ │ │ │ Socket messages sent: 0 │ │ │ │ Socket messages received: 0 │ │ │ │ Signals delivered: 0 │ │ │ │ - Page size (bytes): 4096 │ │ │ │ + Page size (bytes): 65536 │ │ │ │ Exit status: 0 │ │ ├── ./usr/share/doc/openjdk-21-jre-headless/test-ppc64el/jtreport-hotspot.tar.gz │ │ │ ├── jtreport-hotspot.tar │ │ │ │ ├── file list │ │ │ │ │ @@ -1,230 +1,302 @@ │ │ │ │ │ -lrwxrwxrwx 0 sbuild (999) sbuild (999) 0 2026-09-16 09:12:00.000000 jtreg-test-output/jdk/JTreport -> 2/JTreport │ │ │ │ │ -drwxr-xr-x 0 sbuild (999) sbuild (999) 0 2026-09-16 09:11:40.000000 jtreg-test-output/jdk/2/JTreport/ │ │ │ │ │ --rw-r--r-- 0 sbuild (999) sbuild (999) 714 2026-09-16 09:11:40.000000 jtreg-test-output/jdk/2/JTreport/index.html │ │ │ │ │ --rw-r--r-- 0 sbuild (999) sbuild (999) 0 2026-09-16 09:11:40.000000 jtreg-test-output/jdk/2/JTreport/reportdir.dat │ │ │ │ │ -drwxr-xr-x 0 sbuild (999) sbuild (999) 0 2026-09-16 09:11:40.000000 jtreg-test-output/jdk/2/JTreport/html/ │ │ │ │ │ --rw-r--r-- 0 sbuild (999) sbuild (999) 762505 2026-09-16 09:11:40.000000 jtreg-test-output/jdk/2/JTreport/html/notRun_gr.html │ │ │ │ │ --rw-r--r-- 0 sbuild (999) sbuild (999) 762232 2026-09-16 09:11:40.000000 jtreg-test-output/jdk/2/JTreport/html/notRun.html │ │ │ │ │ --rw-r--r-- 0 sbuild (999) sbuild (999) 521 2026-09-16 09:11:40.000000 jtreg-test-output/jdk/2/JTreport/html/error_gr.html │ │ │ │ │ --rw-r--r-- 0 sbuild (999) sbuild (999) 473 2026-09-16 09:11:40.000000 jtreg-test-output/jdk/2/JTreport/html/error.html │ │ │ │ │ --rw-r--r-- 0 sbuild (999) sbuild (999) 2750 2026-09-16 09:11:40.000000 jtreg-test-output/jdk/2/JTreport/html/failed_gr.html │ │ │ │ │ --rw-r--r-- 0 sbuild (999) sbuild (999) 2020 2026-09-16 09:11:40.000000 jtreg-test-output/jdk/2/JTreport/html/failed.html │ │ │ │ │ --rw-r--r-- 0 sbuild (999) sbuild (999) 1251125 2026-09-16 09:11:40.000000 jtreg-test-output/jdk/2/JTreport/html/passed_gr.html │ │ │ │ │ --rw-r--r-- 0 sbuild (999) sbuild (999) 1249652 2026-09-16 09:11:40.000000 jtreg-test-output/jdk/2/JTreport/html/passed.html │ │ │ │ │ --rw-r--r-- 0 sbuild (999) sbuild (999) 83174 2026-09-16 09:11:40.000000 jtreg-test-output/jdk/2/JTreport/html/excluded.html │ │ │ │ │ --rw-r--r-- 0 sbuild (999) sbuild (999) 4256 2026-09-16 09:11:40.000000 jtreg-test-output/jdk/2/JTreport/html/env.html │ │ │ │ │ --rw-r--r-- 0 sbuild (999) sbuild (999) 24358 2026-09-16 09:11:40.000000 jtreg-test-output/jdk/2/JTreport/html/config.html │ │ │ │ │ --rw-r--r-- 0 sbuild (999) sbuild (999) 307 2026-09-16 09:11:39.000000 jtreg-test-output/jdk/2/JTreport/html/report.css │ │ │ │ │ --rw-r--r-- 0 sbuild (999) sbuild (999) 1101685 2026-09-16 09:11:40.000000 jtreg-test-output/jdk/2/JTreport/html/index.html │ │ │ │ │ --rw-r--r-- 0 sbuild (999) sbuild (999) 1101685 2026-09-16 09:11:40.000000 jtreg-test-output/jdk/2/JTreport/html/report.html │ │ │ │ │ -drwxr-xr-x 0 sbuild (999) sbuild (999) 0 2026-09-16 09:11:40.000000 jtreg-test-output/jdk/2/JTreport/text/ │ │ │ │ │ --rw-r--r-- 0 sbuild (999) sbuild (999) 132 2026-09-16 09:11:40.000000 jtreg-test-output/jdk/2/JTreport/text/testng.txt │ │ │ │ │ --rw-r--r-- 0 sbuild (999) sbuild (999) 1023259 2026-09-16 09:11:40.000000 jtreg-test-output/jdk/2/JTreport/text/notRun.txt │ │ │ │ │ --rw-r--r-- 0 sbuild (999) sbuild (999) 101 2026-09-16 09:11:40.000000 jtreg-test-output/jdk/2/JTreport/text/stats.txt │ │ │ │ │ --rw-r--r-- 0 sbuild (999) sbuild (999) 116 2026-09-16 09:11:40.000000 jtreg-test-output/jdk/2/JTreport/text/timeStats.txt │ │ │ │ │ --rw-r--r-- 0 sbuild (999) sbuild (999) 21 2026-09-16 09:11:40.000000 jtreg-test-output/jdk/2/JTreport/text/tc_newfailures.txt │ │ │ │ │ --rw-r--r-- 0 sbuild (999) sbuild (999) 21 2026-09-16 09:11:40.000000 jtreg-test-output/jdk/2/JTreport/text/tc_fail2notrun.txt │ │ │ │ │ --rw-r--r-- 0 sbuild (999) sbuild (999) 20 2026-09-16 09:11:40.000000 jtreg-test-output/jdk/2/JTreport/text/tc_fail2error.txt │ │ │ │ │ --rw-r--r-- 0 sbuild (999) sbuild (999) 19 2026-09-16 09:11:40.000000 jtreg-test-output/jdk/2/JTreport/text/tc_fail2pass.txt │ │ │ │ │ --rw-r--r-- 0 sbuild (999) sbuild (999) 22 2026-09-16 09:11:40.000000 jtreg-test-output/jdk/2/JTreport/text/tc_fail2missing.txt │ │ │ │ │ --rw-r--r-- 0 sbuild (999) sbuild (999) 19 2026-09-16 09:11:40.000000 jtreg-test-output/jdk/2/JTreport/text/other_errors.txt │ │ │ │ │ --rw-r--r-- 0 sbuild (999) sbuild (999) 416 2026-09-16 09:11:40.000000 jtreg-test-output/jdk/2/JTreport/text/newfailures.txt │ │ │ │ │ --rw-r--r-- 0 sbuild (999) sbuild (999) 16 2026-09-16 09:11:40.000000 jtreg-test-output/jdk/2/JTreport/text/fail2fail.txt │ │ │ │ │ --rw-r--r-- 0 sbuild (999) sbuild (999) 18 2026-09-16 09:11:40.000000 jtreg-test-output/jdk/2/JTreport/text/fail2notrun.txt │ │ │ │ │ --rw-r--r-- 0 sbuild (999) sbuild (999) 17 2026-09-16 09:11:40.000000 jtreg-test-output/jdk/2/JTreport/text/faiL2error.txt │ │ │ │ │ --rw-r--r-- 0 sbuild (999) sbuild (999) 16 2026-09-16 09:11:40.000000 jtreg-test-output/jdk/2/JTreport/text/fail2pass.txt │ │ │ │ │ --rw-r--r-- 0 sbuild (999) sbuild (999) 19 2026-09-16 09:11:40.000000 jtreg-test-output/jdk/2/JTreport/text/fail2missing.txt │ │ │ │ │ --rw-r--r-- 0 sbuild (999) sbuild (999) 891289 2026-09-16 09:11:40.000000 jtreg-test-output/jdk/2/JTreport/text/summary.txt │ │ │ │ │ --rw-r--r-- 0 sbuild (999) sbuild (999) 552 2026-09-16 09:11:17.000000 jtreg-test-output/jdk/2/JTreport/text/cmdArgs.txt │ │ │ │ │ -drwxr-xr-x 0 sbuild (999) sbuild (999) 0 2026-09-16 09:10:57.000000 jtreg-test-output/jdk/1/JTreport/ │ │ │ │ │ --rw-r--r-- 0 sbuild (999) sbuild (999) 714 2026-09-16 09:10:57.000000 jtreg-test-output/jdk/1/JTreport/index.html │ │ │ │ │ --rw-r--r-- 0 sbuild (999) sbuild (999) 0 2026-09-16 09:10:57.000000 jtreg-test-output/jdk/1/JTreport/reportdir.dat │ │ │ │ │ -drwxr-xr-x 0 sbuild (999) sbuild (999) 0 2026-09-16 09:10:56.000000 jtreg-test-output/jdk/1/JTreport/html/ │ │ │ │ │ --rw-r--r-- 0 sbuild (999) sbuild (999) 762505 2026-09-16 09:10:56.000000 jtreg-test-output/jdk/1/JTreport/html/notRun_gr.html │ │ │ │ │ --rw-r--r-- 0 sbuild (999) sbuild (999) 762232 2026-09-16 09:10:56.000000 jtreg-test-output/jdk/1/JTreport/html/notRun.html │ │ │ │ │ --rw-r--r-- 0 sbuild (999) sbuild (999) 521 2026-09-16 09:10:56.000000 jtreg-test-output/jdk/1/JTreport/html/error_gr.html │ │ │ │ │ --rw-r--r-- 0 sbuild (999) sbuild (999) 473 2026-09-16 09:10:56.000000 jtreg-test-output/jdk/1/JTreport/html/error.html │ │ │ │ │ --rw-r--r-- 0 sbuild (999) sbuild (999) 2750 2026-09-16 09:10:56.000000 jtreg-test-output/jdk/1/JTreport/html/failed_gr.html │ │ │ │ │ --rw-r--r-- 0 sbuild (999) sbuild (999) 2020 2026-09-16 09:10:56.000000 jtreg-test-output/jdk/1/JTreport/html/failed.html │ │ │ │ │ --rw-r--r-- 0 sbuild (999) sbuild (999) 1251125 2026-09-16 09:10:56.000000 jtreg-test-output/jdk/1/JTreport/html/passed_gr.html │ │ │ │ │ --rw-r--r-- 0 sbuild (999) sbuild (999) 1249652 2026-09-16 09:10:56.000000 jtreg-test-output/jdk/1/JTreport/html/passed.html │ │ │ │ │ --rw-r--r-- 0 sbuild (999) sbuild (999) 83174 2026-09-16 09:10:56.000000 jtreg-test-output/jdk/1/JTreport/html/excluded.html │ │ │ │ │ --rw-r--r-- 0 sbuild (999) sbuild (999) 4256 2026-09-16 09:10:56.000000 jtreg-test-output/jdk/1/JTreport/html/env.html │ │ │ │ │ --rw-r--r-- 0 sbuild (999) sbuild (999) 24358 2026-09-16 09:10:56.000000 jtreg-test-output/jdk/1/JTreport/html/config.html │ │ │ │ │ --rw-r--r-- 0 sbuild (999) sbuild (999) 307 2026-09-16 09:10:56.000000 jtreg-test-output/jdk/1/JTreport/html/report.css │ │ │ │ │ --rw-r--r-- 0 sbuild (999) sbuild (999) 1101685 2026-09-16 09:10:56.000000 jtreg-test-output/jdk/1/JTreport/html/index.html │ │ │ │ │ --rw-r--r-- 0 sbuild (999) sbuild (999) 1101685 2026-09-16 09:10:56.000000 jtreg-test-output/jdk/1/JTreport/html/report.html │ │ │ │ │ -drwxr-xr-x 0 sbuild (999) sbuild (999) 0 2026-09-16 09:10:57.000000 jtreg-test-output/jdk/1/JTreport/text/ │ │ │ │ │ --rw-r--r-- 0 sbuild (999) sbuild (999) 132 2026-09-16 09:10:57.000000 jtreg-test-output/jdk/1/JTreport/text/testng.txt │ │ │ │ │ --rw-r--r-- 0 sbuild (999) sbuild (999) 1023259 2026-09-16 09:10:57.000000 jtreg-test-output/jdk/1/JTreport/text/notRun.txt │ │ │ │ │ --rw-r--r-- 0 sbuild (999) sbuild (999) 101 2026-09-16 09:10:57.000000 jtreg-test-output/jdk/1/JTreport/text/stats.txt │ │ │ │ │ --rw-r--r-- 0 sbuild (999) sbuild (999) 116 2026-09-16 09:10:57.000000 jtreg-test-output/jdk/1/JTreport/text/timeStats.txt │ │ │ │ │ --rw-r--r-- 0 sbuild (999) sbuild (999) 21 2026-09-16 09:10:57.000000 jtreg-test-output/jdk/1/JTreport/text/tc_newfailures.txt │ │ │ │ │ --rw-r--r-- 0 sbuild (999) sbuild (999) 21 2026-09-16 09:10:57.000000 jtreg-test-output/jdk/1/JTreport/text/tc_fail2notrun.txt │ │ │ │ │ --rw-r--r-- 0 sbuild (999) sbuild (999) 20 2026-09-16 09:10:57.000000 jtreg-test-output/jdk/1/JTreport/text/tc_fail2error.txt │ │ │ │ │ --rw-r--r-- 0 sbuild (999) sbuild (999) 19 2026-09-16 09:10:57.000000 jtreg-test-output/jdk/1/JTreport/text/tc_fail2pass.txt │ │ │ │ │ --rw-r--r-- 0 sbuild (999) sbuild (999) 22 2026-09-16 09:10:57.000000 jtreg-test-output/jdk/1/JTreport/text/tc_fail2missing.txt │ │ │ │ │ --rw-r--r-- 0 sbuild (999) sbuild (999) 19 2026-09-16 09:10:57.000000 jtreg-test-output/jdk/1/JTreport/text/other_errors.txt │ │ │ │ │ --rw-r--r-- 0 sbuild (999) sbuild (999) 416 2026-09-16 09:10:57.000000 jtreg-test-output/jdk/1/JTreport/text/newfailures.txt │ │ │ │ │ --rw-r--r-- 0 sbuild (999) sbuild (999) 16 2026-09-16 09:10:57.000000 jtreg-test-output/jdk/1/JTreport/text/fail2fail.txt │ │ │ │ │ --rw-r--r-- 0 sbuild (999) sbuild (999) 18 2026-09-16 09:10:57.000000 jtreg-test-output/jdk/1/JTreport/text/fail2notrun.txt │ │ │ │ │ --rw-r--r-- 0 sbuild (999) sbuild (999) 17 2026-09-16 09:10:57.000000 jtreg-test-output/jdk/1/JTreport/text/faiL2error.txt │ │ │ │ │ --rw-r--r-- 0 sbuild (999) sbuild (999) 16 2026-09-16 09:10:57.000000 jtreg-test-output/jdk/1/JTreport/text/fail2pass.txt │ │ │ │ │ --rw-r--r-- 0 sbuild (999) sbuild (999) 19 2026-09-16 09:10:57.000000 jtreg-test-output/jdk/1/JTreport/text/fail2missing.txt │ │ │ │ │ --rw-r--r-- 0 sbuild (999) sbuild (999) 891289 2026-09-16 09:10:57.000000 jtreg-test-output/jdk/1/JTreport/text/summary.txt │ │ │ │ │ --rw-r--r-- 0 sbuild (999) sbuild (999) 552 2026-09-16 09:10:34.000000 jtreg-test-output/jdk/1/JTreport/text/cmdArgs.txt │ │ │ │ │ -drwxr-xr-x 0 sbuild (999) sbuild (999) 0 2026-09-16 09:10:12.000000 jtreg-test-output/jdk/0/JTreport/ │ │ │ │ │ --rw-r--r-- 0 sbuild (999) sbuild (999) 714 2026-09-16 09:10:12.000000 jtreg-test-output/jdk/0/JTreport/index.html │ │ │ │ │ --rw-r--r-- 0 sbuild (999) sbuild (999) 0 2026-09-16 09:10:12.000000 jtreg-test-output/jdk/0/JTreport/reportdir.dat │ │ │ │ │ -drwxr-xr-x 0 sbuild (999) sbuild (999) 0 2026-09-16 09:10:12.000000 jtreg-test-output/jdk/0/JTreport/html/ │ │ │ │ │ --rw-r--r-- 0 sbuild (999) sbuild (999) 20877 2026-09-16 09:10:12.000000 jtreg-test-output/jdk/0/JTreport/html/notRun_gr.html │ │ │ │ │ --rw-r--r-- 0 sbuild (999) sbuild (999) 20532 2026-09-16 09:10:12.000000 jtreg-test-output/jdk/0/JTreport/html/notRun.html │ │ │ │ │ --rw-r--r-- 0 sbuild (999) sbuild (999) 521 2026-09-16 09:10:12.000000 jtreg-test-output/jdk/0/JTreport/html/error_gr.html │ │ │ │ │ --rw-r--r-- 0 sbuild (999) sbuild (999) 473 2026-09-16 09:10:12.000000 jtreg-test-output/jdk/0/JTreport/html/error.html │ │ │ │ │ --rw-r--r-- 0 sbuild (999) sbuild (999) 2750 2026-09-16 09:10:12.000000 jtreg-test-output/jdk/0/JTreport/html/failed_gr.html │ │ │ │ │ --rw-r--r-- 0 sbuild (999) sbuild (999) 2020 2026-09-16 09:10:12.000000 jtreg-test-output/jdk/0/JTreport/html/failed.html │ │ │ │ │ --rw-r--r-- 0 sbuild (999) sbuild (999) 1251125 2026-09-16 09:10:12.000000 jtreg-test-output/jdk/0/JTreport/html/passed_gr.html │ │ │ │ │ --rw-r--r-- 0 sbuild (999) sbuild (999) 1249652 2026-09-16 09:10:12.000000 jtreg-test-output/jdk/0/JTreport/html/passed.html │ │ │ │ │ --rw-r--r-- 0 sbuild (999) sbuild (999) 83174 2026-09-16 09:10:12.000000 jtreg-test-output/jdk/0/JTreport/html/excluded.html │ │ │ │ │ --rw-r--r-- 0 sbuild (999) sbuild (999) 4237 2026-09-16 09:10:12.000000 jtreg-test-output/jdk/0/JTreport/html/env.html │ │ │ │ │ --rw-r--r-- 0 sbuild (999) sbuild (999) 23926 2026-09-16 09:10:12.000000 jtreg-test-output/jdk/0/JTreport/html/config.html │ │ │ │ │ --rw-r--r-- 0 sbuild (999) sbuild (999) 307 2026-09-16 09:10:11.000000 jtreg-test-output/jdk/0/JTreport/html/report.css │ │ │ │ │ --rw-r--r-- 0 sbuild (999) sbuild (999) 1124333 2026-09-16 09:10:12.000000 jtreg-test-output/jdk/0/JTreport/html/index.html │ │ │ │ │ --rw-r--r-- 0 sbuild (999) sbuild (999) 1124333 2026-09-16 09:10:12.000000 jtreg-test-output/jdk/0/JTreport/html/report.html │ │ │ │ │ -drwxr-xr-x 0 sbuild (999) sbuild (999) 0 2026-09-16 09:10:12.000000 jtreg-test-output/jdk/0/JTreport/text/ │ │ │ │ │ --rw-r--r-- 0 sbuild (999) sbuild (999) 85635 2026-09-16 09:10:12.000000 jtreg-test-output/jdk/0/JTreport/text/junit.txt │ │ │ │ │ --rw-r--r-- 0 sbuild (999) sbuild (999) 132051 2026-09-16 09:10:12.000000 jtreg-test-output/jdk/0/JTreport/text/testng.txt │ │ │ │ │ --rw-r--r-- 0 sbuild (999) sbuild (999) 26565 2026-09-16 09:10:12.000000 jtreg-test-output/jdk/0/JTreport/text/notRun.txt │ │ │ │ │ --rw-r--r-- 0 sbuild (999) sbuild (999) 173 2026-09-16 09:10:12.000000 jtreg-test-output/jdk/0/JTreport/text/stats.txt │ │ │ │ │ --rw-r--r-- 0 sbuild (999) sbuild (999) 1043 2026-09-16 09:10:12.000000 jtreg-test-output/jdk/0/JTreport/text/timeStats.txt │ │ │ │ │ --rw-r--r-- 0 sbuild (999) sbuild (999) 21 2026-09-16 09:10:12.000000 jtreg-test-output/jdk/0/JTreport/text/tc_newfailures.txt │ │ │ │ │ --rw-r--r-- 0 sbuild (999) sbuild (999) 21 2026-09-16 09:10:12.000000 jtreg-test-output/jdk/0/JTreport/text/tc_fail2notrun.txt │ │ │ │ │ --rw-r--r-- 0 sbuild (999) sbuild (999) 20 2026-09-16 09:10:12.000000 jtreg-test-output/jdk/0/JTreport/text/tc_fail2error.txt │ │ │ │ │ --rw-r--r-- 0 sbuild (999) sbuild (999) 19 2026-09-16 09:10:12.000000 jtreg-test-output/jdk/0/JTreport/text/tc_fail2pass.txt │ │ │ │ │ --rw-r--r-- 0 sbuild (999) sbuild (999) 22 2026-09-16 09:10:12.000000 jtreg-test-output/jdk/0/JTreport/text/tc_fail2missing.txt │ │ │ │ │ --rw-r--r-- 0 sbuild (999) sbuild (999) 19 2026-09-16 09:10:12.000000 jtreg-test-output/jdk/0/JTreport/text/other_errors.txt │ │ │ │ │ --rw-r--r-- 0 sbuild (999) sbuild (999) 416 2026-09-16 09:10:12.000000 jtreg-test-output/jdk/0/JTreport/text/newfailures.txt │ │ │ │ │ --rw-r--r-- 0 sbuild (999) sbuild (999) 16 2026-09-16 09:10:12.000000 jtreg-test-output/jdk/0/JTreport/text/fail2fail.txt │ │ │ │ │ --rw-r--r-- 0 sbuild (999) sbuild (999) 18 2026-09-16 09:10:12.000000 jtreg-test-output/jdk/0/JTreport/text/fail2notrun.txt │ │ │ │ │ --rw-r--r-- 0 sbuild (999) sbuild (999) 17 2026-09-16 09:10:12.000000 jtreg-test-output/jdk/0/JTreport/text/faiL2error.txt │ │ │ │ │ --rw-r--r-- 0 sbuild (999) sbuild (999) 16 2026-09-16 09:10:12.000000 jtreg-test-output/jdk/0/JTreport/text/fail2pass.txt │ │ │ │ │ --rw-r--r-- 0 sbuild (999) sbuild (999) 19 2026-09-16 09:10:12.000000 jtreg-test-output/jdk/0/JTreport/text/fail2missing.txt │ │ │ │ │ --rw-r--r-- 0 sbuild (999) sbuild (999) 891289 2026-09-16 09:10:12.000000 jtreg-test-output/jdk/0/JTreport/text/summary.txt │ │ │ │ │ --rw-r--r-- 0 sbuild (999) sbuild (999) 533 2026-09-16 04:19:44.000000 jtreg-test-output/jdk/0/JTreport/text/cmdArgs.txt │ │ │ │ │ -lrwxrwxrwx 0 sbuild (999) sbuild (999) 0 2026-09-16 04:19:40.000000 jtreg-test-output/jaxp/JTreport -> 0/JTreport │ │ │ │ │ -drwxr-xr-x 0 sbuild (999) sbuild (999) 0 2026-09-16 04:19:37.000000 jtreg-test-output/jaxp/0/JTreport/ │ │ │ │ │ --rw-r--r-- 0 sbuild (999) sbuild (999) 716 2026-09-16 04:19:37.000000 jtreg-test-output/jaxp/0/JTreport/index.html │ │ │ │ │ --rw-r--r-- 0 sbuild (999) sbuild (999) 0 2026-09-16 04:19:37.000000 jtreg-test-output/jaxp/0/JTreport/reportdir.dat │ │ │ │ │ -drwxr-xr-x 0 sbuild (999) sbuild (999) 0 2026-09-16 04:19:37.000000 jtreg-test-output/jaxp/0/JTreport/html/ │ │ │ │ │ --rw-r--r-- 0 sbuild (999) sbuild (999) 695 2026-09-16 04:19:37.000000 jtreg-test-output/jaxp/0/JTreport/html/notRun_gr.html │ │ │ │ │ --rw-r--r-- 0 sbuild (999) sbuild (999) 573 2026-09-16 04:19:37.000000 jtreg-test-output/jaxp/0/JTreport/html/notRun.html │ │ │ │ │ --rw-r--r-- 0 sbuild (999) sbuild (999) 521 2026-09-16 04:19:37.000000 jtreg-test-output/jaxp/0/JTreport/html/error_gr.html │ │ │ │ │ --rw-r--r-- 0 sbuild (999) sbuild (999) 473 2026-09-16 04:19:37.000000 jtreg-test-output/jaxp/0/JTreport/html/error.html │ │ │ │ │ --rw-r--r-- 0 sbuild (999) sbuild (999) 513 2026-09-16 04:19:37.000000 jtreg-test-output/jaxp/0/JTreport/html/failed_gr.html │ │ │ │ │ --rw-r--r-- 0 sbuild (999) sbuild (999) 465 2026-09-16 04:19:37.000000 jtreg-test-output/jaxp/0/JTreport/html/failed.html │ │ │ │ │ --rw-r--r-- 0 sbuild (999) sbuild (999) 110062 2026-09-16 04:19:37.000000 jtreg-test-output/jaxp/0/JTreport/html/passed_gr.html │ │ │ │ │ --rw-r--r-- 0 sbuild (999) sbuild (999) 109973 2026-09-16 04:19:37.000000 jtreg-test-output/jaxp/0/JTreport/html/passed.html │ │ │ │ │ --rw-r--r-- 0 sbuild (999) sbuild (999) 3642 2026-09-16 04:19:37.000000 jtreg-test-output/jaxp/0/JTreport/html/excluded.html │ │ │ │ │ --rw-r--r-- 0 sbuild (999) sbuild (999) 4145 2026-09-16 04:19:37.000000 jtreg-test-output/jaxp/0/JTreport/html/env.html │ │ │ │ │ --rw-r--r-- 0 sbuild (999) sbuild (999) 4425 2026-09-16 04:19:37.000000 jtreg-test-output/jaxp/0/JTreport/html/config.html │ │ │ │ │ --rw-r--r-- 0 sbuild (999) sbuild (999) 307 2026-09-16 04:19:37.000000 jtreg-test-output/jaxp/0/JTreport/html/report.css │ │ │ │ │ --rw-r--r-- 0 sbuild (999) sbuild (999) 58502 2026-09-16 04:19:37.000000 jtreg-test-output/jaxp/0/JTreport/html/index.html │ │ │ │ │ --rw-r--r-- 0 sbuild (999) sbuild (999) 58502 2026-09-16 04:19:37.000000 jtreg-test-output/jaxp/0/JTreport/html/report.html │ │ │ │ │ -drwxr-xr-x 0 sbuild (999) sbuild (999) 0 2026-09-16 04:19:38.000000 jtreg-test-output/jaxp/0/JTreport/text/ │ │ │ │ │ --rw-r--r-- 0 sbuild (999) sbuild (999) 200 2026-09-16 04:19:38.000000 jtreg-test-output/jaxp/0/JTreport/text/junit.txt │ │ │ │ │ --rw-r--r-- 0 sbuild (999) sbuild (999) 69461 2026-09-16 04:19:38.000000 jtreg-test-output/jaxp/0/JTreport/text/testng.txt │ │ │ │ │ --rw-r--r-- 0 sbuild (999) sbuild (999) 116 2026-09-16 04:19:38.000000 jtreg-test-output/jaxp/0/JTreport/text/notRun.txt │ │ │ │ │ --rw-r--r-- 0 sbuild (999) sbuild (999) 65 2026-09-16 04:19:37.000000 jtreg-test-output/jaxp/0/JTreport/text/stats.txt │ │ │ │ │ --rw-r--r-- 0 sbuild (999) sbuild (999) 189 2026-09-16 04:19:37.000000 jtreg-test-output/jaxp/0/JTreport/text/timeStats.txt │ │ │ │ │ --rw-r--r-- 0 sbuild (999) sbuild (999) 21 2026-09-16 04:19:37.000000 jtreg-test-output/jaxp/0/JTreport/text/tc_newfailures.txt │ │ │ │ │ --rw-r--r-- 0 sbuild (999) sbuild (999) 21 2026-09-16 04:19:37.000000 jtreg-test-output/jaxp/0/JTreport/text/tc_fail2notrun.txt │ │ │ │ │ --rw-r--r-- 0 sbuild (999) sbuild (999) 20 2026-09-16 04:19:37.000000 jtreg-test-output/jaxp/0/JTreport/text/tc_fail2error.txt │ │ │ │ │ --rw-r--r-- 0 sbuild (999) sbuild (999) 19 2026-09-16 04:19:37.000000 jtreg-test-output/jaxp/0/JTreport/text/tc_fail2pass.txt │ │ │ │ │ --rw-r--r-- 0 sbuild (999) sbuild (999) 22 2026-09-16 04:19:37.000000 jtreg-test-output/jaxp/0/JTreport/text/tc_fail2missing.txt │ │ │ │ │ --rw-r--r-- 0 sbuild (999) sbuild (999) 19 2026-09-16 04:19:37.000000 jtreg-test-output/jaxp/0/JTreport/text/other_errors.txt │ │ │ │ │ --rw-r--r-- 0 sbuild (999) sbuild (999) 18 2026-09-16 04:19:37.000000 jtreg-test-output/jaxp/0/JTreport/text/newfailures.txt │ │ │ │ │ --rw-r--r-- 0 sbuild (999) sbuild (999) 16 2026-09-16 04:19:37.000000 jtreg-test-output/jaxp/0/JTreport/text/fail2fail.txt │ │ │ │ │ --rw-r--r-- 0 sbuild (999) sbuild (999) 18 2026-09-16 04:19:37.000000 jtreg-test-output/jaxp/0/JTreport/text/fail2notrun.txt │ │ │ │ │ --rw-r--r-- 0 sbuild (999) sbuild (999) 17 2026-09-16 04:19:37.000000 jtreg-test-output/jaxp/0/JTreport/text/faiL2error.txt │ │ │ │ │ --rw-r--r-- 0 sbuild (999) sbuild (999) 16 2026-09-16 04:19:37.000000 jtreg-test-output/jaxp/0/JTreport/text/fail2pass.txt │ │ │ │ │ --rw-r--r-- 0 sbuild (999) sbuild (999) 19 2026-09-16 04:19:37.000000 jtreg-test-output/jaxp/0/JTreport/text/fail2missing.txt │ │ │ │ │ --rw-r--r-- 0 sbuild (999) sbuild (999) 59118 2026-09-16 04:19:37.000000 jtreg-test-output/jaxp/0/JTreport/text/summary.txt │ │ │ │ │ --rw-r--r-- 0 sbuild (999) sbuild (999) 441 2026-09-16 03:53:31.000000 jtreg-test-output/jaxp/0/JTreport/text/cmdArgs.txt │ │ │ │ │ -lrwxrwxrwx 0 sbuild (999) sbuild (999) 0 2026-09-16 03:53:31.000000 jtreg-test-output/langtools/JTreport -> 0/JTreport │ │ │ │ │ -drwxr-xr-x 0 sbuild (999) sbuild (999) 0 2026-09-16 03:53:18.000000 jtreg-test-output/langtools/0/JTreport/ │ │ │ │ │ --rw-r--r-- 0 sbuild (999) sbuild (999) 726 2026-09-16 03:53:18.000000 jtreg-test-output/langtools/0/JTreport/index.html │ │ │ │ │ --rw-r--r-- 0 sbuild (999) sbuild (999) 0 2026-09-16 03:53:18.000000 jtreg-test-output/langtools/0/JTreport/reportdir.dat │ │ │ │ │ -drwxr-xr-x 0 sbuild (999) sbuild (999) 0 2026-09-16 03:53:18.000000 jtreg-test-output/langtools/0/JTreport/html/ │ │ │ │ │ --rw-r--r-- 0 sbuild (999) sbuild (999) 2463 2026-09-16 03:53:18.000000 jtreg-test-output/langtools/0/JTreport/html/notRun_gr.html │ │ │ │ │ --rw-r--r-- 0 sbuild (999) sbuild (999) 2174 2026-09-16 03:53:18.000000 jtreg-test-output/langtools/0/JTreport/html/notRun.html │ │ │ │ │ --rw-r--r-- 0 sbuild (999) sbuild (999) 521 2026-09-16 03:53:18.000000 jtreg-test-output/langtools/0/JTreport/html/error_gr.html │ │ │ │ │ --rw-r--r-- 0 sbuild (999) sbuild (999) 473 2026-09-16 03:53:18.000000 jtreg-test-output/langtools/0/JTreport/html/error.html │ │ │ │ │ --rw-r--r-- 0 sbuild (999) sbuild (999) 513 2026-09-16 03:53:18.000000 jtreg-test-output/langtools/0/JTreport/html/failed_gr.html │ │ │ │ │ --rw-r--r-- 0 sbuild (999) sbuild (999) 465 2026-09-16 03:53:18.000000 jtreg-test-output/langtools/0/JTreport/html/failed.html │ │ │ │ │ --rw-r--r-- 0 sbuild (999) sbuild (999) 885492 2026-09-16 03:53:18.000000 jtreg-test-output/langtools/0/JTreport/html/passed_gr.html │ │ │ │ │ --rw-r--r-- 0 sbuild (999) sbuild (999) 885167 2026-09-16 03:53:18.000000 jtreg-test-output/langtools/0/JTreport/html/passed.html │ │ │ │ │ --rw-r--r-- 0 sbuild (999) sbuild (999) 6195 2026-09-16 03:53:18.000000 jtreg-test-output/langtools/0/JTreport/html/excluded.html │ │ │ │ │ --rw-r--r-- 0 sbuild (999) sbuild (999) 4160 2026-09-16 03:53:18.000000 jtreg-test-output/langtools/0/JTreport/html/env.html │ │ │ │ │ --rw-r--r-- 0 sbuild (999) sbuild (999) 10727 2026-09-16 03:53:18.000000 jtreg-test-output/langtools/0/JTreport/html/config.html │ │ │ │ │ --rw-r--r-- 0 sbuild (999) sbuild (999) 307 2026-09-16 03:53:17.000000 jtreg-test-output/langtools/0/JTreport/html/report.css │ │ │ │ │ --rw-r--r-- 0 sbuild (999) sbuild (999) 541947 2026-09-16 03:53:18.000000 jtreg-test-output/langtools/0/JTreport/html/index.html │ │ │ │ │ --rw-r--r-- 0 sbuild (999) sbuild (999) 541947 2026-09-16 03:53:18.000000 jtreg-test-output/langtools/0/JTreport/html/report.html │ │ │ │ │ -drwxr-xr-x 0 sbuild (999) sbuild (999) 0 2026-09-16 03:53:18.000000 jtreg-test-output/langtools/0/JTreport/text/ │ │ │ │ │ --rw-r--r-- 0 sbuild (999) sbuild (999) 18550 2026-09-16 03:53:18.000000 jtreg-test-output/langtools/0/JTreport/text/junit.txt │ │ │ │ │ --rw-r--r-- 0 sbuild (999) sbuild (999) 9538 2026-09-16 03:53:18.000000 jtreg-test-output/langtools/0/JTreport/text/testng.txt │ │ │ │ │ --rw-r--r-- 0 sbuild (999) sbuild (999) 1921 2026-09-16 03:53:18.000000 jtreg-test-output/langtools/0/JTreport/text/notRun.txt │ │ │ │ │ --rw-r--r-- 0 sbuild (999) sbuild (999) 120 2026-09-16 03:53:18.000000 jtreg-test-output/langtools/0/JTreport/text/stats.txt │ │ │ │ │ --rw-r--r-- 0 sbuild (999) sbuild (999) 501 2026-09-16 03:53:18.000000 jtreg-test-output/langtools/0/JTreport/text/timeStats.txt │ │ │ │ │ --rw-r--r-- 0 sbuild (999) sbuild (999) 21 2026-09-16 03:53:18.000000 jtreg-test-output/langtools/0/JTreport/text/tc_newfailures.txt │ │ │ │ │ --rw-r--r-- 0 sbuild (999) sbuild (999) 21 2026-09-16 03:53:18.000000 jtreg-test-output/langtools/0/JTreport/text/tc_fail2notrun.txt │ │ │ │ │ --rw-r--r-- 0 sbuild (999) sbuild (999) 20 2026-09-16 03:53:18.000000 jtreg-test-output/langtools/0/JTreport/text/tc_fail2error.txt │ │ │ │ │ --rw-r--r-- 0 sbuild (999) sbuild (999) 19 2026-09-16 03:53:18.000000 jtreg-test-output/langtools/0/JTreport/text/tc_fail2pass.txt │ │ │ │ │ --rw-r--r-- 0 sbuild (999) sbuild (999) 22 2026-09-16 03:53:18.000000 jtreg-test-output/langtools/0/JTreport/text/tc_fail2missing.txt │ │ │ │ │ --rw-r--r-- 0 sbuild (999) sbuild (999) 19 2026-09-16 03:53:18.000000 jtreg-test-output/langtools/0/JTreport/text/other_errors.txt │ │ │ │ │ --rw-r--r-- 0 sbuild (999) sbuild (999) 18 2026-09-16 03:53:18.000000 jtreg-test-output/langtools/0/JTreport/text/newfailures.txt │ │ │ │ │ --rw-r--r-- 0 sbuild (999) sbuild (999) 16 2026-09-16 03:53:18.000000 jtreg-test-output/langtools/0/JTreport/text/fail2fail.txt │ │ │ │ │ --rw-r--r-- 0 sbuild (999) sbuild (999) 18 2026-09-16 03:53:18.000000 jtreg-test-output/langtools/0/JTreport/text/fail2notrun.txt │ │ │ │ │ --rw-r--r-- 0 sbuild (999) sbuild (999) 17 2026-09-16 03:53:18.000000 jtreg-test-output/langtools/0/JTreport/text/faiL2error.txt │ │ │ │ │ --rw-r--r-- 0 sbuild (999) sbuild (999) 16 2026-09-16 03:53:18.000000 jtreg-test-output/langtools/0/JTreport/text/fail2pass.txt │ │ │ │ │ --rw-r--r-- 0 sbuild (999) sbuild (999) 19 2026-09-16 03:53:18.000000 jtreg-test-output/langtools/0/JTreport/text/fail2missing.txt │ │ │ │ │ --rw-r--r-- 0 sbuild (999) sbuild (999) 643622 2026-09-16 03:53:18.000000 jtreg-test-output/langtools/0/JTreport/text/summary.txt │ │ │ │ │ --rw-r--r-- 0 sbuild (999) sbuild (999) 456 2026-09-16 03:03:59.000000 jtreg-test-output/langtools/0/JTreport/text/cmdArgs.txt │ │ │ │ │ -lrwxrwxrwx 0 sbuild (999) sbuild (999) 0 2026-09-16 03:03:56.000000 jtreg-test-output/hotspot/JTreport -> 0/JTreport │ │ │ │ │ -drwxr-xr-x 0 sbuild (999) sbuild (999) 0 2026-09-16 03:03:43.000000 jtreg-test-output/hotspot/0/JTreport/ │ │ │ │ │ --rw-r--r-- 0 sbuild (999) sbuild (999) 728 2026-09-16 03:03:43.000000 jtreg-test-output/hotspot/0/JTreport/index.html │ │ │ │ │ --rw-r--r-- 0 sbuild (999) sbuild (999) 0 2026-09-16 03:03:43.000000 jtreg-test-output/hotspot/0/JTreport/reportdir.dat │ │ │ │ │ -drwxr-xr-x 0 sbuild (999) sbuild (999) 0 2026-09-16 03:03:42.000000 jtreg-test-output/hotspot/0/JTreport/html/ │ │ │ │ │ --rw-r--r-- 0 sbuild (999) sbuild (999) 49644 2026-09-16 03:03:42.000000 jtreg-test-output/hotspot/0/JTreport/html/notRun_gr.html │ │ │ │ │ --rw-r--r-- 0 sbuild (999) sbuild (999) 49299 2026-09-16 03:03:42.000000 jtreg-test-output/hotspot/0/JTreport/html/notRun.html │ │ │ │ │ --rw-r--r-- 0 sbuild (999) sbuild (999) 521 2026-09-16 03:03:42.000000 jtreg-test-output/hotspot/0/JTreport/html/error_gr.html │ │ │ │ │ --rw-r--r-- 0 sbuild (999) sbuild (999) 473 2026-09-16 03:03:42.000000 jtreg-test-output/hotspot/0/JTreport/html/error.html │ │ │ │ │ --rw-r--r-- 0 sbuild (999) sbuild (999) 513 2026-09-16 03:03:42.000000 jtreg-test-output/hotspot/0/JTreport/html/failed_gr.html │ │ │ │ │ --rw-r--r-- 0 sbuild (999) sbuild (999) 465 2026-09-16 03:03:42.000000 jtreg-test-output/hotspot/0/JTreport/html/failed.html │ │ │ │ │ --rw-r--r-- 0 sbuild (999) sbuild (999) 607780 2026-09-16 03:03:42.000000 jtreg-test-output/hotspot/0/JTreport/html/passed_gr.html │ │ │ │ │ --rw-r--r-- 0 sbuild (999) sbuild (999) 607389 2026-09-16 03:03:42.000000 jtreg-test-output/hotspot/0/JTreport/html/passed.html │ │ │ │ │ --rw-r--r-- 0 sbuild (999) sbuild (999) 18324 2026-09-16 03:03:42.000000 jtreg-test-output/hotspot/0/JTreport/html/excluded.html │ │ │ │ │ --rw-r--r-- 0 sbuild (999) sbuild (999) 4259 2026-09-16 03:03:42.000000 jtreg-test-output/hotspot/0/JTreport/html/env.html │ │ │ │ │ --rw-r--r-- 0 sbuild (999) sbuild (999) 78259 2026-09-16 03:03:42.000000 jtreg-test-output/hotspot/0/JTreport/html/config.html │ │ │ │ │ --rw-r--r-- 0 sbuild (999) sbuild (999) 307 2026-09-16 03:03:42.000000 jtreg-test-output/hotspot/0/JTreport/html/report.css │ │ │ │ │ --rw-r--r-- 0 sbuild (999) sbuild (999) 529191 2026-09-16 03:03:42.000000 jtreg-test-output/hotspot/0/JTreport/html/index.html │ │ │ │ │ --rw-r--r-- 0 sbuild (999) sbuild (999) 529191 2026-09-16 03:03:42.000000 jtreg-test-output/hotspot/0/JTreport/html/report.html │ │ │ │ │ -drwxr-xr-x 0 sbuild (999) sbuild (999) 0 2026-09-16 03:03:43.000000 jtreg-test-output/hotspot/0/JTreport/text/ │ │ │ │ │ --rw-r--r-- 0 sbuild (999) sbuild (999) 3273 2026-09-16 03:03:43.000000 jtreg-test-output/hotspot/0/JTreport/text/junit.txt │ │ │ │ │ --rw-r--r-- 0 sbuild (999) sbuild (999) 7594 2026-09-16 03:03:43.000000 jtreg-test-output/hotspot/0/JTreport/text/testng.txt │ │ │ │ │ --rw-r--r-- 0 sbuild (999) sbuild (999) 76794 2026-09-16 03:03:43.000000 jtreg-test-output/hotspot/0/JTreport/text/notRun.txt │ │ │ │ │ --rw-r--r-- 0 sbuild (999) sbuild (999) 161 2026-09-16 03:03:43.000000 jtreg-test-output/hotspot/0/JTreport/text/stats.txt │ │ │ │ │ --rw-r--r-- 0 sbuild (999) sbuild (999) 983 2026-09-16 03:03:43.000000 jtreg-test-output/hotspot/0/JTreport/text/timeStats.txt │ │ │ │ │ --rw-r--r-- 0 sbuild (999) sbuild (999) 21 2026-09-16 03:03:43.000000 jtreg-test-output/hotspot/0/JTreport/text/tc_newfailures.txt │ │ │ │ │ --rw-r--r-- 0 sbuild (999) sbuild (999) 21 2026-09-16 03:03:43.000000 jtreg-test-output/hotspot/0/JTreport/text/tc_fail2notrun.txt │ │ │ │ │ --rw-r--r-- 0 sbuild (999) sbuild (999) 20 2026-09-16 03:03:43.000000 jtreg-test-output/hotspot/0/JTreport/text/tc_fail2error.txt │ │ │ │ │ --rw-r--r-- 0 sbuild (999) sbuild (999) 19 2026-09-16 03:03:43.000000 jtreg-test-output/hotspot/0/JTreport/text/tc_fail2pass.txt │ │ │ │ │ --rw-r--r-- 0 sbuild (999) sbuild (999) 22 2026-09-16 03:03:43.000000 jtreg-test-output/hotspot/0/JTreport/text/tc_fail2missing.txt │ │ │ │ │ --rw-r--r-- 0 sbuild (999) sbuild (999) 19 2026-09-16 03:03:43.000000 jtreg-test-output/hotspot/0/JTreport/text/other_errors.txt │ │ │ │ │ --rw-r--r-- 0 sbuild (999) sbuild (999) 18 2026-09-16 03:03:43.000000 jtreg-test-output/hotspot/0/JTreport/text/newfailures.txt │ │ │ │ │ --rw-r--r-- 0 sbuild (999) sbuild (999) 16 2026-09-16 03:03:43.000000 jtreg-test-output/hotspot/0/JTreport/text/fail2fail.txt │ │ │ │ │ --rw-r--r-- 0 sbuild (999) sbuild (999) 18 2026-09-16 03:03:43.000000 jtreg-test-output/hotspot/0/JTreport/text/fail2notrun.txt │ │ │ │ │ --rw-r--r-- 0 sbuild (999) sbuild (999) 17 2026-09-16 03:03:43.000000 jtreg-test-output/hotspot/0/JTreport/text/faiL2error.txt │ │ │ │ │ --rw-r--r-- 0 sbuild (999) sbuild (999) 16 2026-09-16 03:03:43.000000 jtreg-test-output/hotspot/0/JTreport/text/fail2pass.txt │ │ │ │ │ --rw-r--r-- 0 sbuild (999) sbuild (999) 19 2026-09-16 03:03:43.000000 jtreg-test-output/hotspot/0/JTreport/text/fail2missing.txt │ │ │ │ │ --rw-r--r-- 0 sbuild (999) sbuild (999) 456559 2026-09-16 03:03:43.000000 jtreg-test-output/hotspot/0/JTreport/text/summary.txt │ │ │ │ │ --rw-r--r-- 0 sbuild (999) sbuild (999) 555 2026-09-15 23:26:23.000000 jtreg-test-output/hotspot/0/JTreport/text/cmdArgs.txt │ │ │ │ │ +drwxr-xr-x 0 sbuild (996) sbuild (996) 0 2026-09-17 04:17:22.000000 jtreg-test-output/hotspot/1/JTreport/ │ │ │ │ │ +-rw-r--r-- 0 sbuild (996) sbuild (996) 0 2026-09-17 04:17:22.000000 jtreg-test-output/hotspot/1/JTreport/reportdir.dat │ │ │ │ │ +drwxr-xr-x 0 sbuild (996) sbuild (996) 0 2026-09-17 04:17:22.000000 jtreg-test-output/hotspot/1/JTreport/html/ │ │ │ │ │ +-rw-r--r-- 0 sbuild (996) sbuild (996) 18324 2026-09-17 04:17:22.000000 jtreg-test-output/hotspot/1/JTreport/html/excluded.html │ │ │ │ │ +-rw-r--r-- 0 sbuild (996) sbuild (996) 607484 2026-09-17 04:17:22.000000 jtreg-test-output/hotspot/1/JTreport/html/passed_gr.html │ │ │ │ │ +-rw-r--r-- 0 sbuild (996) sbuild (996) 307 2026-09-17 04:17:22.000000 jtreg-test-output/hotspot/1/JTreport/html/report.css │ │ │ │ │ +-rw-r--r-- 0 sbuild (996) sbuild (996) 761 2026-09-17 04:17:22.000000 jtreg-test-output/hotspot/1/JTreport/html/failed.html │ │ │ │ │ +-rw-r--r-- 0 sbuild (996) sbuild (996) 593196 2026-09-17 04:17:22.000000 jtreg-test-output/hotspot/1/JTreport/html/report.html │ │ │ │ │ +-rw-r--r-- 0 sbuild (996) sbuild (996) 607093 2026-09-17 04:17:22.000000 jtreg-test-output/hotspot/1/JTreport/html/passed.html │ │ │ │ │ +-rw-r--r-- 0 sbuild (996) sbuild (996) 78691 2026-09-17 04:17:22.000000 jtreg-test-output/hotspot/1/JTreport/html/config.html │ │ │ │ │ +-rw-r--r-- 0 sbuild (996) sbuild (996) 956 2026-09-17 04:17:22.000000 jtreg-test-output/hotspot/1/JTreport/html/failed_gr.html │ │ │ │ │ +-rw-r--r-- 0 sbuild (996) sbuild (996) 521 2026-09-17 04:17:22.000000 jtreg-test-output/hotspot/1/JTreport/html/error_gr.html │ │ │ │ │ +-rw-r--r-- 0 sbuild (996) sbuild (996) 4282 2026-09-17 04:17:22.000000 jtreg-test-output/hotspot/1/JTreport/html/env.html │ │ │ │ │ +-rw-r--r-- 0 sbuild (996) sbuild (996) 404059 2026-09-17 04:17:22.000000 jtreg-test-output/hotspot/1/JTreport/html/notRun_gr.html │ │ │ │ │ +-rw-r--r-- 0 sbuild (996) sbuild (996) 593196 2026-09-17 04:17:22.000000 jtreg-test-output/hotspot/1/JTreport/html/index.html │ │ │ │ │ +-rw-r--r-- 0 sbuild (996) sbuild (996) 403786 2026-09-17 04:17:22.000000 jtreg-test-output/hotspot/1/JTreport/html/notRun.html │ │ │ │ │ +-rw-r--r-- 0 sbuild (996) sbuild (996) 473 2026-09-17 04:17:22.000000 jtreg-test-output/hotspot/1/JTreport/html/error.html │ │ │ │ │ +drwxr-xr-x 0 sbuild (996) sbuild (996) 0 2026-09-17 04:17:22.000000 jtreg-test-output/hotspot/1/JTreport/text/ │ │ │ │ │ +-rw-r--r-- 0 sbuild (996) sbuild (996) 17 2026-09-17 04:17:22.000000 jtreg-test-output/hotspot/1/JTreport/text/faiL2error.txt │ │ │ │ │ +-rw-r--r-- 0 sbuild (996) sbuild (996) 21 2026-09-17 04:17:22.000000 jtreg-test-output/hotspot/1/JTreport/text/tc_fail2notrun.txt │ │ │ │ │ +-rw-r--r-- 0 sbuild (996) sbuild (996) 16 2026-09-17 04:17:22.000000 jtreg-test-output/hotspot/1/JTreport/text/fail2pass.txt │ │ │ │ │ +-rw-r--r-- 0 sbuild (996) sbuild (996) 456665 2026-09-17 04:17:22.000000 jtreg-test-output/hotspot/1/JTreport/text/summary.txt │ │ │ │ │ +-rw-r--r-- 0 sbuild (996) sbuild (996) 22 2026-09-17 04:17:22.000000 jtreg-test-output/hotspot/1/JTreport/text/tc_fail2missing.txt │ │ │ │ │ +-rw-r--r-- 0 sbuild (996) sbuild (996) 16 2026-09-17 04:17:22.000000 jtreg-test-output/hotspot/1/JTreport/text/fail2fail.txt │ │ │ │ │ +-rw-r--r-- 0 sbuild (996) sbuild (996) 101 2026-09-17 04:17:22.000000 jtreg-test-output/hotspot/1/JTreport/text/stats.txt │ │ │ │ │ +-rw-r--r-- 0 sbuild (996) sbuild (996) 93 2026-09-17 04:17:22.000000 jtreg-test-output/hotspot/1/JTreport/text/newfailures.txt │ │ │ │ │ +-rw-r--r-- 0 sbuild (996) sbuild (996) 19 2026-09-17 04:17:22.000000 jtreg-test-output/hotspot/1/JTreport/text/tc_fail2pass.txt │ │ │ │ │ +-rw-r--r-- 0 sbuild (996) sbuild (996) 19 2026-09-17 04:17:22.000000 jtreg-test-output/hotspot/1/JTreport/text/fail2missing.txt │ │ │ │ │ +-rw-r--r-- 0 sbuild (996) sbuild (996) 574 2026-09-17 04:17:10.000000 jtreg-test-output/hotspot/1/JTreport/text/cmdArgs.txt │ │ │ │ │ +-rw-r--r-- 0 sbuild (996) sbuild (996) 104 2026-09-17 04:17:22.000000 jtreg-test-output/hotspot/1/JTreport/text/timeStats.txt │ │ │ │ │ +-rw-r--r-- 0 sbuild (996) sbuild (996) 584814 2026-09-17 04:17:22.000000 jtreg-test-output/hotspot/1/JTreport/text/notRun.txt │ │ │ │ │ +-rw-r--r-- 0 sbuild (996) sbuild (996) 19 2026-09-17 04:17:22.000000 jtreg-test-output/hotspot/1/JTreport/text/other_errors.txt │ │ │ │ │ +-rw-r--r-- 0 sbuild (996) sbuild (996) 18 2026-09-17 04:17:22.000000 jtreg-test-output/hotspot/1/JTreport/text/fail2notrun.txt │ │ │ │ │ +-rw-r--r-- 0 sbuild (996) sbuild (996) 21 2026-09-17 04:17:22.000000 jtreg-test-output/hotspot/1/JTreport/text/tc_newfailures.txt │ │ │ │ │ +-rw-r--r-- 0 sbuild (996) sbuild (996) 20 2026-09-17 04:17:22.000000 jtreg-test-output/hotspot/1/JTreport/text/tc_fail2error.txt │ │ │ │ │ +-rw-r--r-- 0 sbuild (996) sbuild (996) 728 2026-09-17 04:17:22.000000 jtreg-test-output/hotspot/1/JTreport/index.html │ │ │ │ │ +drwxr-xr-x 0 sbuild (996) sbuild (996) 0 2026-09-17 04:17:38.000000 jtreg-test-output/hotspot/2/JTreport/ │ │ │ │ │ +-rw-r--r-- 0 sbuild (996) sbuild (996) 0 2026-09-17 04:17:38.000000 jtreg-test-output/hotspot/2/JTreport/reportdir.dat │ │ │ │ │ +drwxr-xr-x 0 sbuild (996) sbuild (996) 0 2026-09-17 04:17:38.000000 jtreg-test-output/hotspot/2/JTreport/html/ │ │ │ │ │ +-rw-r--r-- 0 sbuild (996) sbuild (996) 18324 2026-09-17 04:17:38.000000 jtreg-test-output/hotspot/2/JTreport/html/excluded.html │ │ │ │ │ +-rw-r--r-- 0 sbuild (996) sbuild (996) 607484 2026-09-17 04:17:38.000000 jtreg-test-output/hotspot/2/JTreport/html/passed_gr.html │ │ │ │ │ +-rw-r--r-- 0 sbuild (996) sbuild (996) 307 2026-09-17 04:17:38.000000 jtreg-test-output/hotspot/2/JTreport/html/report.css │ │ │ │ │ +-rw-r--r-- 0 sbuild (996) sbuild (996) 761 2026-09-17 04:17:38.000000 jtreg-test-output/hotspot/2/JTreport/html/failed.html │ │ │ │ │ +-rw-r--r-- 0 sbuild (996) sbuild (996) 593196 2026-09-17 04:17:38.000000 jtreg-test-output/hotspot/2/JTreport/html/report.html │ │ │ │ │ +-rw-r--r-- 0 sbuild (996) sbuild (996) 607093 2026-09-17 04:17:38.000000 jtreg-test-output/hotspot/2/JTreport/html/passed.html │ │ │ │ │ +-rw-r--r-- 0 sbuild (996) sbuild (996) 78691 2026-09-17 04:17:38.000000 jtreg-test-output/hotspot/2/JTreport/html/config.html │ │ │ │ │ +-rw-r--r-- 0 sbuild (996) sbuild (996) 956 2026-09-17 04:17:38.000000 jtreg-test-output/hotspot/2/JTreport/html/failed_gr.html │ │ │ │ │ +-rw-r--r-- 0 sbuild (996) sbuild (996) 521 2026-09-17 04:17:38.000000 jtreg-test-output/hotspot/2/JTreport/html/error_gr.html │ │ │ │ │ +-rw-r--r-- 0 sbuild (996) sbuild (996) 4282 2026-09-17 04:17:38.000000 jtreg-test-output/hotspot/2/JTreport/html/env.html │ │ │ │ │ +-rw-r--r-- 0 sbuild (996) sbuild (996) 404059 2026-09-17 04:17:38.000000 jtreg-test-output/hotspot/2/JTreport/html/notRun_gr.html │ │ │ │ │ +-rw-r--r-- 0 sbuild (996) sbuild (996) 593196 2026-09-17 04:17:38.000000 jtreg-test-output/hotspot/2/JTreport/html/index.html │ │ │ │ │ +-rw-r--r-- 0 sbuild (996) sbuild (996) 403786 2026-09-17 04:17:38.000000 jtreg-test-output/hotspot/2/JTreport/html/notRun.html │ │ │ │ │ +-rw-r--r-- 0 sbuild (996) sbuild (996) 473 2026-09-17 04:17:38.000000 jtreg-test-output/hotspot/2/JTreport/html/error.html │ │ │ │ │ +drwxr-xr-x 0 sbuild (996) sbuild (996) 0 2026-09-17 04:17:38.000000 jtreg-test-output/hotspot/2/JTreport/text/ │ │ │ │ │ +-rw-r--r-- 0 sbuild (996) sbuild (996) 17 2026-09-17 04:17:38.000000 jtreg-test-output/hotspot/2/JTreport/text/faiL2error.txt │ │ │ │ │ +-rw-r--r-- 0 sbuild (996) sbuild (996) 21 2026-09-17 04:17:38.000000 jtreg-test-output/hotspot/2/JTreport/text/tc_fail2notrun.txt │ │ │ │ │ +-rw-r--r-- 0 sbuild (996) sbuild (996) 16 2026-09-17 04:17:38.000000 jtreg-test-output/hotspot/2/JTreport/text/fail2pass.txt │ │ │ │ │ +-rw-r--r-- 0 sbuild (996) sbuild (996) 456665 2026-09-17 04:17:38.000000 jtreg-test-output/hotspot/2/JTreport/text/summary.txt │ │ │ │ │ +-rw-r--r-- 0 sbuild (996) sbuild (996) 22 2026-09-17 04:17:38.000000 jtreg-test-output/hotspot/2/JTreport/text/tc_fail2missing.txt │ │ │ │ │ +-rw-r--r-- 0 sbuild (996) sbuild (996) 16 2026-09-17 04:17:38.000000 jtreg-test-output/hotspot/2/JTreport/text/fail2fail.txt │ │ │ │ │ +-rw-r--r-- 0 sbuild (996) sbuild (996) 101 2026-09-17 04:17:38.000000 jtreg-test-output/hotspot/2/JTreport/text/stats.txt │ │ │ │ │ +-rw-r--r-- 0 sbuild (996) sbuild (996) 93 2026-09-17 04:17:38.000000 jtreg-test-output/hotspot/2/JTreport/text/newfailures.txt │ │ │ │ │ +-rw-r--r-- 0 sbuild (996) sbuild (996) 19 2026-09-17 04:17:38.000000 jtreg-test-output/hotspot/2/JTreport/text/tc_fail2pass.txt │ │ │ │ │ +-rw-r--r-- 0 sbuild (996) sbuild (996) 19 2026-09-17 04:17:38.000000 jtreg-test-output/hotspot/2/JTreport/text/fail2missing.txt │ │ │ │ │ +-rw-r--r-- 0 sbuild (996) sbuild (996) 574 2026-09-17 04:17:27.000000 jtreg-test-output/hotspot/2/JTreport/text/cmdArgs.txt │ │ │ │ │ +-rw-r--r-- 0 sbuild (996) sbuild (996) 104 2026-09-17 04:17:38.000000 jtreg-test-output/hotspot/2/JTreport/text/timeStats.txt │ │ │ │ │ +-rw-r--r-- 0 sbuild (996) sbuild (996) 584814 2026-09-17 04:17:38.000000 jtreg-test-output/hotspot/2/JTreport/text/notRun.txt │ │ │ │ │ +-rw-r--r-- 0 sbuild (996) sbuild (996) 19 2026-09-17 04:17:38.000000 jtreg-test-output/hotspot/2/JTreport/text/other_errors.txt │ │ │ │ │ +-rw-r--r-- 0 sbuild (996) sbuild (996) 18 2026-09-17 04:17:38.000000 jtreg-test-output/hotspot/2/JTreport/text/fail2notrun.txt │ │ │ │ │ +-rw-r--r-- 0 sbuild (996) sbuild (996) 21 2026-09-17 04:17:38.000000 jtreg-test-output/hotspot/2/JTreport/text/tc_newfailures.txt │ │ │ │ │ +-rw-r--r-- 0 sbuild (996) sbuild (996) 20 2026-09-17 04:17:38.000000 jtreg-test-output/hotspot/2/JTreport/text/tc_fail2error.txt │ │ │ │ │ +-rw-r--r-- 0 sbuild (996) sbuild (996) 728 2026-09-17 04:17:38.000000 jtreg-test-output/hotspot/2/JTreport/index.html │ │ │ │ │ +drwxr-xr-x 0 sbuild (996) sbuild (996) 0 2026-09-17 04:17:04.000000 jtreg-test-output/hotspot/0/JTreport/ │ │ │ │ │ +-rw-r--r-- 0 sbuild (996) sbuild (996) 0 2026-09-17 04:17:04.000000 jtreg-test-output/hotspot/0/JTreport/reportdir.dat │ │ │ │ │ +drwxr-xr-x 0 sbuild (996) sbuild (996) 0 2026-09-17 04:17:04.000000 jtreg-test-output/hotspot/0/JTreport/html/ │ │ │ │ │ +-rw-r--r-- 0 sbuild (996) sbuild (996) 18324 2026-09-17 04:17:04.000000 jtreg-test-output/hotspot/0/JTreport/html/excluded.html │ │ │ │ │ +-rw-r--r-- 0 sbuild (996) sbuild (996) 607484 2026-09-17 04:17:04.000000 jtreg-test-output/hotspot/0/JTreport/html/passed_gr.html │ │ │ │ │ +-rw-r--r-- 0 sbuild (996) sbuild (996) 307 2026-09-17 04:17:04.000000 jtreg-test-output/hotspot/0/JTreport/html/report.css │ │ │ │ │ +-rw-r--r-- 0 sbuild (996) sbuild (996) 761 2026-09-17 04:17:04.000000 jtreg-test-output/hotspot/0/JTreport/html/failed.html │ │ │ │ │ +-rw-r--r-- 0 sbuild (996) sbuild (996) 600682 2026-09-17 04:17:04.000000 jtreg-test-output/hotspot/0/JTreport/html/report.html │ │ │ │ │ +-rw-r--r-- 0 sbuild (996) sbuild (996) 607093 2026-09-17 04:17:04.000000 jtreg-test-output/hotspot/0/JTreport/html/passed.html │ │ │ │ │ +-rw-r--r-- 0 sbuild (996) sbuild (996) 78259 2026-09-17 04:17:04.000000 jtreg-test-output/hotspot/0/JTreport/html/config.html │ │ │ │ │ +-rw-r--r-- 0 sbuild (996) sbuild (996) 956 2026-09-17 04:17:04.000000 jtreg-test-output/hotspot/0/JTreport/html/failed_gr.html │ │ │ │ │ +-rw-r--r-- 0 sbuild (996) sbuild (996) 521 2026-09-17 04:17:04.000000 jtreg-test-output/hotspot/0/JTreport/html/error_gr.html │ │ │ │ │ +-rw-r--r-- 0 sbuild (996) sbuild (996) 4263 2026-09-17 04:17:04.000000 jtreg-test-output/hotspot/0/JTreport/html/env.html │ │ │ │ │ +-rw-r--r-- 0 sbuild (996) sbuild (996) 49644 2026-09-17 04:17:04.000000 jtreg-test-output/hotspot/0/JTreport/html/notRun_gr.html │ │ │ │ │ +-rw-r--r-- 0 sbuild (996) sbuild (996) 600682 2026-09-17 04:17:04.000000 jtreg-test-output/hotspot/0/JTreport/html/index.html │ │ │ │ │ +-rw-r--r-- 0 sbuild (996) sbuild (996) 49299 2026-09-17 04:17:04.000000 jtreg-test-output/hotspot/0/JTreport/html/notRun.html │ │ │ │ │ +-rw-r--r-- 0 sbuild (996) sbuild (996) 473 2026-09-17 04:17:04.000000 jtreg-test-output/hotspot/0/JTreport/html/error.html │ │ │ │ │ +drwxr-xr-x 0 sbuild (996) sbuild (996) 0 2026-09-17 04:17:04.000000 jtreg-test-output/hotspot/0/JTreport/text/ │ │ │ │ │ +-rw-r--r-- 0 sbuild (996) sbuild (996) 17 2026-09-17 04:17:04.000000 jtreg-test-output/hotspot/0/JTreport/text/faiL2error.txt │ │ │ │ │ +-rw-r--r-- 0 sbuild (996) sbuild (996) 21 2026-09-17 04:17:04.000000 jtreg-test-output/hotspot/0/JTreport/text/tc_fail2notrun.txt │ │ │ │ │ +-rw-r--r-- 0 sbuild (996) sbuild (996) 16 2026-09-17 04:17:04.000000 jtreg-test-output/hotspot/0/JTreport/text/fail2pass.txt │ │ │ │ │ +-rw-r--r-- 0 sbuild (996) sbuild (996) 456665 2026-09-17 04:17:04.000000 jtreg-test-output/hotspot/0/JTreport/text/summary.txt │ │ │ │ │ +-rw-r--r-- 0 sbuild (996) sbuild (996) 22 2026-09-17 04:17:04.000000 jtreg-test-output/hotspot/0/JTreport/text/tc_fail2missing.txt │ │ │ │ │ +-rw-r--r-- 0 sbuild (996) sbuild (996) 3273 2026-09-17 04:17:04.000000 jtreg-test-output/hotspot/0/JTreport/text/junit.txt │ │ │ │ │ +-rw-r--r-- 0 sbuild (996) sbuild (996) 16 2026-09-17 04:17:04.000000 jtreg-test-output/hotspot/0/JTreport/text/fail2fail.txt │ │ │ │ │ +-rw-r--r-- 0 sbuild (996) sbuild (996) 172 2026-09-17 04:17:04.000000 jtreg-test-output/hotspot/0/JTreport/text/stats.txt │ │ │ │ │ +-rw-r--r-- 0 sbuild (996) sbuild (996) 93 2026-09-17 04:17:04.000000 jtreg-test-output/hotspot/0/JTreport/text/newfailures.txt │ │ │ │ │ +-rw-r--r-- 0 sbuild (996) sbuild (996) 19 2026-09-17 04:17:04.000000 jtreg-test-output/hotspot/0/JTreport/text/tc_fail2pass.txt │ │ │ │ │ +-rw-r--r-- 0 sbuild (996) sbuild (996) 19 2026-09-17 04:17:04.000000 jtreg-test-output/hotspot/0/JTreport/text/fail2missing.txt │ │ │ │ │ +-rw-r--r-- 0 sbuild (996) sbuild (996) 555 2026-09-17 01:13:07.000000 jtreg-test-output/hotspot/0/JTreport/text/cmdArgs.txt │ │ │ │ │ +-rw-r--r-- 0 sbuild (996) sbuild (996) 863 2026-09-17 04:17:04.000000 jtreg-test-output/hotspot/0/JTreport/text/timeStats.txt │ │ │ │ │ +-rw-r--r-- 0 sbuild (996) sbuild (996) 7594 2026-09-17 04:17:04.000000 jtreg-test-output/hotspot/0/JTreport/text/testng.txt │ │ │ │ │ +-rw-r--r-- 0 sbuild (996) sbuild (996) 76794 2026-09-17 04:17:04.000000 jtreg-test-output/hotspot/0/JTreport/text/notRun.txt │ │ │ │ │ +-rw-r--r-- 0 sbuild (996) sbuild (996) 19 2026-09-17 04:17:04.000000 jtreg-test-output/hotspot/0/JTreport/text/other_errors.txt │ │ │ │ │ +-rw-r--r-- 0 sbuild (996) sbuild (996) 18 2026-09-17 04:17:04.000000 jtreg-test-output/hotspot/0/JTreport/text/fail2notrun.txt │ │ │ │ │ +-rw-r--r-- 0 sbuild (996) sbuild (996) 21 2026-09-17 04:17:04.000000 jtreg-test-output/hotspot/0/JTreport/text/tc_newfailures.txt │ │ │ │ │ +-rw-r--r-- 0 sbuild (996) sbuild (996) 20 2026-09-17 04:17:04.000000 jtreg-test-output/hotspot/0/JTreport/text/tc_fail2error.txt │ │ │ │ │ +-rw-r--r-- 0 sbuild (996) sbuild (996) 728 2026-09-17 04:17:04.000000 jtreg-test-output/hotspot/0/JTreport/index.html │ │ │ │ │ +lrwxrwxrwx 0 sbuild (996) sbuild (996) 0 2026-09-17 04:17:42.000000 jtreg-test-output/hotspot/JTreport -> 2/JTreport │ │ │ │ │ +drwxr-xr-x 0 sbuild (996) sbuild (996) 0 2026-09-17 05:12:14.000000 jtreg-test-output/jaxp/0/JTreport/ │ │ │ │ │ +-rw-r--r-- 0 sbuild (996) sbuild (996) 0 2026-09-17 05:12:14.000000 jtreg-test-output/jaxp/0/JTreport/reportdir.dat │ │ │ │ │ +drwxr-xr-x 0 sbuild (996) sbuild (996) 0 2026-09-17 05:12:14.000000 jtreg-test-output/jaxp/0/JTreport/html/ │ │ │ │ │ +-rw-r--r-- 0 sbuild (996) sbuild (996) 3642 2026-09-17 05:12:14.000000 jtreg-test-output/jaxp/0/JTreport/html/excluded.html │ │ │ │ │ +-rw-r--r-- 0 sbuild (996) sbuild (996) 110062 2026-09-17 05:12:14.000000 jtreg-test-output/jaxp/0/JTreport/html/passed_gr.html │ │ │ │ │ +-rw-r--r-- 0 sbuild (996) sbuild (996) 307 2026-09-17 05:12:14.000000 jtreg-test-output/jaxp/0/JTreport/html/report.css │ │ │ │ │ +-rw-r--r-- 0 sbuild (996) sbuild (996) 465 2026-09-17 05:12:14.000000 jtreg-test-output/jaxp/0/JTreport/html/failed.html │ │ │ │ │ +-rw-r--r-- 0 sbuild (996) sbuild (996) 58502 2026-09-17 05:12:14.000000 jtreg-test-output/jaxp/0/JTreport/html/report.html │ │ │ │ │ +-rw-r--r-- 0 sbuild (996) sbuild (996) 109973 2026-09-17 05:12:14.000000 jtreg-test-output/jaxp/0/JTreport/html/passed.html │ │ │ │ │ +-rw-r--r-- 0 sbuild (996) sbuild (996) 4425 2026-09-17 05:12:14.000000 jtreg-test-output/jaxp/0/JTreport/html/config.html │ │ │ │ │ +-rw-r--r-- 0 sbuild (996) sbuild (996) 513 2026-09-17 05:12:14.000000 jtreg-test-output/jaxp/0/JTreport/html/failed_gr.html │ │ │ │ │ +-rw-r--r-- 0 sbuild (996) sbuild (996) 521 2026-09-17 05:12:14.000000 jtreg-test-output/jaxp/0/JTreport/html/error_gr.html │ │ │ │ │ +-rw-r--r-- 0 sbuild (996) sbuild (996) 4149 2026-09-17 05:12:14.000000 jtreg-test-output/jaxp/0/JTreport/html/env.html │ │ │ │ │ +-rw-r--r-- 0 sbuild (996) sbuild (996) 695 2026-09-17 05:12:14.000000 jtreg-test-output/jaxp/0/JTreport/html/notRun_gr.html │ │ │ │ │ +-rw-r--r-- 0 sbuild (996) sbuild (996) 58502 2026-09-17 05:12:14.000000 jtreg-test-output/jaxp/0/JTreport/html/index.html │ │ │ │ │ +-rw-r--r-- 0 sbuild (996) sbuild (996) 573 2026-09-17 05:12:14.000000 jtreg-test-output/jaxp/0/JTreport/html/notRun.html │ │ │ │ │ +-rw-r--r-- 0 sbuild (996) sbuild (996) 473 2026-09-17 05:12:14.000000 jtreg-test-output/jaxp/0/JTreport/html/error.html │ │ │ │ │ +drwxr-xr-x 0 sbuild (996) sbuild (996) 0 2026-09-17 05:12:14.000000 jtreg-test-output/jaxp/0/JTreport/text/ │ │ │ │ │ +-rw-r--r-- 0 sbuild (996) sbuild (996) 17 2026-09-17 05:12:14.000000 jtreg-test-output/jaxp/0/JTreport/text/faiL2error.txt │ │ │ │ │ +-rw-r--r-- 0 sbuild (996) sbuild (996) 21 2026-09-17 05:12:14.000000 jtreg-test-output/jaxp/0/JTreport/text/tc_fail2notrun.txt │ │ │ │ │ +-rw-r--r-- 0 sbuild (996) sbuild (996) 16 2026-09-17 05:12:14.000000 jtreg-test-output/jaxp/0/JTreport/text/fail2pass.txt │ │ │ │ │ +-rw-r--r-- 0 sbuild (996) sbuild (996) 59118 2026-09-17 05:12:14.000000 jtreg-test-output/jaxp/0/JTreport/text/summary.txt │ │ │ │ │ +-rw-r--r-- 0 sbuild (996) sbuild (996) 22 2026-09-17 05:12:14.000000 jtreg-test-output/jaxp/0/JTreport/text/tc_fail2missing.txt │ │ │ │ │ +-rw-r--r-- 0 sbuild (996) sbuild (996) 200 2026-09-17 05:12:14.000000 jtreg-test-output/jaxp/0/JTreport/text/junit.txt │ │ │ │ │ +-rw-r--r-- 0 sbuild (996) sbuild (996) 16 2026-09-17 05:12:14.000000 jtreg-test-output/jaxp/0/JTreport/text/fail2fail.txt │ │ │ │ │ +-rw-r--r-- 0 sbuild (996) sbuild (996) 65 2026-09-17 05:12:14.000000 jtreg-test-output/jaxp/0/JTreport/text/stats.txt │ │ │ │ │ +-rw-r--r-- 0 sbuild (996) sbuild (996) 18 2026-09-17 05:12:14.000000 jtreg-test-output/jaxp/0/JTreport/text/newfailures.txt │ │ │ │ │ +-rw-r--r-- 0 sbuild (996) sbuild (996) 19 2026-09-17 05:12:14.000000 jtreg-test-output/jaxp/0/JTreport/text/tc_fail2pass.txt │ │ │ │ │ +-rw-r--r-- 0 sbuild (996) sbuild (996) 19 2026-09-17 05:12:14.000000 jtreg-test-output/jaxp/0/JTreport/text/fail2missing.txt │ │ │ │ │ +-rw-r--r-- 0 sbuild (996) sbuild (996) 441 2026-09-17 04:57:07.000000 jtreg-test-output/jaxp/0/JTreport/text/cmdArgs.txt │ │ │ │ │ +-rw-r--r-- 0 sbuild (996) sbuild (996) 165 2026-09-17 05:12:14.000000 jtreg-test-output/jaxp/0/JTreport/text/timeStats.txt │ │ │ │ │ +-rw-r--r-- 0 sbuild (996) sbuild (996) 69461 2026-09-17 05:12:14.000000 jtreg-test-output/jaxp/0/JTreport/text/testng.txt │ │ │ │ │ +-rw-r--r-- 0 sbuild (996) sbuild (996) 116 2026-09-17 05:12:14.000000 jtreg-test-output/jaxp/0/JTreport/text/notRun.txt │ │ │ │ │ +-rw-r--r-- 0 sbuild (996) sbuild (996) 19 2026-09-17 05:12:14.000000 jtreg-test-output/jaxp/0/JTreport/text/other_errors.txt │ │ │ │ │ +-rw-r--r-- 0 sbuild (996) sbuild (996) 18 2026-09-17 05:12:14.000000 jtreg-test-output/jaxp/0/JTreport/text/fail2notrun.txt │ │ │ │ │ +-rw-r--r-- 0 sbuild (996) sbuild (996) 21 2026-09-17 05:12:14.000000 jtreg-test-output/jaxp/0/JTreport/text/tc_newfailures.txt │ │ │ │ │ +-rw-r--r-- 0 sbuild (996) sbuild (996) 20 2026-09-17 05:12:14.000000 jtreg-test-output/jaxp/0/JTreport/text/tc_fail2error.txt │ │ │ │ │ +-rw-r--r-- 0 sbuild (996) sbuild (996) 716 2026-09-17 05:12:14.000000 jtreg-test-output/jaxp/0/JTreport/index.html │ │ │ │ │ +lrwxrwxrwx 0 sbuild (996) sbuild (996) 0 2026-09-17 05:12:14.000000 jtreg-test-output/jaxp/JTreport -> 0/JTreport │ │ │ │ │ +drwxr-xr-x 0 sbuild (996) sbuild (996) 0 2026-09-17 09:00:08.000000 jtreg-test-output/jdk/1/JTreport/ │ │ │ │ │ +-rw-r--r-- 0 sbuild (996) sbuild (996) 0 2026-09-17 09:00:08.000000 jtreg-test-output/jdk/1/JTreport/reportdir.dat │ │ │ │ │ +drwxr-xr-x 0 sbuild (996) sbuild (996) 0 2026-09-17 09:00:08.000000 jtreg-test-output/jdk/1/JTreport/html/ │ │ │ │ │ +-rw-r--r-- 0 sbuild (996) sbuild (996) 83174 2026-09-17 09:00:08.000000 jtreg-test-output/jdk/1/JTreport/html/excluded.html │ │ │ │ │ +-rw-r--r-- 0 sbuild (996) sbuild (996) 1250401 2026-09-17 09:00:08.000000 jtreg-test-output/jdk/1/JTreport/html/passed_gr.html │ │ │ │ │ +-rw-r--r-- 0 sbuild (996) sbuild (996) 307 2026-09-17 09:00:07.000000 jtreg-test-output/jdk/1/JTreport/html/report.css │ │ │ │ │ +-rw-r--r-- 0 sbuild (996) sbuild (996) 2020 2026-09-17 09:00:08.000000 jtreg-test-output/jdk/1/JTreport/html/failed.html │ │ │ │ │ +-rw-r--r-- 0 sbuild (996) sbuild (996) 1101695 2026-09-17 09:00:08.000000 jtreg-test-output/jdk/1/JTreport/html/report.html │ │ │ │ │ +-rw-r--r-- 0 sbuild (996) sbuild (996) 1249326 2026-09-17 09:00:08.000000 jtreg-test-output/jdk/1/JTreport/html/passed.html │ │ │ │ │ +-rw-r--r-- 0 sbuild (996) sbuild (996) 24358 2026-09-17 09:00:08.000000 jtreg-test-output/jdk/1/JTreport/html/config.html │ │ │ │ │ +-rw-r--r-- 0 sbuild (996) sbuild (996) 2750 2026-09-17 09:00:08.000000 jtreg-test-output/jdk/1/JTreport/html/failed_gr.html │ │ │ │ │ +-rw-r--r-- 0 sbuild (996) sbuild (996) 521 2026-09-17 09:00:08.000000 jtreg-test-output/jdk/1/JTreport/html/error_gr.html │ │ │ │ │ +-rw-r--r-- 0 sbuild (996) sbuild (996) 4260 2026-09-17 09:00:08.000000 jtreg-test-output/jdk/1/JTreport/html/env.html │ │ │ │ │ +-rw-r--r-- 0 sbuild (996) sbuild (996) 762505 2026-09-17 09:00:08.000000 jtreg-test-output/jdk/1/JTreport/html/notRun_gr.html │ │ │ │ │ +-rw-r--r-- 0 sbuild (996) sbuild (996) 1101695 2026-09-17 09:00:08.000000 jtreg-test-output/jdk/1/JTreport/html/index.html │ │ │ │ │ +-rw-r--r-- 0 sbuild (996) sbuild (996) 762232 2026-09-17 09:00:08.000000 jtreg-test-output/jdk/1/JTreport/html/notRun.html │ │ │ │ │ +-rw-r--r-- 0 sbuild (996) sbuild (996) 473 2026-09-17 09:00:08.000000 jtreg-test-output/jdk/1/JTreport/html/error.html │ │ │ │ │ +drwxr-xr-x 0 sbuild (996) sbuild (996) 0 2026-09-17 09:00:08.000000 jtreg-test-output/jdk/1/JTreport/text/ │ │ │ │ │ +-rw-r--r-- 0 sbuild (996) sbuild (996) 17 2026-09-17 09:00:08.000000 jtreg-test-output/jdk/1/JTreport/text/faiL2error.txt │ │ │ │ │ +-rw-r--r-- 0 sbuild (996) sbuild (996) 21 2026-09-17 09:00:08.000000 jtreg-test-output/jdk/1/JTreport/text/tc_fail2notrun.txt │ │ │ │ │ +-rw-r--r-- 0 sbuild (996) sbuild (996) 16 2026-09-17 09:00:08.000000 jtreg-test-output/jdk/1/JTreport/text/fail2pass.txt │ │ │ │ │ +-rw-r--r-- 0 sbuild (996) sbuild (996) 890745 2026-09-17 09:00:08.000000 jtreg-test-output/jdk/1/JTreport/text/summary.txt │ │ │ │ │ +-rw-r--r-- 0 sbuild (996) sbuild (996) 22 2026-09-17 09:00:08.000000 jtreg-test-output/jdk/1/JTreport/text/tc_fail2missing.txt │ │ │ │ │ +-rw-r--r-- 0 sbuild (996) sbuild (996) 16 2026-09-17 09:00:08.000000 jtreg-test-output/jdk/1/JTreport/text/fail2fail.txt │ │ │ │ │ +-rw-r--r-- 0 sbuild (996) sbuild (996) 101 2026-09-17 09:00:08.000000 jtreg-test-output/jdk/1/JTreport/text/stats.txt │ │ │ │ │ +-rw-r--r-- 0 sbuild (996) sbuild (996) 416 2026-09-17 09:00:08.000000 jtreg-test-output/jdk/1/JTreport/text/newfailures.txt │ │ │ │ │ +-rw-r--r-- 0 sbuild (996) sbuild (996) 19 2026-09-17 09:00:08.000000 jtreg-test-output/jdk/1/JTreport/text/tc_fail2pass.txt │ │ │ │ │ +-rw-r--r-- 0 sbuild (996) sbuild (996) 19 2026-09-17 09:00:08.000000 jtreg-test-output/jdk/1/JTreport/text/fail2missing.txt │ │ │ │ │ +-rw-r--r-- 0 sbuild (996) sbuild (996) 552 2026-09-17 08:59:52.000000 jtreg-test-output/jdk/1/JTreport/text/cmdArgs.txt │ │ │ │ │ +-rw-r--r-- 0 sbuild (996) sbuild (996) 116 2026-09-17 09:00:08.000000 jtreg-test-output/jdk/1/JTreport/text/timeStats.txt │ │ │ │ │ +-rw-r--r-- 0 sbuild (996) sbuild (996) 132 2026-09-17 09:00:08.000000 jtreg-test-output/jdk/1/JTreport/text/testng.txt │ │ │ │ │ +-rw-r--r-- 0 sbuild (996) sbuild (996) 1023259 2026-09-17 09:00:08.000000 jtreg-test-output/jdk/1/JTreport/text/notRun.txt │ │ │ │ │ +-rw-r--r-- 0 sbuild (996) sbuild (996) 19 2026-09-17 09:00:08.000000 jtreg-test-output/jdk/1/JTreport/text/other_errors.txt │ │ │ │ │ +-rw-r--r-- 0 sbuild (996) sbuild (996) 18 2026-09-17 09:00:08.000000 jtreg-test-output/jdk/1/JTreport/text/fail2notrun.txt │ │ │ │ │ +-rw-r--r-- 0 sbuild (996) sbuild (996) 21 2026-09-17 09:00:08.000000 jtreg-test-output/jdk/1/JTreport/text/tc_newfailures.txt │ │ │ │ │ +-rw-r--r-- 0 sbuild (996) sbuild (996) 20 2026-09-17 09:00:08.000000 jtreg-test-output/jdk/1/JTreport/text/tc_fail2error.txt │ │ │ │ │ +-rw-r--r-- 0 sbuild (996) sbuild (996) 714 2026-09-17 09:00:08.000000 jtreg-test-output/jdk/1/JTreport/index.html │ │ │ │ │ +drwxr-xr-x 0 sbuild (996) sbuild (996) 0 2026-09-17 09:00:31.000000 jtreg-test-output/jdk/2/JTreport/ │ │ │ │ │ +-rw-r--r-- 0 sbuild (996) sbuild (996) 0 2026-09-17 09:00:31.000000 jtreg-test-output/jdk/2/JTreport/reportdir.dat │ │ │ │ │ +drwxr-xr-x 0 sbuild (996) sbuild (996) 0 2026-09-17 09:00:31.000000 jtreg-test-output/jdk/2/JTreport/html/ │ │ │ │ │ +-rw-r--r-- 0 sbuild (996) sbuild (996) 83174 2026-09-17 09:00:31.000000 jtreg-test-output/jdk/2/JTreport/html/excluded.html │ │ │ │ │ +-rw-r--r-- 0 sbuild (996) sbuild (996) 1250401 2026-09-17 09:00:31.000000 jtreg-test-output/jdk/2/JTreport/html/passed_gr.html │ │ │ │ │ +-rw-r--r-- 0 sbuild (996) sbuild (996) 307 2026-09-17 09:00:31.000000 jtreg-test-output/jdk/2/JTreport/html/report.css │ │ │ │ │ +-rw-r--r-- 0 sbuild (996) sbuild (996) 2020 2026-09-17 09:00:31.000000 jtreg-test-output/jdk/2/JTreport/html/failed.html │ │ │ │ │ +-rw-r--r-- 0 sbuild (996) sbuild (996) 1101695 2026-09-17 09:00:31.000000 jtreg-test-output/jdk/2/JTreport/html/report.html │ │ │ │ │ +-rw-r--r-- 0 sbuild (996) sbuild (996) 1249326 2026-09-17 09:00:31.000000 jtreg-test-output/jdk/2/JTreport/html/passed.html │ │ │ │ │ +-rw-r--r-- 0 sbuild (996) sbuild (996) 24358 2026-09-17 09:00:31.000000 jtreg-test-output/jdk/2/JTreport/html/config.html │ │ │ │ │ +-rw-r--r-- 0 sbuild (996) sbuild (996) 2750 2026-09-17 09:00:31.000000 jtreg-test-output/jdk/2/JTreport/html/failed_gr.html │ │ │ │ │ +-rw-r--r-- 0 sbuild (996) sbuild (996) 521 2026-09-17 09:00:31.000000 jtreg-test-output/jdk/2/JTreport/html/error_gr.html │ │ │ │ │ +-rw-r--r-- 0 sbuild (996) sbuild (996) 4260 2026-09-17 09:00:31.000000 jtreg-test-output/jdk/2/JTreport/html/env.html │ │ │ │ │ +-rw-r--r-- 0 sbuild (996) sbuild (996) 762505 2026-09-17 09:00:31.000000 jtreg-test-output/jdk/2/JTreport/html/notRun_gr.html │ │ │ │ │ +-rw-r--r-- 0 sbuild (996) sbuild (996) 1101695 2026-09-17 09:00:31.000000 jtreg-test-output/jdk/2/JTreport/html/index.html │ │ │ │ │ +-rw-r--r-- 0 sbuild (996) sbuild (996) 762232 2026-09-17 09:00:31.000000 jtreg-test-output/jdk/2/JTreport/html/notRun.html │ │ │ │ │ +-rw-r--r-- 0 sbuild (996) sbuild (996) 473 2026-09-17 09:00:31.000000 jtreg-test-output/jdk/2/JTreport/html/error.html │ │ │ │ │ +drwxr-xr-x 0 sbuild (996) sbuild (996) 0 2026-09-17 09:00:31.000000 jtreg-test-output/jdk/2/JTreport/text/ │ │ │ │ │ +-rw-r--r-- 0 sbuild (996) sbuild (996) 17 2026-09-17 09:00:31.000000 jtreg-test-output/jdk/2/JTreport/text/faiL2error.txt │ │ │ │ │ +-rw-r--r-- 0 sbuild (996) sbuild (996) 21 2026-09-17 09:00:31.000000 jtreg-test-output/jdk/2/JTreport/text/tc_fail2notrun.txt │ │ │ │ │ +-rw-r--r-- 0 sbuild (996) sbuild (996) 16 2026-09-17 09:00:31.000000 jtreg-test-output/jdk/2/JTreport/text/fail2pass.txt │ │ │ │ │ +-rw-r--r-- 0 sbuild (996) sbuild (996) 890745 2026-09-17 09:00:31.000000 jtreg-test-output/jdk/2/JTreport/text/summary.txt │ │ │ │ │ +-rw-r--r-- 0 sbuild (996) sbuild (996) 22 2026-09-17 09:00:31.000000 jtreg-test-output/jdk/2/JTreport/text/tc_fail2missing.txt │ │ │ │ │ +-rw-r--r-- 0 sbuild (996) sbuild (996) 16 2026-09-17 09:00:31.000000 jtreg-test-output/jdk/2/JTreport/text/fail2fail.txt │ │ │ │ │ +-rw-r--r-- 0 sbuild (996) sbuild (996) 101 2026-09-17 09:00:31.000000 jtreg-test-output/jdk/2/JTreport/text/stats.txt │ │ │ │ │ +-rw-r--r-- 0 sbuild (996) sbuild (996) 416 2026-09-17 09:00:31.000000 jtreg-test-output/jdk/2/JTreport/text/newfailures.txt │ │ │ │ │ +-rw-r--r-- 0 sbuild (996) sbuild (996) 19 2026-09-17 09:00:31.000000 jtreg-test-output/jdk/2/JTreport/text/tc_fail2pass.txt │ │ │ │ │ +-rw-r--r-- 0 sbuild (996) sbuild (996) 19 2026-09-17 09:00:31.000000 jtreg-test-output/jdk/2/JTreport/text/fail2missing.txt │ │ │ │ │ +-rw-r--r-- 0 sbuild (996) sbuild (996) 552 2026-09-17 09:00:16.000000 jtreg-test-output/jdk/2/JTreport/text/cmdArgs.txt │ │ │ │ │ +-rw-r--r-- 0 sbuild (996) sbuild (996) 116 2026-09-17 09:00:31.000000 jtreg-test-output/jdk/2/JTreport/text/timeStats.txt │ │ │ │ │ +-rw-r--r-- 0 sbuild (996) sbuild (996) 132 2026-09-17 09:00:31.000000 jtreg-test-output/jdk/2/JTreport/text/testng.txt │ │ │ │ │ +-rw-r--r-- 0 sbuild (996) sbuild (996) 1023259 2026-09-17 09:00:31.000000 jtreg-test-output/jdk/2/JTreport/text/notRun.txt │ │ │ │ │ +-rw-r--r-- 0 sbuild (996) sbuild (996) 19 2026-09-17 09:00:31.000000 jtreg-test-output/jdk/2/JTreport/text/other_errors.txt │ │ │ │ │ +-rw-r--r-- 0 sbuild (996) sbuild (996) 18 2026-09-17 09:00:31.000000 jtreg-test-output/jdk/2/JTreport/text/fail2notrun.txt │ │ │ │ │ +-rw-r--r-- 0 sbuild (996) sbuild (996) 21 2026-09-17 09:00:31.000000 jtreg-test-output/jdk/2/JTreport/text/tc_newfailures.txt │ │ │ │ │ +-rw-r--r-- 0 sbuild (996) sbuild (996) 20 2026-09-17 09:00:31.000000 jtreg-test-output/jdk/2/JTreport/text/tc_fail2error.txt │ │ │ │ │ +-rw-r--r-- 0 sbuild (996) sbuild (996) 714 2026-09-17 09:00:31.000000 jtreg-test-output/jdk/2/JTreport/index.html │ │ │ │ │ +drwxr-xr-x 0 sbuild (996) sbuild (996) 0 2026-09-17 08:59:42.000000 jtreg-test-output/jdk/0/JTreport/ │ │ │ │ │ +-rw-r--r-- 0 sbuild (996) sbuild (996) 0 2026-09-17 08:59:42.000000 jtreg-test-output/jdk/0/JTreport/reportdir.dat │ │ │ │ │ +drwxr-xr-x 0 sbuild (996) sbuild (996) 0 2026-09-17 08:59:42.000000 jtreg-test-output/jdk/0/JTreport/html/ │ │ │ │ │ +-rw-r--r-- 0 sbuild (996) sbuild (996) 83174 2026-09-17 08:59:42.000000 jtreg-test-output/jdk/0/JTreport/html/excluded.html │ │ │ │ │ +-rw-r--r-- 0 sbuild (996) sbuild (996) 1250401 2026-09-17 08:59:42.000000 jtreg-test-output/jdk/0/JTreport/html/passed_gr.html │ │ │ │ │ +-rw-r--r-- 0 sbuild (996) sbuild (996) 307 2026-09-17 08:59:41.000000 jtreg-test-output/jdk/0/JTreport/html/report.css │ │ │ │ │ +-rw-r--r-- 0 sbuild (996) sbuild (996) 2020 2026-09-17 08:59:42.000000 jtreg-test-output/jdk/0/JTreport/html/failed.html │ │ │ │ │ +-rw-r--r-- 0 sbuild (996) sbuild (996) 1124333 2026-09-17 08:59:42.000000 jtreg-test-output/jdk/0/JTreport/html/report.html │ │ │ │ │ +-rw-r--r-- 0 sbuild (996) sbuild (996) 1249326 2026-09-17 08:59:42.000000 jtreg-test-output/jdk/0/JTreport/html/passed.html │ │ │ │ │ +-rw-r--r-- 0 sbuild (996) sbuild (996) 23926 2026-09-17 08:59:42.000000 jtreg-test-output/jdk/0/JTreport/html/config.html │ │ │ │ │ +-rw-r--r-- 0 sbuild (996) sbuild (996) 2750 2026-09-17 08:59:42.000000 jtreg-test-output/jdk/0/JTreport/html/failed_gr.html │ │ │ │ │ +-rw-r--r-- 0 sbuild (996) sbuild (996) 521 2026-09-17 08:59:42.000000 jtreg-test-output/jdk/0/JTreport/html/error_gr.html │ │ │ │ │ +-rw-r--r-- 0 sbuild (996) sbuild (996) 4241 2026-09-17 08:59:42.000000 jtreg-test-output/jdk/0/JTreport/html/env.html │ │ │ │ │ +-rw-r--r-- 0 sbuild (996) sbuild (996) 21066 2026-09-17 08:59:42.000000 jtreg-test-output/jdk/0/JTreport/html/notRun_gr.html │ │ │ │ │ +-rw-r--r-- 0 sbuild (996) sbuild (996) 1124333 2026-09-17 08:59:42.000000 jtreg-test-output/jdk/0/JTreport/html/index.html │ │ │ │ │ +-rw-r--r-- 0 sbuild (996) sbuild (996) 20721 2026-09-17 08:59:42.000000 jtreg-test-output/jdk/0/JTreport/html/notRun.html │ │ │ │ │ +-rw-r--r-- 0 sbuild (996) sbuild (996) 473 2026-09-17 08:59:42.000000 jtreg-test-output/jdk/0/JTreport/html/error.html │ │ │ │ │ +drwxr-xr-x 0 sbuild (996) sbuild (996) 0 2026-09-17 08:59:42.000000 jtreg-test-output/jdk/0/JTreport/text/ │ │ │ │ │ +-rw-r--r-- 0 sbuild (996) sbuild (996) 17 2026-09-17 08:59:42.000000 jtreg-test-output/jdk/0/JTreport/text/faiL2error.txt │ │ │ │ │ +-rw-r--r-- 0 sbuild (996) sbuild (996) 21 2026-09-17 08:59:42.000000 jtreg-test-output/jdk/0/JTreport/text/tc_fail2notrun.txt │ │ │ │ │ +-rw-r--r-- 0 sbuild (996) sbuild (996) 16 2026-09-17 08:59:42.000000 jtreg-test-output/jdk/0/JTreport/text/fail2pass.txt │ │ │ │ │ +-rw-r--r-- 0 sbuild (996) sbuild (996) 890745 2026-09-17 08:59:42.000000 jtreg-test-output/jdk/0/JTreport/text/summary.txt │ │ │ │ │ +-rw-r--r-- 0 sbuild (996) sbuild (996) 22 2026-09-17 08:59:42.000000 jtreg-test-output/jdk/0/JTreport/text/tc_fail2missing.txt │ │ │ │ │ +-rw-r--r-- 0 sbuild (996) sbuild (996) 85635 2026-09-17 08:59:42.000000 jtreg-test-output/jdk/0/JTreport/text/junit.txt │ │ │ │ │ +-rw-r--r-- 0 sbuild (996) sbuild (996) 16 2026-09-17 08:59:42.000000 jtreg-test-output/jdk/0/JTreport/text/fail2fail.txt │ │ │ │ │ +-rw-r--r-- 0 sbuild (996) sbuild (996) 173 2026-09-17 08:59:42.000000 jtreg-test-output/jdk/0/JTreport/text/stats.txt │ │ │ │ │ +-rw-r--r-- 0 sbuild (996) sbuild (996) 416 2026-09-17 08:59:42.000000 jtreg-test-output/jdk/0/JTreport/text/newfailures.txt │ │ │ │ │ +-rw-r--r-- 0 sbuild (996) sbuild (996) 19 2026-09-17 08:59:42.000000 jtreg-test-output/jdk/0/JTreport/text/tc_fail2pass.txt │ │ │ │ │ +-rw-r--r-- 0 sbuild (996) sbuild (996) 19 2026-09-17 08:59:42.000000 jtreg-test-output/jdk/0/JTreport/text/fail2missing.txt │ │ │ │ │ +-rw-r--r-- 0 sbuild (996) sbuild (996) 533 2026-09-17 05:12:18.000000 jtreg-test-output/jdk/0/JTreport/text/cmdArgs.txt │ │ │ │ │ +-rw-r--r-- 0 sbuild (996) sbuild (996) 947 2026-09-17 08:59:42.000000 jtreg-test-output/jdk/0/JTreport/text/timeStats.txt │ │ │ │ │ +-rw-r--r-- 0 sbuild (996) sbuild (996) 131926 2026-09-17 08:59:42.000000 jtreg-test-output/jdk/0/JTreport/text/testng.txt │ │ │ │ │ +-rw-r--r-- 0 sbuild (996) sbuild (996) 26859 2026-09-17 08:59:42.000000 jtreg-test-output/jdk/0/JTreport/text/notRun.txt │ │ │ │ │ +-rw-r--r-- 0 sbuild (996) sbuild (996) 19 2026-09-17 08:59:42.000000 jtreg-test-output/jdk/0/JTreport/text/other_errors.txt │ │ │ │ │ +-rw-r--r-- 0 sbuild (996) sbuild (996) 18 2026-09-17 08:59:42.000000 jtreg-test-output/jdk/0/JTreport/text/fail2notrun.txt │ │ │ │ │ +-rw-r--r-- 0 sbuild (996) sbuild (996) 21 2026-09-17 08:59:42.000000 jtreg-test-output/jdk/0/JTreport/text/tc_newfailures.txt │ │ │ │ │ +-rw-r--r-- 0 sbuild (996) sbuild (996) 20 2026-09-17 08:59:42.000000 jtreg-test-output/jdk/0/JTreport/text/tc_fail2error.txt │ │ │ │ │ +-rw-r--r-- 0 sbuild (996) sbuild (996) 714 2026-09-17 08:59:42.000000 jtreg-test-output/jdk/0/JTreport/index.html │ │ │ │ │ +lrwxrwxrwx 0 sbuild (996) sbuild (996) 0 2026-09-17 09:00:40.000000 jtreg-test-output/jdk/JTreport -> 2/JTreport │ │ │ │ │ +drwxr-xr-x 0 sbuild (996) sbuild (996) 0 2026-09-17 04:57:01.000000 jtreg-test-output/langtools/0/JTreport/ │ │ │ │ │ +-rw-r--r-- 0 sbuild (996) sbuild (996) 0 2026-09-17 04:57:01.000000 jtreg-test-output/langtools/0/JTreport/reportdir.dat │ │ │ │ │ +drwxr-xr-x 0 sbuild (996) sbuild (996) 0 2026-09-17 04:57:01.000000 jtreg-test-output/langtools/0/JTreport/html/ │ │ │ │ │ +-rw-r--r-- 0 sbuild (996) sbuild (996) 6195 2026-09-17 04:57:01.000000 jtreg-test-output/langtools/0/JTreport/html/excluded.html │ │ │ │ │ +-rw-r--r-- 0 sbuild (996) sbuild (996) 885492 2026-09-17 04:57:01.000000 jtreg-test-output/langtools/0/JTreport/html/passed_gr.html │ │ │ │ │ +-rw-r--r-- 0 sbuild (996) sbuild (996) 307 2026-09-17 04:57:01.000000 jtreg-test-output/langtools/0/JTreport/html/report.css │ │ │ │ │ +-rw-r--r-- 0 sbuild (996) sbuild (996) 465 2026-09-17 04:57:01.000000 jtreg-test-output/langtools/0/JTreport/html/failed.html │ │ │ │ │ +-rw-r--r-- 0 sbuild (996) sbuild (996) 541947 2026-09-17 04:57:01.000000 jtreg-test-output/langtools/0/JTreport/html/report.html │ │ │ │ │ +-rw-r--r-- 0 sbuild (996) sbuild (996) 885167 2026-09-17 04:57:01.000000 jtreg-test-output/langtools/0/JTreport/html/passed.html │ │ │ │ │ +-rw-r--r-- 0 sbuild (996) sbuild (996) 10727 2026-09-17 04:57:01.000000 jtreg-test-output/langtools/0/JTreport/html/config.html │ │ │ │ │ +-rw-r--r-- 0 sbuild (996) sbuild (996) 513 2026-09-17 04:57:01.000000 jtreg-test-output/langtools/0/JTreport/html/failed_gr.html │ │ │ │ │ +-rw-r--r-- 0 sbuild (996) sbuild (996) 521 2026-09-17 04:57:01.000000 jtreg-test-output/langtools/0/JTreport/html/error_gr.html │ │ │ │ │ +-rw-r--r-- 0 sbuild (996) sbuild (996) 4164 2026-09-17 04:57:01.000000 jtreg-test-output/langtools/0/JTreport/html/env.html │ │ │ │ │ +-rw-r--r-- 0 sbuild (996) sbuild (996) 2463 2026-09-17 04:57:01.000000 jtreg-test-output/langtools/0/JTreport/html/notRun_gr.html │ │ │ │ │ +-rw-r--r-- 0 sbuild (996) sbuild (996) 541947 2026-09-17 04:57:01.000000 jtreg-test-output/langtools/0/JTreport/html/index.html │ │ │ │ │ +-rw-r--r-- 0 sbuild (996) sbuild (996) 2174 2026-09-17 04:57:01.000000 jtreg-test-output/langtools/0/JTreport/html/notRun.html │ │ │ │ │ +-rw-r--r-- 0 sbuild (996) sbuild (996) 473 2026-09-17 04:57:01.000000 jtreg-test-output/langtools/0/JTreport/html/error.html │ │ │ │ │ +drwxr-xr-x 0 sbuild (996) sbuild (996) 0 2026-09-17 04:57:01.000000 jtreg-test-output/langtools/0/JTreport/text/ │ │ │ │ │ +-rw-r--r-- 0 sbuild (996) sbuild (996) 17 2026-09-17 04:57:01.000000 jtreg-test-output/langtools/0/JTreport/text/faiL2error.txt │ │ │ │ │ +-rw-r--r-- 0 sbuild (996) sbuild (996) 21 2026-09-17 04:57:01.000000 jtreg-test-output/langtools/0/JTreport/text/tc_fail2notrun.txt │ │ │ │ │ +-rw-r--r-- 0 sbuild (996) sbuild (996) 16 2026-09-17 04:57:01.000000 jtreg-test-output/langtools/0/JTreport/text/fail2pass.txt │ │ │ │ │ +-rw-r--r-- 0 sbuild (996) sbuild (996) 643622 2026-09-17 04:57:01.000000 jtreg-test-output/langtools/0/JTreport/text/summary.txt │ │ │ │ │ +-rw-r--r-- 0 sbuild (996) sbuild (996) 22 2026-09-17 04:57:01.000000 jtreg-test-output/langtools/0/JTreport/text/tc_fail2missing.txt │ │ │ │ │ +-rw-r--r-- 0 sbuild (996) sbuild (996) 18550 2026-09-17 04:57:01.000000 jtreg-test-output/langtools/0/JTreport/text/junit.txt │ │ │ │ │ +-rw-r--r-- 0 sbuild (996) sbuild (996) 16 2026-09-17 04:57:01.000000 jtreg-test-output/langtools/0/JTreport/text/fail2fail.txt │ │ │ │ │ +-rw-r--r-- 0 sbuild (996) sbuild (996) 120 2026-09-17 04:57:01.000000 jtreg-test-output/langtools/0/JTreport/text/stats.txt │ │ │ │ │ +-rw-r--r-- 0 sbuild (996) sbuild (996) 18 2026-09-17 04:57:01.000000 jtreg-test-output/langtools/0/JTreport/text/newfailures.txt │ │ │ │ │ +-rw-r--r-- 0 sbuild (996) sbuild (996) 19 2026-09-17 04:57:01.000000 jtreg-test-output/langtools/0/JTreport/text/tc_fail2pass.txt │ │ │ │ │ +-rw-r--r-- 0 sbuild (996) sbuild (996) 19 2026-09-17 04:57:01.000000 jtreg-test-output/langtools/0/JTreport/text/fail2missing.txt │ │ │ │ │ +-rw-r--r-- 0 sbuild (996) sbuild (996) 456 2026-09-17 04:17:43.000000 jtreg-test-output/langtools/0/JTreport/text/cmdArgs.txt │ │ │ │ │ +-rw-r--r-- 0 sbuild (996) sbuild (996) 454 2026-09-17 04:57:01.000000 jtreg-test-output/langtools/0/JTreport/text/timeStats.txt │ │ │ │ │ +-rw-r--r-- 0 sbuild (996) sbuild (996) 9538 2026-09-17 04:57:01.000000 jtreg-test-output/langtools/0/JTreport/text/testng.txt │ │ │ │ │ +-rw-r--r-- 0 sbuild (996) sbuild (996) 1921 2026-09-17 04:57:01.000000 jtreg-test-output/langtools/0/JTreport/text/notRun.txt │ │ │ │ │ +-rw-r--r-- 0 sbuild (996) sbuild (996) 19 2026-09-17 04:57:01.000000 jtreg-test-output/langtools/0/JTreport/text/other_errors.txt │ │ │ │ │ +-rw-r--r-- 0 sbuild (996) sbuild (996) 18 2026-09-17 04:57:01.000000 jtreg-test-output/langtools/0/JTreport/text/fail2notrun.txt │ │ │ │ │ +-rw-r--r-- 0 sbuild (996) sbuild (996) 21 2026-09-17 04:57:01.000000 jtreg-test-output/langtools/0/JTreport/text/tc_newfailures.txt │ │ │ │ │ +-rw-r--r-- 0 sbuild (996) sbuild (996) 20 2026-09-17 04:57:01.000000 jtreg-test-output/langtools/0/JTreport/text/tc_fail2error.txt │ │ │ │ │ +-rw-r--r-- 0 sbuild (996) sbuild (996) 726 2026-09-17 04:57:01.000000 jtreg-test-output/langtools/0/JTreport/index.html │ │ │ │ │ +lrwxrwxrwx 0 sbuild (996) sbuild (996) 0 2026-09-17 04:57:06.000000 jtreg-test-output/langtools/JTreport -> 0/JTreport │ │ │ │ ├── jtreg-test-output/jdk/2/JTreport/index.html │ │ │ │ │ @@ -3,15 +3,15 @@ │ │ │ │ │ │ │ │ │ │ │ │ │ │ │ │ │ │ │ │ │ │ │ │ │ Report Index │ │ │ │ │ │ │ │ │ │

/build/reproducible-path/openjdk-21-21.0.13~6ea/test/jdk

│ │ │ │ │ -Date of report : 16 September 2026 09:11:40 │ │ │ │ │ +Date of report : 17 September 2026 09:00:31 │ │ │ │ │ │ │ │ │ │

│ │ │ │ │ HTML Report │ │ │ │ │
Standard JT Harness HTML report. Can show a summary of the results, configuration information, and environment values.

│ │ │ │ │

│ │ │ │ │ Plain Text Report │ │ │ │ │
Standard JT Harness text report showing only test names and their result status string. Suitable for parsing by external program.

│ │ │ │ │ ├── html2text {} │ │ │ │ │ │ @@ -1,8 +1,8 @@ │ │ │ │ │ │ ************ //bbuuiilldd//rreepprroodduucciibbllee--ppaatthh//ooppeennjjddkk--2211--2211..00..1133~~66eeaa//tteesstt//jjddkk ************ │ │ │ │ │ │ -Date of report : 16 September 2026 09:11:40 │ │ │ │ │ │ +Date of report : 17 September 2026 09:00:31 │ │ │ │ │ │ _H_T_M_L_ _R_e_p_o_r_t │ │ │ │ │ │ Standard JT Harness HTML report. Can show a summary of the results, │ │ │ │ │ │ configuration information, and environment values. │ │ │ │ │ │ _P_l_a_i_n_ _T_e_x_t_ _R_e_p_o_r_t │ │ │ │ │ │ Standard JT Harness text report showing only test names and their result status │ │ │ │ │ │ string. Suitable for parsing by external program. │ │ │ │ ├── jtreg-test-output/jdk/2/JTreport/html/notRun_gr.html │ │ │ │ │ @@ -47640,16 +47640,16 @@ │ │ │ │ │ 000ba170: 7272 6563 746c 790a 0a3c 6c69 3e73 756e rrectly..
  • sun │ │ │ │ │ 000ba180: 2f73 6563 7572 6974 792f 736d 6172 7463 /security/smartc │ │ │ │ │ 000ba190: 6172 6469 6f2f 5465 7374 5472 616e 736d ardio/TestTransm │ │ │ │ │ 000ba1a0: 6974 2e6a 6176 613a 2074 6573 7420 7472 it.java: test tr │ │ │ │ │ 000ba1b0: 616e 736d 6974 2829 2077 6f72 6b73 0a3c ansmit() works.< │ │ │ │ │ 000ba1c0: 2f75 6c3e 0a3c 6872 3e0a 3c73 6d61 6c6c /ul>.
    .Report generate │ │ │ │ │ -000ba1e0: 6420 6f6e 2053 6570 2031 362c 2032 3032 d on Sep 16, 202 │ │ │ │ │ -000ba1f0: 3620 393a 3131 3a34 30e2 80af 414d 0a3c 6 9:11:40...AM.< │ │ │ │ │ +000ba1e0: 6420 6f6e 2053 6570 2031 372c 2032 3032 d on Sep 17, 202 │ │ │ │ │ +000ba1f0: 3620 393a 3030 3a33 31e2 80af 414d 0a3c 6 9:00:31...AM.< │ │ │ │ │ 000ba200: 6272 3e55 7369 6e67 204a 5420 4861 726e br>Using JT Harn │ │ │ │ │ 000ba210: 6573 7320 362e 3020 6232 363b 2062 7569 ess 6.0 b26; bui │ │ │ │ │ 000ba220: 6c74 206f 6e20 4d61 7263 6820 3138 2c20 lt on March 18, │ │ │ │ │ 000ba230: 3230 3236 2c20 3132 3a30 303a 3030 e280 2026, 12:00:00.. │ │ │ │ │ 000ba240: af41 4d20 5554 4320 7769 7468 206f 7065 .AM UTC with ope │ │ │ │ │ 000ba250: 6e6a 646b 2076 6572 7369 6f6e 2022 3235 njdk version "25 │ │ │ │ │ 000ba260: 2e30 2e33 2d65 6122 2032 3032 362d 3034 .0.3-ea" 2026-04 │ │ │ │ │ ├── html2text {} │ │ │ │ │ │ @@ -13391,10 +13391,10 @@ │ │ │ │ │ │ ()/endExclusive() works │ │ │ │ │ │ * sun/security/smartcardio/TestMultiplePresent.java: test that │ │ │ │ │ │ CardTerminals.waitForCard() works │ │ │ │ │ │ * sun/security/smartcardio/TestPresent.java: test that the isCardPresent()/ │ │ │ │ │ │ waitForX() APIs work correctly │ │ │ │ │ │ * sun/security/smartcardio/TestTransmit.java: test transmit() works │ │ │ │ │ │ =============================================================================== │ │ │ │ │ │ -Report generated on Sep 16, 2026 9:11:40 AM │ │ │ │ │ │ +Report generated on Sep 17, 2026 9:00:31 AM │ │ │ │ │ │ Using JT Harness 6.0 b26; built on March 18, 2026, 12:00:00 AM UTC with openjdk │ │ │ │ │ │ version "25.0.3-ea" 2026-04-21 │ │ │ │ ├── jtreg-test-output/jdk/2/JTreport/html/notRun.html │ │ │ │ │ @@ -47623,16 +47623,16 @@ │ │ │ │ │ 000ba060: 6c65 732f 7661 6c69 6461 7465 2f56 616c les/validate/Val │ │ │ │ │ 000ba070: 6964 6174 654d 6f64 756c 6573 5465 7374 idateModulesTest │ │ │ │ │ 000ba080: 2e6a 6176 613a 2042 6173 6963 2074 6573 .java: Basic tes │ │ │ │ │ 000ba090: 7420 666f 7220 6a61 7661 202d 2d76 616c t for java --val │ │ │ │ │ 000ba0a0: 6964 6174 652d 6d6f 6475 6c65 730a 3c62 idate-modules..
    . │ │ │ │ │ 000ba0c0: 5265 706f 7274 2067 656e 6572 6174 6564 Report generated │ │ │ │ │ -000ba0d0: 206f 6e20 5365 7020 3136 2c20 3230 3236 on Sep 16, 2026 │ │ │ │ │ -000ba0e0: 2039 3a31 313a 3430 e280 af41 4d0a 3c62 9:11:40...AM.Using JT Harne │ │ │ │ │ 000ba100: 7373 2036 2e30 2062 3236 3b20 6275 696c ss 6.0 b26; buil │ │ │ │ │ 000ba110: 7420 6f6e 204d 6172 6368 2031 382c 2032 t on March 18, 2 │ │ │ │ │ 000ba120: 3032 362c 2031 323a 3030 3a30 30e2 80af 026, 12:00:00... │ │ │ │ │ 000ba130: 414d 2055 5443 2077 6974 6820 6f70 656e AM UTC with open │ │ │ │ │ 000ba140: 6a64 6b20 7665 7273 696f 6e20 2232 352e jdk version "25. │ │ │ │ │ 000ba150: 302e 332d 6561 2220 3230 3236 2d30 342d 0.3-ea" 2026-04- │ │ │ │ │ ├── html2text {} │ │ │ │ │ │ @@ -12771,10 +12771,10 @@ │ │ │ │ │ │ tools/launcher/modules/patch/systemmodules/PatchSystemModules.java: Patch │ │ │ │ │ │ java.base and user module with ModuleHashes attribute │ │ │ │ │ │ tools/launcher/modules/showmoduleresolution/ShowModuleResolutionTest.java: │ │ │ │ │ │ Basic test for java --show-module-resolution │ │ │ │ │ │ tools/launcher/modules/validate/ValidateModulesTest.java: Basic test for java - │ │ │ │ │ │ -validate-modules │ │ │ │ │ │ =============================================================================== │ │ │ │ │ │ -Report generated on Sep 16, 2026 9:11:40 AM │ │ │ │ │ │ +Report generated on Sep 17, 2026 9:00:31 AM │ │ │ │ │ │ Using JT Harness 6.0 b26; built on March 18, 2026, 12:00:00 AM UTC with openjdk │ │ │ │ │ │ version "25.0.3-ea" 2026-04-21 │ │ │ │ ├── jtreg-test-output/jdk/2/JTreport/html/error_gr.html │ │ │ │ │ @@ -6,9 +6,9 @@ │ │ │ │ │ │ │ │ │ │ JT Harness : Tests that had errors │ │ │ │ │ │ │ │ │ │ │ │ │ │ │ │ │ │ │ │

    JT Harness : Tests that had errors

    Tests are grouped by their final status message. │ │ │ │ │
    │ │ │ │ │ -Report generated on Sep 16, 2026 9:11:40 AM │ │ │ │ │ +Report generated on Sep 17, 2026 9:00:31 AM │ │ │ │ │
    Using JT Harness 6.0 b26; built on March 18, 2026, 12:00:00 AM UTC with openjdk version "25.0.3-ea" 2026-04-21
    │ │ │ │ │ ├── html2text {} │ │ │ │ │ │ @@ -1,6 +1,6 @@ │ │ │ │ │ │ ************ JJTT HHaarrnneessss :: TTeessttss tthhaatt hhaadd eerrrroorrss ************ │ │ │ │ │ │ Tests are grouped by their final status message. │ │ │ │ │ │ =============================================================================== │ │ │ │ │ │ -Report generated on Sep 16, 2026 9:11:40 AM │ │ │ │ │ │ +Report generated on Sep 17, 2026 9:00:31 AM │ │ │ │ │ │ Using JT Harness 6.0 b26; built on March 18, 2026, 12:00:00 AM UTC with openjdk │ │ │ │ │ │ version "25.0.3-ea" 2026-04-21 │ │ │ │ ├── jtreg-test-output/jdk/2/JTreport/html/error.html │ │ │ │ │ @@ -6,9 +6,9 @@ │ │ │ │ │ │ │ │ │ │ JT Harness : Tests that had errors │ │ │ │ │ │ │ │ │ │ │ │ │ │ │ │ │ │ │ │

    JT Harness : Tests that had errors

    │ │ │ │ │
    │ │ │ │ │ -Report generated on Sep 16, 2026 9:11:40 AM │ │ │ │ │ +Report generated on Sep 17, 2026 9:00:31 AM │ │ │ │ │
    Using JT Harness 6.0 b26; built on March 18, 2026, 12:00:00 AM UTC with openjdk version "25.0.3-ea" 2026-04-21
    │ │ │ │ │ ├── html2text {} │ │ │ │ │ │ @@ -1,5 +1,5 @@ │ │ │ │ │ │ ************ JJTT HHaarrnneessss :: TTeessttss tthhaatt hhaadd eerrrroorrss ************ │ │ │ │ │ │ =============================================================================== │ │ │ │ │ │ -Report generated on Sep 16, 2026 9:11:40 AM │ │ │ │ │ │ +Report generated on Sep 17, 2026 9:00:31 AM │ │ │ │ │ │ Using JT Harness 6.0 b26; built on March 18, 2026, 12:00:00 AM UTC with openjdk │ │ │ │ │ │ version "25.0.3-ea" 2026-04-21 │ │ │ │ ├── jtreg-test-output/jdk/2/JTreport/html/failed_gr.html │ │ │ │ │ @@ -56,9 +56,9 @@ │ │ │ │ │
  • │ │ │ │ │ java/net/MulticastSocket/SetLoopbackMode.java: Test MulticastSocket.setLoopbackMode │ │ │ │ │ │ │ │ │ │
  • │ │ │ │ │ java/net/MulticastSocket/SetLoopbackModeIPv4.java: Test MulticastSocket.setLoopbackMode with IPv4 addresses │ │ │ │ │ │ │ │ │ │
    │ │ │ │ │ -Report generated on Sep 16, 2026 9:11:40 AM │ │ │ │ │ +Report generated on Sep 17, 2026 9:00:31 AM │ │ │ │ │
    Using JT Harness 6.0 b26; built on March 18, 2026, 12:00:00 AM UTC with openjdk version "25.0.3-ea" 2026-04-21
    │ │ │ │ │ ├── html2text {} │ │ │ │ │ │ @@ -25,10 +25,10 @@ │ │ │ │ │ │ * _j_a_v_a_/_n_e_t_/_M_u_l_t_i_c_a_s_t_S_o_c_k_e_t_/_N_o_L_o_o_p_b_a_c_k_P_a_c_k_e_t_s_._j_a_v_a: Re-test IPv6 (and │ │ │ │ │ │ specifically MulticastSocket) with latest Linux & USAGI code │ │ │ │ │ │ * _j_a_v_a_/_n_e_t_/_M_u_l_t_i_c_a_s_t_S_o_c_k_e_t_/_S_e_t_L_o_o_p_b_a_c_k_M_o_d_e_._j_a_v_a: Test │ │ │ │ │ │ MulticastSocket.setLoopbackMode │ │ │ │ │ │ * _j_a_v_a_/_n_e_t_/_M_u_l_t_i_c_a_s_t_S_o_c_k_e_t_/_S_e_t_L_o_o_p_b_a_c_k_M_o_d_e_I_P_v_4_._j_a_v_a: Test │ │ │ │ │ │ MulticastSocket.setLoopbackMode with IPv4 addresses │ │ │ │ │ │ =============================================================================== │ │ │ │ │ │ -Report generated on Sep 16, 2026 9:11:40 AM │ │ │ │ │ │ +Report generated on Sep 17, 2026 9:00:31 AM │ │ │ │ │ │ Using JT Harness 6.0 b26; built on March 18, 2026, 12:00:00 AM UTC with openjdk │ │ │ │ │ │ version "25.0.3-ea" 2026-04-21 │ │ │ │ ├── jtreg-test-output/jdk/2/JTreport/html/failed.html │ │ │ │ │ @@ -33,9 +33,9 @@ │ │ │ │ │ java/net/SocketPermission/SocketPermissionTest.java: SocketPermission tests for legacy socket types. │ │ │ │ │
    │ │ │ │ │ sun/security/krb5/auto/Addresses.java: fix krb5 caddr │ │ │ │ │
    │ │ │ │ │
    │ │ │ │ │ -Report generated on Sep 16, 2026 9:11:40 AM │ │ │ │ │ +Report generated on Sep 17, 2026 9:00:31 AM │ │ │ │ │
    Using JT Harness 6.0 b26; built on March 18, 2026, 12:00:00 AM UTC with openjdk version "25.0.3-ea" 2026-04-21
    │ │ │ │ │ ├── html2text {} │ │ │ │ │ │ @@ -11,10 +11,10 @@ │ │ │ │ │ │ MulticastSocket.setLoopbackMode with IPv4 addresses │ │ │ │ │ │ _j_a_v_a_/_n_e_t_/_M_u_l_t_i_c_a_s_t_S_o_c_k_e_t_/_T_e_s_t_._j_a_v_a: IPv4 and IPv6 multicasting broken on Linux │ │ │ │ │ │ _j_a_v_a_/_n_e_t_/_S_o_c_k_e_t_O_p_t_i_o_n_/_O_p_t_i_o_n_s_T_e_s_t_._j_a_v_a: │ │ │ │ │ │ _j_a_v_a_/_n_e_t_/_S_o_c_k_e_t_P_e_r_m_i_s_s_i_o_n_/_S_o_c_k_e_t_P_e_r_m_i_s_s_i_o_n_T_e_s_t_._j_a_v_a: SocketPermission tests for │ │ │ │ │ │ legacy socket types. │ │ │ │ │ │ _s_u_n_/_s_e_c_u_r_i_t_y_/_k_r_b_5_/_a_u_t_o_/_A_d_d_r_e_s_s_e_s_._j_a_v_a: fix krb5 caddr │ │ │ │ │ │ =============================================================================== │ │ │ │ │ │ -Report generated on Sep 16, 2026 9:11:40 AM │ │ │ │ │ │ +Report generated on Sep 17, 2026 9:00:31 AM │ │ │ │ │ │ Using JT Harness 6.0 b26; built on March 18, 2026, 12:00:00 AM UTC with openjdk │ │ │ │ │ │ version "25.0.3-ea" 2026-04-21 │ │ │ │ ├── jtreg-test-output/jdk/2/JTreport/html/passed_gr.html │ │ │ │ │ @@ -241,77956 +241,77911 @@ │ │ │ │ │ 00000f00: 6c65 732e 6a74 7222 3e6a 646b 2f63 6c61 les.jtr">jdk/cla │ │ │ │ │ 00000f10: 7373 6669 6c65 2f65 7861 6d70 6c65 732f ssfile/examples/ │ │ │ │ │ 00000f20: 5472 616e 7366 6f72 6d45 7861 6d70 6c65 TransformExample │ │ │ │ │ 00000f30: 732e 6a61 7661 3c2f 613e 3a20 5465 7374 s.java: Test │ │ │ │ │ 00000f40: 696e 6720 436c 6173 7366 696c 6520 5472 ing Classfile Tr │ │ │ │ │ 00000f50: 616e 7366 6f72 6d45 7861 6d70 6c65 7320 ansformExamples │ │ │ │ │ 00000f60: 636f 6d70 696c 6174 696f 6e2e 0a3c 2f75 compilation....

    DEBUG: [ │ │ │ │ │ -00000f80: 4874 7470 436c 6965 6e74 2d32 2d53 656c HttpClient-2-Sel │ │ │ │ │ -00000f90: 6563 746f 724d 616e 6167 6572 5d20 5b31 ectorManager] [1 │ │ │ │ │ -00000fa0: 3673 2038 3730 6d73 5d20 536f 636b 6574 6s 870ms] Socket │ │ │ │ │ -00000fb0: 5475 6265 2831 3629 2053 746f 7070 696e Tube(16) Stoppin │ │ │ │ │ -00000fc0: 6720 7265 6164 2073 6368 6564 756c 6572 g read scheduler │ │ │ │ │ -00000fd0: 3c2f 6834 3e0a 0a3c 756c 3e0a 3c6c 693e

    .. │ │ │ │ │ -00001070: 0a0a 3c68 343e 4445 4255 473a 205b 4874 ..

    DEBUG: [Ht │ │ │ │ │ -00001080: 7470 436c 6965 6e74 2d32 2d57 6f72 6b65 tpClient-2-Worke │ │ │ │ │ -00001090: 722d 315d 205b 3137 7320 3438 6d73 5d20 r-1] [17s 48ms] │ │ │ │ │ -000010a0: 5353 4c20 5772 6974 6572 2853 6f63 6b65 SSL Writer(Socke │ │ │ │ │ -000010b0: 7454 7562 6528 3136 2929 2070 726f 6365 tTube(16)) proce │ │ │ │ │ -000010c0: 7373 4461 7461 2c20 7772 6974 654c 6973 ssData, writeLis │ │ │ │ │ -000010d0: 7420 7265 6d61 696e 696e 673a 302c 2068 t remaining:0, h │ │ │ │ │ -000010e0: 7354 7269 6767 6572 6564 3a74 7275 652c sTriggered:true, │ │ │ │ │ -000010f0: 206e 6565 6457 7261 703a 7472 7565 3c2f needWrap:true..