--- /srv/rebuilderd/tmp/rebuilderdA6Rbhe/inputs/openjdk-21-jdk_21.0.13~8ea-1_ppc64el.deb +++ /srv/rebuilderd/tmp/rebuilderdA6Rbhe/out/openjdk-21-jdk_21.0.13~8ea-1_ppc64el.deb ├── file list │ @@ -1,3 +1,3 @@ │ -rw-r--r-- 0 0 0 4 2026-10-08 06:37:43.000000 debian-binary │ --rw-r--r-- 0 0 0 1844 2026-10-08 06:37:43.000000 control.tar.xz │ --rw-r--r-- 0 0 0 3585424 2026-10-08 06:37:43.000000 data.tar.xz │ +-rw-r--r-- 0 0 0 1840 2026-10-08 06:37:43.000000 control.tar.xz │ +-rw-r--r-- 0 0 0 4503596 2026-10-08 06:37:43.000000 data.tar.xz ├── control.tar.xz │ ├── control.tar │ │ ├── ./control │ │ │ @@ -1,13 +1,13 @@ │ │ │ Package: openjdk-21-jdk │ │ │ Source: openjdk-21 │ │ │ Version: 21.0.13~8ea-1 │ │ │ Architecture: ppc64el │ │ │ Maintainer: OpenJDK Team │ │ │ -Installed-Size: 3777 │ │ │ +Installed-Size: 4835 │ │ │ Depends: openjdk-21-jre (= 21.0.13~8ea-1), openjdk-21-jdk-headless (= 21.0.13~8ea-1), libc6 (>= 2.34), zlib1g (>= 1:1.1.4) │ │ │ Recommends: libxt-dev │ │ │ Suggests: openjdk-21-demo, openjdk-21-source, visualvm │ │ │ Provides: java-compiler, java-sdk (= 21), java10-sdk, java11-sdk, java12-sdk, java13-sdk, java14-sdk, java15-sdk, java16-sdk, java17-sdk, java18-sdk, java19-sdk, java2-sdk, java20-sdk, java21-sdk, java5-sdk, java6-sdk, java7-sdk, java8-sdk, java9-sdk │ │ │ Section: java │ │ │ Priority: optional │ │ │ Multi-Arch: same │ │ ├── ./md5sums │ │ │ ├── ./md5sums │ │ │ │┄ Files differ ├── data.tar.xz │ ├── data.tar │ │ ├── file list │ │ │ @@ -13,17 +13,17 @@ │ │ │ drwxr-xr-x 0 root (0) root (0) 0 2026-10-08 06:37:43.000000 ./usr/lib/jvm/java-21-openjdk-ppc64el/man/man1/ │ │ │ -rw-r--r-- 0 root (0) root (0) 1723 2026-10-08 06:37:43.000000 ./usr/lib/jvm/java-21-openjdk-ppc64el/man/man1/jconsole.1.gz │ │ │ drwxr-xr-x 0 root (0) root (0) 0 2026-10-08 06:37:43.000000 ./usr/lib/jvm/openjdk-21/ │ │ │ drwxr-xr-x 0 root (0) root (0) 0 2026-10-08 06:37:43.000000 ./usr/share/ │ │ │ drwxr-xr-x 0 root (0) root (0) 0 2026-10-08 06:37:43.000000 ./usr/share/doc/ │ │ │ drwxr-xr-x 0 root (0) root (0) 0 2026-10-08 06:37:43.000000 ./usr/share/doc/openjdk-21-jre-headless/ │ │ │ drwxr-xr-x 0 root (0) root (0) 0 2026-10-08 06:37:43.000000 ./usr/share/doc/openjdk-21-jre-headless/test-ppc64el/ │ │ │ --rw-r--r-- 0 root (0) root (0) 27532 2026-10-08 06:37:43.000000 ./usr/share/doc/openjdk-21-jre-headless/test-ppc64el/check-hotspot-hotspot.log.gz │ │ │ +-rw-r--r-- 0 root (0) root (0) 27563 2026-10-08 06:37:43.000000 ./usr/share/doc/openjdk-21-jre-headless/test-ppc64el/check-hotspot-hotspot.log.gz │ │ │ -rw-r--r-- 0 root (0) root (0) 3924 2026-10-08 06:37:43.000000 ./usr/share/doc/openjdk-21-jre-headless/test-ppc64el/check-jaxp-hotspot.log.gz │ │ │ --rw-r--r-- 0 root (0) root (0) 55715 2026-10-08 06:37:43.000000 ./usr/share/doc/openjdk-21-jre-headless/test-ppc64el/check-jdk-hotspot.log.gz │ │ │ +-rw-r--r-- 0 root (0) root (0) 55702 2026-10-08 06:37:43.000000 ./usr/share/doc/openjdk-21-jre-headless/test-ppc64el/check-jdk-hotspot.log.gz │ │ │ -rw-r--r-- 0 root (0) root (0) 35232 2026-10-08 06:37:43.000000 ./usr/share/doc/openjdk-21-jre-headless/test-ppc64el/check-langtools-hotspot.log.gz │ │ │ --rw-r--r-- 0 root (0) root (0) 8600 2026-10-08 06:37:43.000000 ./usr/share/doc/openjdk-21-jre-headless/test-ppc64el/failed_tests-hotspot.tar.gz │ │ │ --rw-r--r-- 0 root (0) root (0) 3443 2026-10-08 06:37:43.000000 ./usr/share/doc/openjdk-21-jre-headless/test-ppc64el/jtreg-summary-hotspot.log │ │ │ --rw-r--r-- 0 root (0) root (0) 126595 2026-10-08 06:37:43.000000 ./usr/share/doc/openjdk-21-jre-headless/test-ppc64el/jtreg_output-hotspot.log.gz │ │ │ --rw-r--r-- 0 root (0) root (0) 3494958 2026-10-08 06:37:43.000000 ./usr/share/doc/openjdk-21-jre-headless/test-ppc64el/jtreport-hotspot.tar.gz │ │ │ +-rw-r--r-- 0 root (0) root (0) 12642 2026-10-08 06:37:43.000000 ./usr/share/doc/openjdk-21-jre-headless/test-ppc64el/failed_tests-hotspot.tar.gz │ │ │ +-rw-r--r-- 0 root (0) root (0) 3721 2026-10-08 06:37:43.000000 ./usr/share/doc/openjdk-21-jre-headless/test-ppc64el/jtreg-summary-hotspot.log │ │ │ +-rw-r--r-- 0 root (0) root (0) 126736 2026-10-08 06:37:43.000000 ./usr/share/doc/openjdk-21-jre-headless/test-ppc64el/jtreg_output-hotspot.log.gz │ │ │ +-rw-r--r-- 0 root (0) root (0) 4574362 2026-10-08 06:37:43.000000 ./usr/share/doc/openjdk-21-jre-headless/test-ppc64el/jtreport-hotspot.tar.gz │ │ │ lrwxrwxrwx 0 root (0) root (0) 0 2026-10-08 06:37:43.000000 ./usr/lib/jvm/openjdk-21/src.zip -> lib/src.zip │ │ │ lrwxrwxrwx 0 root (0) root (0) 0 2026-10-08 06:37:43.000000 ./usr/share/doc/openjdk-21-jdk -> openjdk-21-jre │ │ ├── ./usr/share/doc/openjdk-21-jre-headless/test-ppc64el/check-hotspot-hotspot.log.gz │ │ │ ├── check-hotspot-hotspot.log │ │ │ │ @@ -2243,15 +2243,15 @@ │ │ │ │ Passed: runtime/cds/appcds/dynamicArchive/RegularHiddenClass.java │ │ │ │ Passed: runtime/cds/appcds/dynamicArchive/RelativePath.java │ │ │ │ Passed: runtime/cds/appcds/dynamicArchive/SharedArchiveFileOption.java │ │ │ │ Passed: runtime/cds/appcds/dynamicArchive/SharedBaseAddressOption.java │ │ │ │ Passed: runtime/cds/appcds/dynamicArchive/StaticInnerTest.java │ │ │ │ Passed: runtime/cds/appcds/dynamicArchive/TestAutoCreateSharedArchive.java │ │ │ │ Passed: runtime/cds/appcds/dynamicArchive/TestAutoCreateSharedArchiveNoDefaultArchive.java │ │ │ │ -Passed: runtime/cds/appcds/dynamicArchive/TestAutoCreateSharedArchiveUpgrade.java │ │ │ │ +FAILED: runtime/cds/appcds/dynamicArchive/TestAutoCreateSharedArchiveUpgrade.java │ │ │ │ Passed: runtime/cds/appcds/dynamicArchive/TestDynamicDumpAtOom.java │ │ │ │ Passed: runtime/cds/appcds/dynamicArchive/TestDynamicRegenerateHolderClasses.java │ │ │ │ Passed: runtime/cds/appcds/dynamicArchive/TestLambdaInvokers.java │ │ │ │ Passed: runtime/cds/appcds/dynamicArchive/UnsupportedBaseArchive.java │ │ │ │ Passed: runtime/cds/appcds/dynamicArchive/UnusedCPDuringDump.java │ │ │ │ Passed: runtime/cds/appcds/dynamicArchive/UsedAllArchivedLambdas.java │ │ │ │ Passed: runtime/cds/appcds/dynamicArchive/VerifyObjArrayCloneTest.java │ │ │ │ @@ -2998,14 +2998,22 @@ │ │ │ │ Passed: serviceability/tmtools/jstat/GcCapacityTest.java │ │ │ │ Passed: serviceability/tmtools/jstat/GcCauseTest01.java │ │ │ │ Passed: serviceability/tmtools/jstat/GcCauseTest02.java │ │ │ │ Passed: serviceability/tmtools/jstat/GcCauseTest03.java │ │ │ │ Passed: serviceability/tmtools/jstat/GcNewTest.java │ │ │ │ Passed: serviceability/tmtools/jstat/GcTest01.java │ │ │ │ Passed: serviceability/tmtools/jstat/GcTest02.java │ │ │ │ -Test results: passed: 3,002; skipped: 4; excluded: 43; did not match keywords: 75; did not meet module requirements: 85; did not meet platform requirements: 239 │ │ │ │ +Test results: passed: 3,001; failed: 1; skipped: 4; excluded: 43; did not match keywords: 75; did not meet module requirements: 85; did not meet platform requirements: 239 │ │ │ │ Framework-based tests: 448 = 409 TestNG + 39 JUnit │ │ │ │ Report written to /build/reproducible-path/openjdk-21-21.0.13~8ea/jtreg-test-output/hotspot/0/JTreport/html/report.html │ │ │ │ Results written to /tmp/hotspot/JTwork │ │ │ │ +Directory "jtreg-test-output/hotspot/1/JTreport" not found: creating │ │ │ │ +FAILED: runtime/cds/appcds/dynamicArchive/TestAutoCreateSharedArchiveUpgrade.java │ │ │ │ +Test results: failed: 1; excluded: 43; did not match keywords: 75; did not match prior status: 3,325 │ │ │ │ +Report written to /build/reproducible-path/openjdk-21-21.0.13~8ea/jtreg-test-output/hotspot/1/JTreport/html/report.html │ │ │ │ +Results written to /tmp/hotspot/JTwork │ │ │ │ +Directory "jtreg-test-output/hotspot/2/JTreport" not found: creating │ │ │ │ +FAILED: runtime/cds/appcds/dynamicArchive/TestAutoCreateSharedArchiveUpgrade.java │ │ │ │ +Test results: failed: 1; excluded: 43; did not match keywords: 75; did not match prior status: 3,325 │ │ │ │ +Report written to /build/reproducible-path/openjdk-21-21.0.13~8ea/jtreg-test-output/hotspot/2/JTreport/html/report.html │ │ │ │ +Results written to /tmp/hotspot/JTwork │ │ │ │ [debian/tests/jtreg-autopkgtest.sh] nothing to cleanup │ │ │ │ -Unable to compare jtreg results: no build jtreport found for hotspot/ppc64el. │ │ │ │ -Reason: '/usr/share/doc/openjdk-21-jre-headless//test-ppc64el/jtreport-hotspot.tar.gz' does not exist. │ │ ├── ./usr/share/doc/openjdk-21-jre-headless/test-ppc64el/check-jdk-hotspot.log.gz │ │ │ ├── check-jdk-hotspot.log │ │ │ │ @@ -666,15 +666,14 @@ │ │ │ │ Passed: java/io/File/ListRoots.java │ │ │ │ Passed: java/io/File/ListSpace.java │ │ │ │ Passed: java/io/File/MaxPathLength.java │ │ │ │ Passed: java/io/File/Mkdir.java │ │ │ │ Passed: java/io/File/NulFile.java │ │ │ │ Passed: java/io/File/NullArgs.java │ │ │ │ Passed: java/io/File/SetAccess.java │ │ │ │ -Passed: java/io/File/SetLastModified.java │ │ │ │ Passed: java/io/File/SetReadOnly.java │ │ │ │ Passed: java/io/File/SymLinks.java │ │ │ │ Passed: java/io/File/TempDirDoesNotExist.java │ │ │ │ Passed: java/io/File/TimeZoneLastModified.java │ │ │ │ Passed: java/io/File/ToURI.java │ │ │ │ Passed: java/io/File/ToURL.java │ │ │ │ Passed: java/io/File/Unicode.java │ │ │ │ @@ -2670,15 +2669,14 @@ │ │ │ │ Passed: java/nio/channels/AsynchronousSocketChannel/StressLoopback.java │ │ │ │ Passed: java/nio/channels/Channels/Basic.java │ │ │ │ Passed: java/nio/channels/Channels/Basic2.java │ │ │ │ Passed: java/nio/channels/Channels/CloseWriterOnFailedFlush.java │ │ │ │ Passed: java/nio/channels/Channels/EncodingTest.java │ │ │ │ Passed: java/nio/channels/Channels/ReadByte.java │ │ │ │ Passed: java/nio/channels/Channels/ReadOffset.java │ │ │ │ -Passed: java/nio/channels/Channels/ReadXBytes.java │ │ │ │ Passed: java/nio/channels/Channels/ShortWrite.java │ │ │ │ Passed: java/nio/channels/Channels/SocketChannelStreams.java │ │ │ │ Passed: java/nio/channels/Channels/TinyBuffers.java │ │ │ │ Passed: java/nio/channels/Channels/TransferTo_2GB_transferFrom.java │ │ │ │ Passed: java/nio/channels/Channels/TransferTo_2GB_transferTo.java │ │ │ │ Passed: java/nio/channels/Channels/TransferTo.java │ │ │ │ Passed: java/nio/channels/Channels/TransferTo2.java │ │ │ │ @@ -6505,16 +6503,16 @@ │ │ │ │ Passed: tools/launcher/TestXcheckJNIWarnings.java#jdwp-agent │ │ │ │ Passed: tools/launcher/TestXcheckJNIWarnings.java#noagent │ │ │ │ Passed: tools/launcher/ToolsOpts.java │ │ │ │ Passed: tools/launcher/TooSmallStackSize.java │ │ │ │ Passed: tools/launcher/UnicodeTest.java │ │ │ │ Passed: tools/launcher/UnresolvedExceptions.java │ │ │ │ Passed: tools/launcher/VersionCheck.java │ │ │ │ -Test results: passed: 6,500; failed: 9; skipped: 114; excluded: 39; did not match keywords: 37; did not meet module requirements: 3; did not meet platform requirements: 100 │ │ │ │ -Framework-based tests: 335,207 = 164,249 TestNG + 170,958 JUnit │ │ │ │ +Test results: passed: 6,498; failed: 9; skipped: 114; excluded: 39; did not match keywords: 37; did not meet module requirements: 3; did not meet platform requirements: 102 │ │ │ │ +Framework-based tests: 335,188 = 164,230 TestNG + 170,958 JUnit │ │ │ │ Report written to /build/reproducible-path/openjdk-21-21.0.13~8ea/jtreg-test-output/jdk/0/JTreport/html/report.html │ │ │ │ Results written to /tmp/jdk/JTwork │ │ │ │ Directory "jtreg-test-output/jdk/1/JTreport" not found: creating │ │ │ │ FAILED: java/net/MulticastSocket/B6427403.java │ │ │ │ FAILED: java/net/MulticastSocket/NoLoopbackPackets.java │ │ │ │ FAILED: java/net/MulticastSocket/Promiscuous.java │ │ │ │ FAILED: java/net/MulticastSocket/SetLoopbackMode.java │ │ ├── ./usr/share/doc/openjdk-21-jre-headless/test-ppc64el/failed_tests-hotspot.tar.gz │ │ │ ├── failed_tests-hotspot.tar │ │ │ │ ├── file list │ │ │ │ │ @@ -1,9 +1,10 @@ │ │ │ │ │ --rw-r--r-- 0 sbuild (999) sbuild (999) 6837 2026-10-08 23:01:47.000000 jtreg-test-output/jdk/JTwork/java/net/MulticastSocket/B6427403.jtr │ │ │ │ │ --rw-r--r-- 0 sbuild (999) sbuild (999) 7864 2026-10-08 23:01:47.000000 jtreg-test-output/jdk/JTwork/java/net/MulticastSocket/NoLoopbackPackets.jtr │ │ │ │ │ --rw-r--r-- 0 sbuild (999) sbuild (999) 7873 2026-10-08 23:01:47.000000 jtreg-test-output/jdk/JTwork/java/net/MulticastSocket/Promiscuous.jtr │ │ │ │ │ --rw-r--r-- 0 sbuild (999) sbuild (999) 8488 2026-10-08 23:01:47.000000 jtreg-test-output/jdk/JTwork/java/net/MulticastSocket/SetLoopbackMode.jtr │ │ │ │ │ --rw-r--r-- 0 sbuild (999) sbuild (999) 8902 2026-10-08 23:01:48.000000 jtreg-test-output/jdk/JTwork/java/net/MulticastSocket/SetLoopbackModeIPv4.jtr │ │ │ │ │ --rw-r--r-- 0 sbuild (999) sbuild (999) 9757 2026-10-08 23:01:48.000000 jtreg-test-output/jdk/JTwork/java/net/MulticastSocket/Test.jtr │ │ │ │ │ --rw-r--r-- 0 sbuild (999) sbuild (999) 7510 2026-10-08 23:01:48.000000 jtreg-test-output/jdk/JTwork/java/net/SocketOption/OptionsTest.jtr │ │ │ │ │ --rw-r--r-- 0 sbuild (999) sbuild (999) 15193 2026-10-08 23:01:52.000000 jtreg-test-output/jdk/JTwork/java/net/SocketPermission/SocketPermissionTest.jtr │ │ │ │ │ --rw-r--r-- 0 sbuild (999) sbuild (999) 25825 2026-10-08 23:01:56.000000 jtreg-test-output/jdk/JTwork/sun/security/krb5/auto/Addresses.jtr │ │ │ │ │ +-rw-r--r-- 0 sbuild (999) sbuild (999) 32457 2026-10-20 11:17:35.000000 jtreg-test-output/hotspot/JTwork/runtime/cds/appcds/dynamicArchive/TestAutoCreateSharedArchiveUpgrade.jtr │ │ │ │ │ +-rw-r--r-- 0 sbuild (999) sbuild (999) 6849 2026-10-20 15:52:46.000000 jtreg-test-output/jdk/JTwork/java/net/MulticastSocket/B6427403.jtr │ │ │ │ │ +-rw-r--r-- 0 sbuild (999) sbuild (999) 7876 2026-10-20 15:52:46.000000 jtreg-test-output/jdk/JTwork/java/net/MulticastSocket/NoLoopbackPackets.jtr │ │ │ │ │ +-rw-r--r-- 0 sbuild (999) sbuild (999) 7882 2026-10-20 15:52:46.000000 jtreg-test-output/jdk/JTwork/java/net/MulticastSocket/Promiscuous.jtr │ │ │ │ │ +-rw-r--r-- 0 sbuild (999) sbuild (999) 8497 2026-10-20 15:52:46.000000 jtreg-test-output/jdk/JTwork/java/net/MulticastSocket/SetLoopbackMode.jtr │ │ │ │ │ +-rw-r--r-- 0 sbuild (999) sbuild (999) 8914 2026-10-20 15:52:47.000000 jtreg-test-output/jdk/JTwork/java/net/MulticastSocket/SetLoopbackModeIPv4.jtr │ │ │ │ │ +-rw-r--r-- 0 sbuild (999) sbuild (999) 9770 2026-10-20 15:52:47.000000 jtreg-test-output/jdk/JTwork/java/net/MulticastSocket/Test.jtr │ │ │ │ │ +-rw-r--r-- 0 sbuild (999) sbuild (999) 7523 2026-10-20 15:52:47.000000 jtreg-test-output/jdk/JTwork/java/net/SocketOption/OptionsTest.jtr │ │ │ │ │ +-rw-r--r-- 0 sbuild (999) sbuild (999) 15204 2026-10-20 15:52:49.000000 jtreg-test-output/jdk/JTwork/java/net/SocketPermission/SocketPermissionTest.jtr │ │ │ │ │ +-rw-r--r-- 0 sbuild (999) sbuild (999) 25840 2026-10-20 15:52:52.000000 jtreg-test-output/jdk/JTwork/sun/security/krb5/auto/Addresses.jtr │ │ │ │ ├── jtreg-test-output/jdk/JTwork/java/net/MulticastSocket/B6427403.jtr │ │ │ │ │ @@ -1,70 +1,70 @@ │ │ │ │ │ #Test Results (version 2) │ │ │ │ │ -#Thu Oct 08 23:01:47 UTC 2026 │ │ │ │ │ +#Tue Oct 20 15:52:46 UTC 2026 │ │ │ │ │ #-----testdescription----- │ │ │ │ │ $file=/build/reproducible-path/openjdk-21-21.0.13~8ea/test/jdk/java/net/MulticastSocket/B6427403.java │ │ │ │ │ $root=/build/reproducible-path/openjdk-21-21.0.13~8ea/test/jdk │ │ │ │ │ keywords=bug6427403 │ │ │ │ │ run=USER_SPECIFIED main B6427403\n │ │ │ │ │ source=B6427403.java │ │ │ │ │ title=java.net.MulticastSocket.joinGroup() reports 'socket closed' │ │ │ │ │ │ │ │ │ │ #-----environment----- │ │ │ │ │ │ │ │ │ │ #-----testresult----- │ │ │ │ │ description=file\:/build/reproducible-path/openjdk-21-21.0.13~8ea/test/jdk/java/net/MulticastSocket/B6427403.java │ │ │ │ │ -elapsed=706 0\:00\:00.706 │ │ │ │ │ -end=Thu Oct 08 23\:01\:47 UTC 2026 │ │ │ │ │ +elapsed=562 0\:00\:00.562 │ │ │ │ │ +end=Tue Oct 20 15\:52\:46 UTC 2026 │ │ │ │ │ environment=regtest │ │ │ │ │ execStatus=Failed. Execution failed\: `main' threw exception\: java.net.SocketException\: No such device (setsockopt failed) │ │ │ │ │ harnessLoaderMode=Classpath Loader │ │ │ │ │ harnessVariety=Full Bundle │ │ │ │ │ hostname=sbuild │ │ │ │ │ -javatestOS=Linux 6.12.111+deb13-powerpc64le (ppc64le) │ │ │ │ │ +javatestOS=Linux 6.12.113+deb13-powerpc64le-64k (ppc64le) │ │ │ │ │ javatestVersion=6.0-ea+b26-2026-03-18-${BUILT_FROM_COMMIT} │ │ │ │ │ jtregVersion=jtreg 8.3 src 1 │ │ │ │ │ script=com.sun.javatest.regtest.exec.RegressionScript │ │ │ │ │ sections=script_messages build main │ │ │ │ │ -start=Thu Oct 08 23\:01\:46 UTC 2026 │ │ │ │ │ +start=Tue Oct 20 15\:52\:46 UTC 2026 │ │ │ │ │ test=java/net/MulticastSocket/B6427403.java │ │ │ │ │ testJDK=/build/reproducible-path/openjdk-21-21.0.13~8ea/build/bootcycle-build/images/jdk │ │ │ │ │ -testJDK_OS=[name\:Linux,arch\:ppc64le,version\:6.12.111+deb13-powerpc64le,family\:linux,simple_arch\:ppc64le,simple_version\:6.12,processors\:8,maxMemory\:33706758144,maxSwap\:182536105984] │ │ │ │ │ +testJDK_OS=[name\:Linux,arch\:ppc64le,version\:6.12.113+deb13-powerpc64le-64k,family\:linux,simple_arch\:ppc64le,simple_version\:6.12,processors\:4,maxMemory\:16541548544,maxSwap\:25769738240] │ │ │ │ │ testJDK_os.arch=ppc64le │ │ │ │ │ testJDK_os.name=Linux │ │ │ │ │ -testJDK_os.version=6.12.111+deb13-powerpc64le │ │ │ │ │ -totalTime=711 │ │ │ │ │ +testJDK_os.version=6.12.113+deb13-powerpc64le-64k │ │ │ │ │ +totalTime=567 │ │ │ │ │ user.name=sbuild │ │ │ │ │ work=/tmp/jdk/JTwork/java/net/MulticastSocket │ │ │ │ │ │ │ │ │ │ #section:script_messages │ │ │ │ │ ----------messages:(4/271)---------- │ │ │ │ │ JDK under test: /build/reproducible-path/openjdk-21-21.0.13~8ea/build/bootcycle-build/images/jdk │ │ │ │ │ openjdk version "21.0.13-ea" 2026-10-20 │ │ │ │ │ OpenJDK Runtime Environment (build 21.0.13-ea+8-1-Debian) │ │ │ │ │ OpenJDK 64-Bit Server VM (build 21.0.13-ea+8-1-Debian, mixed mode, sharing) │ │ │ │ │ │ │ │ │ │ #section:build │ │ │ │ │ ----------messages:(5/178)---------- │ │ │ │ │ command: build B6427403 │ │ │ │ │ reason: Named class compiled on demand │ │ │ │ │ -started: Thu Oct 08 23:01:46.880 UTC 2026 │ │ │ │ │ -finished: Thu Oct 08 23:01:46.905 UTC 2026 │ │ │ │ │ -elapsed time (seconds): 0.025 │ │ │ │ │ +started: Tue Oct 20 15:52:46.159 UTC 2026 │ │ │ │ │ +finished: Tue Oct 20 15:52:46.180 UTC 2026 │ │ │ │ │ +elapsed time (seconds): 0.021 │ │ │ │ │ result: Passed. All files up to date │ │ │ │ │ │ │ │ │ │ #section:main │ │ │ │ │ -----------messages:(8/233)---------- │ │ │ │ │ +----------messages:(8/234)---------- │ │ │ │ │ command: main B6427403 │ │ │ │ │ reason: User specified action: run main B6427403 │ │ │ │ │ -started: Thu Oct 08 23:01:46.908 UTC 2026 │ │ │ │ │ +started: Tue Oct 20 15:52:46.183 UTC 2026 │ │ │ │ │ Mode: agentvm │ │ │ │ │ Agent id: 1 │ │ │ │ │ -Process id: 2763194 │ │ │ │ │ -finished: Thu Oct 08 23:01:47.478 UTC 2026 │ │ │ │ │ -elapsed time (seconds): 0.57 │ │ │ │ │ +Process id: 2782600 │ │ │ │ │ +finished: Tue Oct 20 15:52:46.624 UTC 2026 │ │ │ │ │ +elapsed time (seconds): 0.441 │ │ │ │ │ ----------configuration:(15/668)---------- │ │ │ │ │ Boot Layer │ │ │ │ │ class path: /usr/share/jtreg/lib/javatest.jar │ │ │ │ │ /usr/share/jtreg/lib/jtreg.jar │ │ │ │ │ /usr/share/jtreg/lib/junit-platform-console-standalone.jar │ │ │ │ │ /usr/share/jtreg/lib/testng.jar │ │ │ │ │ /usr/share/jtreg/lib/guice.jar │ │ │ │ ├── jtreg-test-output/jdk/JTwork/java/net/MulticastSocket/NoLoopbackPackets.jtr │ │ │ │ │ @@ -1,75 +1,75 @@ │ │ │ │ │ #Test Results (version 2) │ │ │ │ │ -#Thu Oct 08 23:01:47 UTC 2026 │ │ │ │ │ +#Tue Oct 20 15:52:46 UTC 2026 │ │ │ │ │ #-----testdescription----- │ │ │ │ │ $file=/build/reproducible-path/openjdk-21-21.0.13~8ea/test/jdk/java/net/MulticastSocket/NoLoopbackPackets.java │ │ │ │ │ $root=/build/reproducible-path/openjdk-21-21.0.13~8ea/test/jdk │ │ │ │ │ keywords=bug4742177 │ │ │ │ │ library=/test/lib │ │ │ │ │ requires=os.family \!\= "windows" │ │ │ │ │ run=ASSUMED_ACTION main NoLoopbackPackets\n │ │ │ │ │ source=NoLoopbackPackets.java │ │ │ │ │ title=Re-test IPv6 (and specifically MulticastSocket) with latest Linux & USAGI code │ │ │ │ │ │ │ │ │ │ #-----environment----- │ │ │ │ │ │ │ │ │ │ #-----testresult----- │ │ │ │ │ description=file\:/build/reproducible-path/openjdk-21-21.0.13~8ea/test/jdk/java/net/MulticastSocket/NoLoopbackPackets.java │ │ │ │ │ -elapsed=98 0\:00\:00.098 │ │ │ │ │ -end=Thu Oct 08 23\:01\:47 UTC 2026 │ │ │ │ │ +elapsed=85 0\:00\:00.085 │ │ │ │ │ +end=Tue Oct 20 15\:52\:46 UTC 2026 │ │ │ │ │ environment=regtest │ │ │ │ │ execStatus=Failed. Execution failed\: `main' threw exception\: java.net.SocketException\: No such device (setsockopt failed) │ │ │ │ │ harnessLoaderMode=Classpath Loader │ │ │ │ │ harnessVariety=Full Bundle │ │ │ │ │ hostname=sbuild │ │ │ │ │ -javatestOS=Linux 6.12.111+deb13-powerpc64le (ppc64le) │ │ │ │ │ +javatestOS=Linux 6.12.113+deb13-powerpc64le-64k (ppc64le) │ │ │ │ │ javatestVersion=6.0-ea+b26-2026-03-18-${BUILT_FROM_COMMIT} │ │ │ │ │ jtregVersion=jtreg 8.3 src 1 │ │ │ │ │ script=com.sun.javatest.regtest.exec.RegressionScript │ │ │ │ │ sections=script_messages build main │ │ │ │ │ -start=Thu Oct 08 23\:01\:47 UTC 2026 │ │ │ │ │ +start=Tue Oct 20 15\:52\:46 UTC 2026 │ │ │ │ │ test=java/net/MulticastSocket/NoLoopbackPackets.java │ │ │ │ │ testJDK=/build/reproducible-path/openjdk-21-21.0.13~8ea/build/bootcycle-build/images/jdk │ │ │ │ │ -testJDK_OS=[name\:Linux,arch\:ppc64le,version\:6.12.111+deb13-powerpc64le,family\:linux,simple_arch\:ppc64le,simple_version\:6.12,processors\:8,maxMemory\:33706758144,maxSwap\:182536105984] │ │ │ │ │ +testJDK_OS=[name\:Linux,arch\:ppc64le,version\:6.12.113+deb13-powerpc64le-64k,family\:linux,simple_arch\:ppc64le,simple_version\:6.12,processors\:4,maxMemory\:16541548544,maxSwap\:25769738240] │ │ │ │ │ testJDK_os.arch=ppc64le │ │ │ │ │ testJDK_os.name=Linux │ │ │ │ │ -testJDK_os.version=6.12.111+deb13-powerpc64le │ │ │ │ │ -totalTime=100 │ │ │ │ │ +testJDK_os.version=6.12.113+deb13-powerpc64le-64k │ │ │ │ │ +totalTime=90 │ │ │ │ │ user.name=sbuild │ │ │ │ │ work=/tmp/jdk/JTwork/java/net/MulticastSocket │ │ │ │ │ │ │ │ │ │ #section:script_messages │ │ │ │ │ ----------messages:(7/481)---------- │ │ │ │ │ JDK under test: /build/reproducible-path/openjdk-21-21.0.13~8ea/build/bootcycle-build/images/jdk │ │ │ │ │ openjdk version "21.0.13-ea" 2026-10-20 │ │ │ │ │ OpenJDK Runtime Environment (build 21.0.13-ea+8-1-Debian) │ │ │ │ │ OpenJDK 64-Bit Server VM (build 21.0.13-ea+8-1-Debian, mixed mode, sharing) │ │ │ │ │ Library /test/lib; kind: packages │ │ │ │ │ source directory: /build/reproducible-path/openjdk-21-21.0.13~8ea/test/lib │ │ │ │ │ class directory: /tmp/jdk/JTwork/classes/java/net/MulticastSocket/NoLoopbackPackets.d/test/lib │ │ │ │ │ │ │ │ │ │ #section:build │ │ │ │ │ -----------messages:(5/185)---------- │ │ │ │ │ +----------messages:(5/187)---------- │ │ │ │ │ command: build NoLoopbackPackets │ │ │ │ │ reason: Named class compiled on demand │ │ │ │ │ -started: Thu Oct 08 23:01:47.495 UTC 2026 │ │ │ │ │ -finished: Thu Oct 08 23:01:47.495 UTC 2026 │ │ │ │ │ -elapsed time (seconds): 0.0 │ │ │ │ │ +started: Tue Oct 20 15:52:46.636 UTC 2026 │ │ │ │ │ +finished: Tue Oct 20 15:52:46.637 UTC 2026 │ │ │ │ │ +elapsed time (seconds): 0.001 │ │ │ │ │ result: Passed. All files up to date │ │ │ │ │ │ │ │ │ │ #section:main │ │ │ │ │ ----------messages:(8/264)---------- │ │ │ │ │ command: main NoLoopbackPackets │ │ │ │ │ reason: Assumed action based on file name: run main NoLoopbackPackets │ │ │ │ │ -started: Thu Oct 08 23:01:47.496 UTC 2026 │ │ │ │ │ +started: Tue Oct 20 15:52:46.637 UTC 2026 │ │ │ │ │ Mode: agentvm │ │ │ │ │ Agent id: 1 │ │ │ │ │ -Process id: 2763194 │ │ │ │ │ -finished: Thu Oct 08 23:01:47.589 UTC 2026 │ │ │ │ │ -elapsed time (seconds): 0.093 │ │ │ │ │ +Process id: 2782600 │ │ │ │ │ +finished: Tue Oct 20 15:52:46.719 UTC 2026 │ │ │ │ │ +elapsed time (seconds): 0.082 │ │ │ │ │ ----------configuration:(17/840)---------- │ │ │ │ │ Boot Layer │ │ │ │ │ class path: /usr/share/jtreg/lib/javatest.jar │ │ │ │ │ /usr/share/jtreg/lib/jtreg.jar │ │ │ │ │ /usr/share/jtreg/lib/junit-platform-console-standalone.jar │ │ │ │ │ /usr/share/jtreg/lib/testng.jar │ │ │ │ │ /usr/share/jtreg/lib/guice.jar │ │ │ │ │ @@ -113,15 +113,15 @@ │ │ │ │ │ -Dtest.class.path=/tmp/jdk/JTwork/classes/java/net/MulticastSocket/NoLoopbackPackets.d:/tmp/jdk/JTwork/classes/java/net/MulticastSocket/NoLoopbackPackets.d/test/lib \\ │ │ │ │ │ -Dtest.class.path.prefix=/tmp/jdk/JTwork/classes/java/net/MulticastSocket/NoLoopbackPackets.d:/build/reproducible-path/openjdk-21-21.0.13~8ea/test/jdk/java/net/MulticastSocket:/tmp/jdk/JTwork/classes/java/net/MulticastSocket/NoLoopbackPackets.d/test/lib \\ │ │ │ │ │ -classpath /tmp/jdk/JTwork/classes/java/net/MulticastSocket/NoLoopbackPackets.d:/build/reproducible-path/openjdk-21-21.0.13~8ea/test/jdk/java/net/MulticastSocket:/tmp/jdk/JTwork/classes/java/net/MulticastSocket/NoLoopbackPackets.d/test/lib:/build/reproducible-path/openjdk-21-21.0.13~8ea/test/lib:/usr/share/jtreg/lib/javatest.jar:/usr/share/jtreg/lib/jtreg.jar \\ │ │ │ │ │ NoLoopbackPackets │ │ │ │ │ ----------stdout:(0/0)---------- │ │ │ │ │ ----------stderr:(0/0)---------- │ │ │ │ │ ----------System.out:(1/32)---------- │ │ │ │ │ -joining group: /224.1.1.1:40014 │ │ │ │ │ +joining group: /224.1.1.1:34435 │ │ │ │ │ ----------System.err:(17/1050)---------- │ │ │ │ │ java.net.SocketException: No such device (setsockopt failed) │ │ │ │ │ at java.base/sun.nio.ch.Net.joinOrDrop4(Native Method) │ │ │ │ │ at java.base/sun.nio.ch.Net.join4(Net.java:720) │ │ │ │ │ at java.base/sun.nio.ch.DatagramChannelImpl.innerJoin(DatagramChannelImpl.java:1676) │ │ │ │ │ at java.base/sun.nio.ch.DatagramChannelImpl.join(DatagramChannelImpl.java:1694) │ │ │ │ │ at java.base/sun.nio.ch.DatagramSocketAdaptor.joinGroup(DatagramSocketAdaptor.java:494) │ │ │ │ ├── jtreg-test-output/jdk/JTwork/java/net/MulticastSocket/Promiscuous.jtr │ │ │ │ │ @@ -1,74 +1,74 @@ │ │ │ │ │ #Test Results (version 2) │ │ │ │ │ -#Thu Oct 08 23:01:47 UTC 2026 │ │ │ │ │ +#Tue Oct 20 15:52:46 UTC 2026 │ │ │ │ │ #-----testdescription----- │ │ │ │ │ $file=/build/reproducible-path/openjdk-21-21.0.13~8ea/test/jdk/java/net/MulticastSocket/Promiscuous.java │ │ │ │ │ $root=/build/reproducible-path/openjdk-21-21.0.13~8ea/test/jdk │ │ │ │ │ keywords=bug8014499 bug8219804 othervm │ │ │ │ │ library=/test/lib │ │ │ │ │ run=USER_SPECIFIED main Promiscuous\nUSER_SPECIFIED main/othervm -Djava.net.preferIPv4Stack\=true Promiscuous\n │ │ │ │ │ source=Promiscuous.java │ │ │ │ │ title=Test for interference when two sockets are bound to the same port but joined to different multicast groups │ │ │ │ │ │ │ │ │ │ #-----environment----- │ │ │ │ │ │ │ │ │ │ #-----testresult----- │ │ │ │ │ description=file\:/build/reproducible-path/openjdk-21-21.0.13~8ea/test/jdk/java/net/MulticastSocket/Promiscuous.java │ │ │ │ │ -elapsed=133 0\:00\:00.133 │ │ │ │ │ -end=Thu Oct 08 23\:01\:47 UTC 2026 │ │ │ │ │ +elapsed=117 0\:00\:00.117 │ │ │ │ │ +end=Tue Oct 20 15\:52\:46 UTC 2026 │ │ │ │ │ environment=regtest │ │ │ │ │ execStatus=Failed. Execution failed\: `main' threw exception\: java.net.SocketException\: Network is unreachable │ │ │ │ │ harnessLoaderMode=Classpath Loader │ │ │ │ │ harnessVariety=Full Bundle │ │ │ │ │ hostname=sbuild │ │ │ │ │ -javatestOS=Linux 6.12.111+deb13-powerpc64le (ppc64le) │ │ │ │ │ +javatestOS=Linux 6.12.113+deb13-powerpc64le-64k (ppc64le) │ │ │ │ │ javatestVersion=6.0-ea+b26-2026-03-18-${BUILT_FROM_COMMIT} │ │ │ │ │ jtregVersion=jtreg 8.3 src 1 │ │ │ │ │ script=com.sun.javatest.regtest.exec.RegressionScript │ │ │ │ │ sections=script_messages build main │ │ │ │ │ -start=Thu Oct 08 23\:01\:47 UTC 2026 │ │ │ │ │ +start=Tue Oct 20 15\:52\:46 UTC 2026 │ │ │ │ │ test=java/net/MulticastSocket/Promiscuous.java │ │ │ │ │ testJDK=/build/reproducible-path/openjdk-21-21.0.13~8ea/build/bootcycle-build/images/jdk │ │ │ │ │ -testJDK_OS=[name\:Linux,arch\:ppc64le,version\:6.12.111+deb13-powerpc64le,family\:linux,simple_arch\:ppc64le,simple_version\:6.12,processors\:8,maxMemory\:33706758144,maxSwap\:182536105984] │ │ │ │ │ +testJDK_OS=[name\:Linux,arch\:ppc64le,version\:6.12.113+deb13-powerpc64le-64k,family\:linux,simple_arch\:ppc64le,simple_version\:6.12,processors\:4,maxMemory\:16541548544,maxSwap\:25769738240] │ │ │ │ │ testJDK_os.arch=ppc64le │ │ │ │ │ testJDK_os.name=Linux │ │ │ │ │ -testJDK_os.version=6.12.111+deb13-powerpc64le │ │ │ │ │ -totalTime=135 │ │ │ │ │ +testJDK_os.version=6.12.113+deb13-powerpc64le-64k │ │ │ │ │ +totalTime=122 │ │ │ │ │ user.name=sbuild │ │ │ │ │ work=/tmp/jdk/JTwork/java/net/MulticastSocket │ │ │ │ │ │ │ │ │ │ #section:script_messages │ │ │ │ │ ----------messages:(7/475)---------- │ │ │ │ │ JDK under test: /build/reproducible-path/openjdk-21-21.0.13~8ea/build/bootcycle-build/images/jdk │ │ │ │ │ openjdk version "21.0.13-ea" 2026-10-20 │ │ │ │ │ OpenJDK Runtime Environment (build 21.0.13-ea+8-1-Debian) │ │ │ │ │ OpenJDK 64-Bit Server VM (build 21.0.13-ea+8-1-Debian, mixed mode, sharing) │ │ │ │ │ Library /test/lib; kind: packages │ │ │ │ │ source directory: /build/reproducible-path/openjdk-21-21.0.13~8ea/test/lib │ │ │ │ │ class directory: /tmp/jdk/JTwork/classes/java/net/MulticastSocket/Promiscuous.d/test/lib │ │ │ │ │ │ │ │ │ │ #section:build │ │ │ │ │ -----------messages:(5/181)---------- │ │ │ │ │ +----------messages:(5/179)---------- │ │ │ │ │ command: build Promiscuous │ │ │ │ │ reason: Named class compiled on demand │ │ │ │ │ -started: Thu Oct 08 23:01:47.599 UTC 2026 │ │ │ │ │ -finished: Thu Oct 08 23:01:47.600 UTC 2026 │ │ │ │ │ -elapsed time (seconds): 0.001 │ │ │ │ │ +started: Tue Oct 20 15:52:46.728 UTC 2026 │ │ │ │ │ +finished: Tue Oct 20 15:52:46.728 UTC 2026 │ │ │ │ │ +elapsed time (seconds): 0.0 │ │ │ │ │ result: Passed. All files up to date │ │ │ │ │ │ │ │ │ │ #section:main │ │ │ │ │ ----------messages:(8/240)---------- │ │ │ │ │ command: main Promiscuous │ │ │ │ │ reason: User specified action: run main Promiscuous │ │ │ │ │ -started: Thu Oct 08 23:01:47.600 UTC 2026 │ │ │ │ │ +started: Tue Oct 20 15:52:46.728 UTC 2026 │ │ │ │ │ Mode: agentvm │ │ │ │ │ Agent id: 1 │ │ │ │ │ -Process id: 2763194 │ │ │ │ │ -finished: Thu Oct 08 23:01:47.729 UTC 2026 │ │ │ │ │ -elapsed time (seconds): 0.129 │ │ │ │ │ +Process id: 2782600 │ │ │ │ │ +finished: Tue Oct 20 15:52:46.843 UTC 2026 │ │ │ │ │ +elapsed time (seconds): 0.115 │ │ │ │ │ ----------configuration:(17/828)---------- │ │ │ │ │ Boot Layer │ │ │ │ │ class path: /usr/share/jtreg/lib/javatest.jar │ │ │ │ │ /usr/share/jtreg/lib/jtreg.jar │ │ │ │ │ /usr/share/jtreg/lib/junit-platform-console-standalone.jar │ │ │ │ │ /usr/share/jtreg/lib/testng.jar │ │ │ │ │ /usr/share/jtreg/lib/guice.jar │ │ │ │ │ @@ -112,16 +112,16 @@ │ │ │ │ │ -Dtest.class.path=/tmp/jdk/JTwork/classes/java/net/MulticastSocket/Promiscuous.d:/tmp/jdk/JTwork/classes/java/net/MulticastSocket/Promiscuous.d/test/lib \\ │ │ │ │ │ -Dtest.class.path.prefix=/tmp/jdk/JTwork/classes/java/net/MulticastSocket/Promiscuous.d:/build/reproducible-path/openjdk-21-21.0.13~8ea/test/jdk/java/net/MulticastSocket:/tmp/jdk/JTwork/classes/java/net/MulticastSocket/Promiscuous.d/test/lib \\ │ │ │ │ │ -classpath /tmp/jdk/JTwork/classes/java/net/MulticastSocket/Promiscuous.d:/build/reproducible-path/openjdk-21-21.0.13~8ea/test/jdk/java/net/MulticastSocket:/tmp/jdk/JTwork/classes/java/net/MulticastSocket/Promiscuous.d/test/lib:/build/reproducible-path/openjdk-21-21.0.13~8ea/test/lib:/usr/share/jtreg/lib/javatest.jar:/usr/share/jtreg/lib/jtreg.jar \\ │ │ │ │ │ Promiscuous │ │ │ │ │ ----------stdout:(0/0)---------- │ │ │ │ │ ----------stderr:(0/0)---------- │ │ │ │ │ ----------System.out:(2/58)---------- │ │ │ │ │ -Using port: 58042 │ │ │ │ │ -Sending datagram to: /224.1.1.120/58042 │ │ │ │ │ +Using port: 52489 │ │ │ │ │ +Sending datagram to: /224.1.1.120/52489 │ │ │ │ │ ----------System.err:(18/1123)---------- │ │ │ │ │ java.net.SocketException: Network is unreachable │ │ │ │ │ at java.base/sun.nio.ch.DatagramChannelImpl.send0(Native Method) │ │ │ │ │ at java.base/sun.nio.ch.DatagramChannelImpl.sendFromNativeBuffer(DatagramChannelImpl.java:1005) │ │ │ │ │ at java.base/sun.nio.ch.DatagramChannelImpl.send(DatagramChannelImpl.java:966) │ │ │ │ │ at java.base/sun.nio.ch.DatagramChannelImpl.send(DatagramChannelImpl.java:889) │ │ │ │ │ at java.base/sun.nio.ch.DatagramChannelImpl.blockingSend(DatagramChannelImpl.java:952) │ │ │ │ ├── jtreg-test-output/jdk/JTwork/java/net/MulticastSocket/SetLoopbackMode.jtr │ │ │ │ │ @@ -1,44 +1,44 @@ │ │ │ │ │ #Test Results (version 2) │ │ │ │ │ -#Thu Oct 08 23:01:47 UTC 2026 │ │ │ │ │ +#Tue Oct 20 15:52:46 UTC 2026 │ │ │ │ │ #-----testdescription----- │ │ │ │ │ $file=/build/reproducible-path/openjdk-21-21.0.13~8ea/test/jdk/java/net/MulticastSocket/SetLoopbackMode.java │ │ │ │ │ $root=/build/reproducible-path/openjdk-21-21.0.13~8ea/test/jdk │ │ │ │ │ keywords=bug4686717 othervm │ │ │ │ │ library=/test/lib │ │ │ │ │ modules=java.base/java.net\:+open │ │ │ │ │ run=USER_SPECIFIED build jdk.test.lib.NetworkConfiguration jdk.test.lib.Platform\nUSER_SPECIFIED main/othervm SetLoopbackMode\n │ │ │ │ │ source=SetLoopbackMode.java │ │ │ │ │ title=Test MulticastSocket.setLoopbackMode │ │ │ │ │ │ │ │ │ │ #-----environment----- │ │ │ │ │ │ │ │ │ │ #-----testresult----- │ │ │ │ │ description=file\:/build/reproducible-path/openjdk-21-21.0.13~8ea/test/jdk/java/net/MulticastSocket/SetLoopbackMode.java │ │ │ │ │ -elapsed=246 0\:00\:00.246 │ │ │ │ │ -end=Thu Oct 08 23\:01\:47 UTC 2026 │ │ │ │ │ +elapsed=137 0\:00\:00.137 │ │ │ │ │ +end=Tue Oct 20 15\:52\:46 UTC 2026 │ │ │ │ │ environment=regtest │ │ │ │ │ execStatus=Failed. Execution failed\: `main' threw exception\: java.net.SocketException\: No such device (setsockopt failed) │ │ │ │ │ harnessLoaderMode=Classpath Loader │ │ │ │ │ harnessVariety=Full Bundle │ │ │ │ │ hostname=sbuild │ │ │ │ │ -javatestOS=Linux 6.12.111+deb13-powerpc64le (ppc64le) │ │ │ │ │ +javatestOS=Linux 6.12.113+deb13-powerpc64le-64k (ppc64le) │ │ │ │ │ javatestVersion=6.0-ea+b26-2026-03-18-${BUILT_FROM_COMMIT} │ │ │ │ │ jtregVersion=jtreg 8.3 src 1 │ │ │ │ │ modules=java.base/java.net\:+open │ │ │ │ │ script=com.sun.javatest.regtest.exec.RegressionScript │ │ │ │ │ sections=script_messages build build main │ │ │ │ │ -start=Thu Oct 08 23\:01\:47 UTC 2026 │ │ │ │ │ +start=Tue Oct 20 15\:52\:46 UTC 2026 │ │ │ │ │ test=java/net/MulticastSocket/SetLoopbackMode.java │ │ │ │ │ testJDK=/build/reproducible-path/openjdk-21-21.0.13~8ea/build/bootcycle-build/images/jdk │ │ │ │ │ -testJDK_OS=[name\:Linux,arch\:ppc64le,version\:6.12.111+deb13-powerpc64le,family\:linux,simple_arch\:ppc64le,simple_version\:6.12,processors\:8,maxMemory\:33706758144,maxSwap\:182536105984] │ │ │ │ │ +testJDK_OS=[name\:Linux,arch\:ppc64le,version\:6.12.113+deb13-powerpc64le-64k,family\:linux,simple_arch\:ppc64le,simple_version\:6.12,processors\:4,maxMemory\:16541548544,maxSwap\:25769738240] │ │ │ │ │ testJDK_os.arch=ppc64le │ │ │ │ │ testJDK_os.name=Linux │ │ │ │ │ -testJDK_os.version=6.12.111+deb13-powerpc64le │ │ │ │ │ -totalTime=248 │ │ │ │ │ +testJDK_os.version=6.12.113+deb13-powerpc64le-64k │ │ │ │ │ +totalTime=138 │ │ │ │ │ user.name=sbuild │ │ │ │ │ work=/tmp/jdk/JTwork/java/net/MulticastSocket │ │ │ │ │ │ │ │ │ │ #section:script_messages │ │ │ │ │ ----------messages:(7/479)---------- │ │ │ │ │ JDK under test: /build/reproducible-path/openjdk-21-21.0.13~8ea/build/bootcycle-build/images/jdk │ │ │ │ │ openjdk version "21.0.13-ea" 2026-10-20 │ │ │ │ │ @@ -48,38 +48,38 @@ │ │ │ │ │ source directory: /build/reproducible-path/openjdk-21-21.0.13~8ea/test/lib │ │ │ │ │ class directory: /tmp/jdk/JTwork/classes/java/net/MulticastSocket/SetLoopbackMode.d/test/lib │ │ │ │ │ │ │ │ │ │ #section:build │ │ │ │ │ ----------messages:(5/282)---------- │ │ │ │ │ command: build jdk.test.lib.NetworkConfiguration jdk.test.lib.Platform │ │ │ │ │ reason: User specified action: run build jdk.test.lib.NetworkConfiguration jdk.test.lib.Platform │ │ │ │ │ -started: Thu Oct 08 23:01:47.741 UTC 2026 │ │ │ │ │ -finished: Thu Oct 08 23:01:47.741 UTC 2026 │ │ │ │ │ +started: Tue Oct 20 15:52:46.849 UTC 2026 │ │ │ │ │ +finished: Tue Oct 20 15:52:46.849 UTC 2026 │ │ │ │ │ elapsed time (seconds): 0.0 │ │ │ │ │ result: Passed. All files up to date │ │ │ │ │ │ │ │ │ │ #section:build │ │ │ │ │ -----------messages:(5/185)---------- │ │ │ │ │ +----------messages:(5/183)---------- │ │ │ │ │ command: build SetLoopbackMode │ │ │ │ │ reason: Named class compiled on demand │ │ │ │ │ -started: Thu Oct 08 23:01:47.741 UTC 2026 │ │ │ │ │ -finished: Thu Oct 08 23:01:47.742 UTC 2026 │ │ │ │ │ -elapsed time (seconds): 0.001 │ │ │ │ │ +started: Tue Oct 20 15:52:46.849 UTC 2026 │ │ │ │ │ +finished: Tue Oct 20 15:52:46.849 UTC 2026 │ │ │ │ │ +elapsed time (seconds): 0.0 │ │ │ │ │ result: Passed. All files up to date │ │ │ │ │ │ │ │ │ │ #section:main │ │ │ │ │ ----------messages:(8/411)---------- │ │ │ │ │ command: main SetLoopbackMode │ │ │ │ │ reason: User specified action: run main/othervm SetLoopbackMode │ │ │ │ │ -started: Thu Oct 08 23:01:47.742 UTC 2026 │ │ │ │ │ +started: Tue Oct 20 15:52:46.849 UTC 2026 │ │ │ │ │ Mode: othervm [/othervm specified] │ │ │ │ │ Additional options from @modules: --add-modules java.base --add-exports java.base/java.net=ALL-UNNAMED --add-opens java.base/java.net=ALL-UNNAMED │ │ │ │ │ -Process id: 2763224 │ │ │ │ │ -finished: Thu Oct 08 23:01:47.983 UTC 2026 │ │ │ │ │ -elapsed time (seconds): 0.241 │ │ │ │ │ +Process id: 2782627 │ │ │ │ │ +finished: Tue Oct 20 15:52:46.983 UTC 2026 │ │ │ │ │ +elapsed time (seconds): 0.134 │ │ │ │ │ ----------configuration:(5/139)---------- │ │ │ │ │ Boot Layer │ │ │ │ │ add modules: java.base │ │ │ │ │ add exports: java.base/java.net ALL-UNNAMED │ │ │ │ │ add opens: java.base/java.net ALL-UNNAMED │ │ │ │ │ │ │ │ │ │ ----------System.out:(5/155)---------- │ │ │ │ ├── jtreg-test-output/jdk/JTwork/java/net/MulticastSocket/SetLoopbackModeIPv4.jtr │ │ │ │ │ @@ -1,44 +1,44 @@ │ │ │ │ │ #Test Results (version 2) │ │ │ │ │ -#Thu Oct 08 23:01:48 UTC 2026 │ │ │ │ │ +#Tue Oct 20 15:52:47 UTC 2026 │ │ │ │ │ #-----testdescription----- │ │ │ │ │ $file=/build/reproducible-path/openjdk-21-21.0.13~8ea/test/jdk/java/net/MulticastSocket/SetLoopbackModeIPv4.java │ │ │ │ │ $root=/build/reproducible-path/openjdk-21-21.0.13~8ea/test/jdk │ │ │ │ │ keywords=bug4686717 bug8241786 othervm │ │ │ │ │ library=/test/lib │ │ │ │ │ modules=java.base/java.net\:+open │ │ │ │ │ run=USER_SPECIFIED build jdk.test.lib.NetworkConfiguration jdk.test.lib.Platform SetLoopbackMode SetLoopbackModeIPv4\nUSER_SPECIFIED main/othervm -Djava.net.preferIPv4Stack\=true SetLoopbackModeIPv4\n │ │ │ │ │ source=SetLoopbackModeIPv4.java │ │ │ │ │ title=Test MulticastSocket.setLoopbackMode with IPv4 addresses │ │ │ │ │ │ │ │ │ │ #-----environment----- │ │ │ │ │ │ │ │ │ │ #-----testresult----- │ │ │ │ │ description=file\:/build/reproducible-path/openjdk-21-21.0.13~8ea/test/jdk/java/net/MulticastSocket/SetLoopbackModeIPv4.java │ │ │ │ │ -elapsed=235 0\:00\:00.235 │ │ │ │ │ -end=Thu Oct 08 23\:01\:48 UTC 2026 │ │ │ │ │ +elapsed=126 0\:00\:00.126 │ │ │ │ │ +end=Tue Oct 20 15\:52\:47 UTC 2026 │ │ │ │ │ environment=regtest │ │ │ │ │ execStatus=Failed. Execution failed\: `main' threw exception\: java.net.SocketException\: No such device (setsockopt failed) │ │ │ │ │ harnessLoaderMode=Classpath Loader │ │ │ │ │ harnessVariety=Full Bundle │ │ │ │ │ hostname=sbuild │ │ │ │ │ -javatestOS=Linux 6.12.111+deb13-powerpc64le (ppc64le) │ │ │ │ │ +javatestOS=Linux 6.12.113+deb13-powerpc64le-64k (ppc64le) │ │ │ │ │ javatestVersion=6.0-ea+b26-2026-03-18-${BUILT_FROM_COMMIT} │ │ │ │ │ jtregVersion=jtreg 8.3 src 1 │ │ │ │ │ modules=java.base/java.net\:+open │ │ │ │ │ script=com.sun.javatest.regtest.exec.RegressionScript │ │ │ │ │ sections=script_messages build build main │ │ │ │ │ -start=Thu Oct 08 23\:01\:47 UTC 2026 │ │ │ │ │ +start=Tue Oct 20 15\:52\:46 UTC 2026 │ │ │ │ │ test=java/net/MulticastSocket/SetLoopbackModeIPv4.java │ │ │ │ │ testJDK=/build/reproducible-path/openjdk-21-21.0.13~8ea/build/bootcycle-build/images/jdk │ │ │ │ │ -testJDK_OS=[name\:Linux,arch\:ppc64le,version\:6.12.111+deb13-powerpc64le,family\:linux,simple_arch\:ppc64le,simple_version\:6.12,processors\:8,maxMemory\:33706758144,maxSwap\:182536105984] │ │ │ │ │ +testJDK_OS=[name\:Linux,arch\:ppc64le,version\:6.12.113+deb13-powerpc64le-64k,family\:linux,simple_arch\:ppc64le,simple_version\:6.12,processors\:4,maxMemory\:16541548544,maxSwap\:25769738240] │ │ │ │ │ testJDK_os.arch=ppc64le │ │ │ │ │ testJDK_os.name=Linux │ │ │ │ │ -testJDK_os.version=6.12.111+deb13-powerpc64le │ │ │ │ │ -totalTime=236 │ │ │ │ │ +testJDK_os.version=6.12.113+deb13-powerpc64le-64k │ │ │ │ │ +totalTime=127 │ │ │ │ │ user.name=sbuild │ │ │ │ │ work=/tmp/jdk/JTwork/java/net/MulticastSocket │ │ │ │ │ │ │ │ │ │ #section:script_messages │ │ │ │ │ ----------messages:(7/483)---------- │ │ │ │ │ JDK under test: /build/reproducible-path/openjdk-21-21.0.13~8ea/build/bootcycle-build/images/jdk │ │ │ │ │ openjdk version "21.0.13-ea" 2026-10-20 │ │ │ │ │ @@ -48,38 +48,38 @@ │ │ │ │ │ source directory: /build/reproducible-path/openjdk-21-21.0.13~8ea/test/lib │ │ │ │ │ class directory: /tmp/jdk/JTwork/classes/java/net/MulticastSocket/SetLoopbackModeIPv4.d/test/lib │ │ │ │ │ │ │ │ │ │ #section:build │ │ │ │ │ ----------messages:(5/354)---------- │ │ │ │ │ command: build jdk.test.lib.NetworkConfiguration jdk.test.lib.Platform SetLoopbackMode SetLoopbackModeIPv4 │ │ │ │ │ reason: User specified action: run build jdk.test.lib.NetworkConfiguration jdk.test.lib.Platform SetLoopbackMode SetLoopbackModeIPv4 │ │ │ │ │ -started: Thu Oct 08 23:01:47.994 UTC 2026 │ │ │ │ │ -finished: Thu Oct 08 23:01:47.994 UTC 2026 │ │ │ │ │ +started: Tue Oct 20 15:52:46.988 UTC 2026 │ │ │ │ │ +finished: Tue Oct 20 15:52:46.988 UTC 2026 │ │ │ │ │ elapsed time (seconds): 0.0 │ │ │ │ │ result: Passed. All files up to date │ │ │ │ │ │ │ │ │ │ #section:build │ │ │ │ │ ----------messages:(5/187)---------- │ │ │ │ │ command: build SetLoopbackModeIPv4 │ │ │ │ │ reason: Named class compiled on demand │ │ │ │ │ -started: Thu Oct 08 23:01:47.995 UTC 2026 │ │ │ │ │ -finished: Thu Oct 08 23:01:47.995 UTC 2026 │ │ │ │ │ +started: Tue Oct 20 15:52:46.989 UTC 2026 │ │ │ │ │ +finished: Tue Oct 20 15:52:46.989 UTC 2026 │ │ │ │ │ elapsed time (seconds): 0.0 │ │ │ │ │ result: Passed. All files up to date │ │ │ │ │ │ │ │ │ │ #section:main │ │ │ │ │ -----------messages:(8/482)---------- │ │ │ │ │ +----------messages:(8/483)---------- │ │ │ │ │ command: main -Djava.net.preferIPv4Stack=true SetLoopbackModeIPv4 │ │ │ │ │ reason: User specified action: run main/othervm -Djava.net.preferIPv4Stack=true SetLoopbackModeIPv4 │ │ │ │ │ -started: Thu Oct 08 23:01:47.995 UTC 2026 │ │ │ │ │ +started: Tue Oct 20 15:52:46.989 UTC 2026 │ │ │ │ │ Mode: othervm [/othervm specified] │ │ │ │ │ Additional options from @modules: --add-modules java.base --add-exports java.base/java.net=ALL-UNNAMED --add-opens java.base/java.net=ALL-UNNAMED │ │ │ │ │ -Process id: 2763246 │ │ │ │ │ -finished: Thu Oct 08 23:01:48.225 UTC 2026 │ │ │ │ │ -elapsed time (seconds): 0.23 │ │ │ │ │ +Process id: 2782649 │ │ │ │ │ +finished: Tue Oct 20 15:52:47.113 UTC 2026 │ │ │ │ │ +elapsed time (seconds): 0.124 │ │ │ │ │ ----------configuration:(5/139)---------- │ │ │ │ │ Boot Layer │ │ │ │ │ add modules: java.base │ │ │ │ │ add exports: java.base/java.net ALL-UNNAMED │ │ │ │ │ add opens: java.base/java.net ALL-UNNAMED │ │ │ │ │ │ │ │ │ │ ----------System.out:(5/155)---------- │ │ │ │ ├── jtreg-test-output/jdk/JTwork/java/net/MulticastSocket/Test.jtr │ │ │ │ │ @@ -1,41 +1,41 @@ │ │ │ │ │ #Test Results (version 2) │ │ │ │ │ -#Thu Oct 08 23:01:48 UTC 2026 │ │ │ │ │ +#Tue Oct 20 15:52:47 UTC 2026 │ │ │ │ │ #-----testdescription----- │ │ │ │ │ $file=/build/reproducible-path/openjdk-21-21.0.13~8ea/test/jdk/java/net/MulticastSocket/Test.java │ │ │ │ │ $root=/build/reproducible-path/openjdk-21-21.0.13~8ea/test/jdk │ │ │ │ │ keywords=bug4488458 othervm │ │ │ │ │ library=/test/lib │ │ │ │ │ run=USER_SPECIFIED build jdk.test.lib.NetworkConfiguration jdk.test.lib.Platform\nUSER_SPECIFIED main Test\nUSER_SPECIFIED main/othervm -Djava.net.preferIPv4Stack\=true Test\n │ │ │ │ │ source=Test.java │ │ │ │ │ title=IPv4 and IPv6 multicasting broken on Linux │ │ │ │ │ │ │ │ │ │ #-----environment----- │ │ │ │ │ │ │ │ │ │ #-----testresult----- │ │ │ │ │ description=file\:/build/reproducible-path/openjdk-21-21.0.13~8ea/test/jdk/java/net/MulticastSocket/Test.java │ │ │ │ │ -elapsed=90 0\:00\:00.090 │ │ │ │ │ -end=Thu Oct 08 23\:01\:48 UTC 2026 │ │ │ │ │ +elapsed=91 0\:00\:00.091 │ │ │ │ │ +end=Tue Oct 20 15\:52\:47 UTC 2026 │ │ │ │ │ environment=regtest │ │ │ │ │ execStatus=Failed. Execution failed\: `main' threw exception\: java.lang.Exception\: Test failed - see log file for details │ │ │ │ │ harnessLoaderMode=Classpath Loader │ │ │ │ │ harnessVariety=Full Bundle │ │ │ │ │ hostname=sbuild │ │ │ │ │ -javatestOS=Linux 6.12.111+deb13-powerpc64le (ppc64le) │ │ │ │ │ +javatestOS=Linux 6.12.113+deb13-powerpc64le-64k (ppc64le) │ │ │ │ │ javatestVersion=6.0-ea+b26-2026-03-18-${BUILT_FROM_COMMIT} │ │ │ │ │ jtregVersion=jtreg 8.3 src 1 │ │ │ │ │ script=com.sun.javatest.regtest.exec.RegressionScript │ │ │ │ │ sections=script_messages build build main │ │ │ │ │ -start=Thu Oct 08 23\:01\:48 UTC 2026 │ │ │ │ │ +start=Tue Oct 20 15\:52\:47 UTC 2026 │ │ │ │ │ test=java/net/MulticastSocket/Test.java │ │ │ │ │ testJDK=/build/reproducible-path/openjdk-21-21.0.13~8ea/build/bootcycle-build/images/jdk │ │ │ │ │ -testJDK_OS=[name\:Linux,arch\:ppc64le,version\:6.12.111+deb13-powerpc64le,family\:linux,simple_arch\:ppc64le,simple_version\:6.12,processors\:8,maxMemory\:33706758144,maxSwap\:182536105984] │ │ │ │ │ +testJDK_OS=[name\:Linux,arch\:ppc64le,version\:6.12.113+deb13-powerpc64le-64k,family\:linux,simple_arch\:ppc64le,simple_version\:6.12,processors\:4,maxMemory\:16541548544,maxSwap\:25769738240] │ │ │ │ │ testJDK_os.arch=ppc64le │ │ │ │ │ testJDK_os.name=Linux │ │ │ │ │ -testJDK_os.version=6.12.111+deb13-powerpc64le │ │ │ │ │ +testJDK_os.version=6.12.113+deb13-powerpc64le-64k │ │ │ │ │ totalTime=93 │ │ │ │ │ user.name=sbuild │ │ │ │ │ work=/tmp/jdk/JTwork/java/net/MulticastSocket │ │ │ │ │ │ │ │ │ │ #section:script_messages │ │ │ │ │ ----------messages:(7/468)---------- │ │ │ │ │ JDK under test: /build/reproducible-path/openjdk-21-21.0.13~8ea/build/bootcycle-build/images/jdk │ │ │ │ │ @@ -46,38 +46,38 @@ │ │ │ │ │ source directory: /build/reproducible-path/openjdk-21-21.0.13~8ea/test/lib │ │ │ │ │ class directory: /tmp/jdk/JTwork/classes/java/net/MulticastSocket/Test.d/test/lib │ │ │ │ │ │ │ │ │ │ #section:build │ │ │ │ │ ----------messages:(5/282)---------- │ │ │ │ │ command: build jdk.test.lib.NetworkConfiguration jdk.test.lib.Platform │ │ │ │ │ reason: User specified action: run build jdk.test.lib.NetworkConfiguration jdk.test.lib.Platform │ │ │ │ │ -started: Thu Oct 08 23:01:48.236 UTC 2026 │ │ │ │ │ -finished: Thu Oct 08 23:01:48.236 UTC 2026 │ │ │ │ │ +started: Tue Oct 20 15:52:47.118 UTC 2026 │ │ │ │ │ +finished: Tue Oct 20 15:52:47.118 UTC 2026 │ │ │ │ │ elapsed time (seconds): 0.0 │ │ │ │ │ result: Passed. All files up to date │ │ │ │ │ │ │ │ │ │ #section:build │ │ │ │ │ -----------messages:(5/172)---------- │ │ │ │ │ +----------messages:(5/174)---------- │ │ │ │ │ command: build Test │ │ │ │ │ reason: Named class compiled on demand │ │ │ │ │ -started: Thu Oct 08 23:01:48.237 UTC 2026 │ │ │ │ │ -finished: Thu Oct 08 23:01:48.237 UTC 2026 │ │ │ │ │ -elapsed time (seconds): 0.0 │ │ │ │ │ +started: Tue Oct 20 15:52:47.118 UTC 2026 │ │ │ │ │ +finished: Tue Oct 20 15:52:47.119 UTC 2026 │ │ │ │ │ +elapsed time (seconds): 0.001 │ │ │ │ │ result: Passed. All files up to date │ │ │ │ │ │ │ │ │ │ #section:main │ │ │ │ │ ----------messages:(8/226)---------- │ │ │ │ │ command: main Test │ │ │ │ │ reason: User specified action: run main Test │ │ │ │ │ -started: Thu Oct 08 23:01:48.237 UTC 2026 │ │ │ │ │ +started: Tue Oct 20 15:52:47.119 UTC 2026 │ │ │ │ │ Mode: agentvm │ │ │ │ │ Agent id: 1 │ │ │ │ │ -Process id: 2763194 │ │ │ │ │ -finished: Thu Oct 08 23:01:48.323 UTC 2026 │ │ │ │ │ -elapsed time (seconds): 0.086 │ │ │ │ │ +Process id: 2782600 │ │ │ │ │ +finished: Tue Oct 20 15:52:47.208 UTC 2026 │ │ │ │ │ +elapsed time (seconds): 0.089 │ │ │ │ │ ----------configuration:(17/814)---------- │ │ │ │ │ Boot Layer │ │ │ │ │ class path: /usr/share/jtreg/lib/javatest.jar │ │ │ │ │ /usr/share/jtreg/lib/jtreg.jar │ │ │ │ │ /usr/share/jtreg/lib/junit-platform-console-standalone.jar │ │ │ │ │ /usr/share/jtreg/lib/testng.jar │ │ │ │ │ /usr/share/jtreg/lib/guice.jar │ │ │ │ ├── jtreg-test-output/jdk/JTwork/java/net/SocketOption/OptionsTest.jtr │ │ │ │ │ @@ -1,74 +1,74 @@ │ │ │ │ │ #Test Results (version 2) │ │ │ │ │ -#Thu Oct 08 23:01:48 UTC 2026 │ │ │ │ │ +#Tue Oct 20 15:52:47 UTC 2026 │ │ │ │ │ #-----testdescription----- │ │ │ │ │ $file=/build/reproducible-path/openjdk-21-21.0.13~8ea/test/jdk/java/net/SocketOption/OptionsTest.java │ │ │ │ │ $root=/build/reproducible-path/openjdk-21-21.0.13~8ea/test/jdk │ │ │ │ │ keywords=bug8036979 bug8072384 bug8044773 bug8225214 bug8233296 bug8234083 othervm │ │ │ │ │ library=/test/lib │ │ │ │ │ requires=\!vm.graal.enabled │ │ │ │ │ run=USER_SPECIFIED main/othervm -Xcheck\:jni OptionsTest\nUSER_SPECIFIED main/othervm -Xcheck\:jni -Djava.net.preferIPv4Stack\=true OptionsTest\nUSER_SPECIFIED main/othervm --limit-modules\=java.base OptionsTest\nUSER_SPECIFIED main/othervm/policy\=options.policy OptionsTest\n │ │ │ │ │ source=OptionsTest.java │ │ │ │ │ title=\ │ │ │ │ │ │ │ │ │ │ #-----environment----- │ │ │ │ │ │ │ │ │ │ #-----testresult----- │ │ │ │ │ description=file\:/build/reproducible-path/openjdk-21-21.0.13~8ea/test/jdk/java/net/SocketOption/OptionsTest.java │ │ │ │ │ -elapsed=222 0\:00\:00.222 │ │ │ │ │ -end=Thu Oct 08 23\:01\:48 UTC 2026 │ │ │ │ │ +elapsed=127 0\:00\:00.127 │ │ │ │ │ +end=Tue Oct 20 15\:52\:47 UTC 2026 │ │ │ │ │ environment=regtest │ │ │ │ │ execStatus=Failed. Execution failed\: `main' threw exception\: java.lang.IllegalArgumentException\: Invalid value 'null' │ │ │ │ │ harnessLoaderMode=Classpath Loader │ │ │ │ │ harnessVariety=Full Bundle │ │ │ │ │ hostname=sbuild │ │ │ │ │ -javatestOS=Linux 6.12.111+deb13-powerpc64le (ppc64le) │ │ │ │ │ +javatestOS=Linux 6.12.113+deb13-powerpc64le-64k (ppc64le) │ │ │ │ │ javatestVersion=6.0-ea+b26-2026-03-18-${BUILT_FROM_COMMIT} │ │ │ │ │ jtregVersion=jtreg 8.3 src 1 │ │ │ │ │ script=com.sun.javatest.regtest.exec.RegressionScript │ │ │ │ │ sections=script_messages build main │ │ │ │ │ -start=Thu Oct 08 23\:01\:48 UTC 2026 │ │ │ │ │ +start=Tue Oct 20 15\:52\:47 UTC 2026 │ │ │ │ │ test=java/net/SocketOption/OptionsTest.java │ │ │ │ │ testJDK=/build/reproducible-path/openjdk-21-21.0.13~8ea/build/bootcycle-build/images/jdk │ │ │ │ │ -testJDK_OS=[name\:Linux,arch\:ppc64le,version\:6.12.111+deb13-powerpc64le,family\:linux,simple_arch\:ppc64le,simple_version\:6.12,processors\:8,maxMemory\:33706758144,maxSwap\:182536105984] │ │ │ │ │ +testJDK_OS=[name\:Linux,arch\:ppc64le,version\:6.12.113+deb13-powerpc64le-64k,family\:linux,simple_arch\:ppc64le,simple_version\:6.12,processors\:4,maxMemory\:16541548544,maxSwap\:25769738240] │ │ │ │ │ testJDK_os.arch=ppc64le │ │ │ │ │ testJDK_os.name=Linux │ │ │ │ │ -testJDK_os.version=6.12.111+deb13-powerpc64le │ │ │ │ │ -totalTime=223 │ │ │ │ │ +testJDK_os.version=6.12.113+deb13-powerpc64le-64k │ │ │ │ │ +totalTime=128 │ │ │ │ │ user.name=sbuild │ │ │ │ │ work=/tmp/jdk/JTwork/java/net/SocketOption │ │ │ │ │ │ │ │ │ │ #section:script_messages │ │ │ │ │ ----------messages:(7/472)---------- │ │ │ │ │ JDK under test: /build/reproducible-path/openjdk-21-21.0.13~8ea/build/bootcycle-build/images/jdk │ │ │ │ │ openjdk version "21.0.13-ea" 2026-10-20 │ │ │ │ │ OpenJDK Runtime Environment (build 21.0.13-ea+8-1-Debian) │ │ │ │ │ OpenJDK 64-Bit Server VM (build 21.0.13-ea+8-1-Debian, mixed mode, sharing) │ │ │ │ │ Library /test/lib; kind: packages │ │ │ │ │ source directory: /build/reproducible-path/openjdk-21-21.0.13~8ea/test/lib │ │ │ │ │ class directory: /tmp/jdk/JTwork/classes/java/net/SocketOption/OptionsTest.d/test/lib │ │ │ │ │ │ │ │ │ │ #section:build │ │ │ │ │ -----------messages:(5/179)---------- │ │ │ │ │ +----------messages:(5/181)---------- │ │ │ │ │ command: build OptionsTest │ │ │ │ │ reason: Named class compiled on demand │ │ │ │ │ -started: Thu Oct 08 23:01:48.335 UTC 2026 │ │ │ │ │ -finished: Thu Oct 08 23:01:48.335 UTC 2026 │ │ │ │ │ -elapsed time (seconds): 0.0 │ │ │ │ │ +started: Tue Oct 20 15:52:47.213 UTC 2026 │ │ │ │ │ +finished: Tue Oct 20 15:52:47.214 UTC 2026 │ │ │ │ │ +elapsed time (seconds): 0.001 │ │ │ │ │ result: Passed. All files up to date │ │ │ │ │ │ │ │ │ │ #section:main │ │ │ │ │ ----------messages:(7/281)---------- │ │ │ │ │ command: main -Xcheck:jni OptionsTest │ │ │ │ │ reason: User specified action: run main/othervm -Xcheck:jni OptionsTest │ │ │ │ │ -started: Thu Oct 08 23:01:48.335 UTC 2026 │ │ │ │ │ +started: Tue Oct 20 15:52:47.214 UTC 2026 │ │ │ │ │ Mode: othervm [/othervm specified] │ │ │ │ │ -Process id: 2763268 │ │ │ │ │ -finished: Thu Oct 08 23:01:48.552 UTC 2026 │ │ │ │ │ -elapsed time (seconds): 0.217 │ │ │ │ │ +Process id: 2782672 │ │ │ │ │ +finished: Tue Oct 20 15:52:47.339 UTC 2026 │ │ │ │ │ +elapsed time (seconds): 0.125 │ │ │ │ │ ----------configuration:(0/0)---------- │ │ │ │ │ ----------System.out:(7/201)---------- │ │ │ │ │ Testing SO_LINGER with:-1 │ │ │ │ │ Testing SO_LINGER with:-2 │ │ │ │ │ Testing SO_LINGER with:-100 │ │ │ │ │ Testing SO_LINGER with:-65534 │ │ │ │ │ Testing SO_LINGER with:-65535 │ │ │ │ ├── jtreg-test-output/jdk/JTwork/java/net/SocketPermission/SocketPermissionTest.jtr │ │ │ │ │ @@ -1,42 +1,42 @@ │ │ │ │ │ #Test Results (version 2) │ │ │ │ │ -#Thu Oct 08 23:01:52 UTC 2026 │ │ │ │ │ +#Tue Oct 20 15:52:49 UTC 2026 │ │ │ │ │ #-----testdescription----- │ │ │ │ │ $file=/build/reproducible-path/openjdk-21-21.0.13~8ea/test/jdk/java/net/SocketPermission/SocketPermissionTest.java │ │ │ │ │ $root=/build/reproducible-path/openjdk-21-21.0.13~8ea/test/jdk │ │ │ │ │ keywords=bug8047031 intermittent othervm testng │ │ │ │ │ library=/test/lib │ │ │ │ │ run=USER_SPECIFIED build jdk.test.lib.NetworkConfiguration jdk.test.lib.Platform\nUSER_SPECIFIED testng/othervm -Djava.security.manager\=allow SocketPermissionTest\n │ │ │ │ │ source=SocketPermissionTest.java │ │ │ │ │ title=SocketPermission tests for legacy socket types. │ │ │ │ │ │ │ │ │ │ #-----environment----- │ │ │ │ │ │ │ │ │ │ #-----testresult----- │ │ │ │ │ description=file\:/build/reproducible-path/openjdk-21-21.0.13~8ea/test/jdk/java/net/SocketPermission/SocketPermissionTest.java │ │ │ │ │ -elapsed=789 0\:00\:00.789 │ │ │ │ │ -end=Thu Oct 08 23\:01\:52 UTC 2026 │ │ │ │ │ +elapsed=488 0\:00\:00.488 │ │ │ │ │ +end=Tue Oct 20 15\:52\:49 UTC 2026 │ │ │ │ │ environment=regtest │ │ │ │ │ execStatus=Failed. Execution failed\: `main' threw exception\: java.lang.Exception\: config failures\: 0, test failures\: 2 │ │ │ │ │ harnessLoaderMode=Classpath Loader │ │ │ │ │ harnessVariety=Full Bundle │ │ │ │ │ hostname=sbuild │ │ │ │ │ -javatestOS=Linux 6.12.111+deb13-powerpc64le (ppc64le) │ │ │ │ │ +javatestOS=Linux 6.12.113+deb13-powerpc64le-64k (ppc64le) │ │ │ │ │ javatestVersion=6.0-ea+b26-2026-03-18-${BUILT_FROM_COMMIT} │ │ │ │ │ jtregVersion=jtreg 8.3 src 1 │ │ │ │ │ script=com.sun.javatest.regtest.exec.RegressionScript │ │ │ │ │ sections=script_messages build build testng │ │ │ │ │ -start=Thu Oct 08 23\:01\:51 UTC 2026 │ │ │ │ │ +start=Tue Oct 20 15\:52\:49 UTC 2026 │ │ │ │ │ test=java/net/SocketPermission/SocketPermissionTest.java │ │ │ │ │ testJDK=/build/reproducible-path/openjdk-21-21.0.13~8ea/build/bootcycle-build/images/jdk │ │ │ │ │ -testJDK_OS=[name\:Linux,arch\:ppc64le,version\:6.12.111+deb13-powerpc64le,family\:linux,simple_arch\:ppc64le,simple_version\:6.12,processors\:8,maxMemory\:33706758144,maxSwap\:182536105984] │ │ │ │ │ +testJDK_OS=[name\:Linux,arch\:ppc64le,version\:6.12.113+deb13-powerpc64le-64k,family\:linux,simple_arch\:ppc64le,simple_version\:6.12,processors\:4,maxMemory\:16541548544,maxSwap\:25769738240] │ │ │ │ │ testJDK_os.arch=ppc64le │ │ │ │ │ testJDK_os.name=Linux │ │ │ │ │ -testJDK_os.version=6.12.111+deb13-powerpc64le │ │ │ │ │ -totalTime=791 │ │ │ │ │ +testJDK_os.version=6.12.113+deb13-powerpc64le-64k │ │ │ │ │ +totalTime=490 │ │ │ │ │ user.name=sbuild │ │ │ │ │ work=/tmp/jdk/JTwork/java/net/SocketPermission │ │ │ │ │ │ │ │ │ │ #section:script_messages │ │ │ │ │ ----------messages:(7/485)---------- │ │ │ │ │ JDK under test: /build/reproducible-path/openjdk-21-21.0.13~8ea/build/bootcycle-build/images/jdk │ │ │ │ │ openjdk version "21.0.13-ea" 2026-10-20 │ │ │ │ │ @@ -46,47 +46,47 @@ │ │ │ │ │ source directory: /build/reproducible-path/openjdk-21-21.0.13~8ea/test/lib │ │ │ │ │ class directory: /tmp/jdk/JTwork/classes/java/net/SocketPermission/SocketPermissionTest.d/test/lib │ │ │ │ │ │ │ │ │ │ #section:build │ │ │ │ │ ----------messages:(5/284)---------- │ │ │ │ │ command: build jdk.test.lib.NetworkConfiguration jdk.test.lib.Platform │ │ │ │ │ reason: User specified action: run build jdk.test.lib.NetworkConfiguration jdk.test.lib.Platform │ │ │ │ │ -started: Thu Oct 08 23:01:51.643 UTC 2026 │ │ │ │ │ -finished: Thu Oct 08 23:01:51.644 UTC 2026 │ │ │ │ │ +started: Tue Oct 20 15:52:49.464 UTC 2026 │ │ │ │ │ +finished: Tue Oct 20 15:52:49.465 UTC 2026 │ │ │ │ │ elapsed time (seconds): 0.001 │ │ │ │ │ result: Passed. All files up to date │ │ │ │ │ │ │ │ │ │ #section:build │ │ │ │ │ ----------messages:(5/188)---------- │ │ │ │ │ command: build SocketPermissionTest │ │ │ │ │ reason: Named class compiled on demand │ │ │ │ │ -started: Thu Oct 08 23:01:51.644 UTC 2026 │ │ │ │ │ -finished: Thu Oct 08 23:01:51.644 UTC 2026 │ │ │ │ │ +started: Tue Oct 20 15:52:49.465 UTC 2026 │ │ │ │ │ +finished: Tue Oct 20 15:52:49.465 UTC 2026 │ │ │ │ │ elapsed time (seconds): 0.0 │ │ │ │ │ result: Passed. All files up to date │ │ │ │ │ │ │ │ │ │ #section:testng │ │ │ │ │ -----------messages:(7/338)---------- │ │ │ │ │ +----------messages:(7/339)---------- │ │ │ │ │ command: testng -Djava.security.manager=allow SocketPermissionTest │ │ │ │ │ reason: User specified action: run testng/othervm -Djava.security.manager=allow SocketPermissionTest │ │ │ │ │ -started: Thu Oct 08 23:01:51.644 UTC 2026 │ │ │ │ │ +started: Tue Oct 20 15:52:49.465 UTC 2026 │ │ │ │ │ Mode: othervm [/othervm specified] │ │ │ │ │ -Process id: 2763289 │ │ │ │ │ -finished: Thu Oct 08 23:01:52.424 UTC 2026 │ │ │ │ │ -elapsed time (seconds): 0.78 │ │ │ │ │ +Process id: 2782693 │ │ │ │ │ +finished: Tue Oct 20 15:52:49.948 UTC 2026 │ │ │ │ │ +elapsed time (seconds): 0.483 │ │ │ │ │ ----------configuration:(0/0)---------- │ │ │ │ │ -----------System.out:(97/6918)---------- │ │ │ │ │ -[23:01:52.194] config SocketPermissionTest.setupSecurityManager(): success [0ms] │ │ │ │ │ -[23:01:52.234] test SocketPermissionTest.acceptServerSocketTest(): success [30ms] │ │ │ │ │ -[23:01:52.236] config SocketPermissionTest.setupSecurityManager(): success [0ms] │ │ │ │ │ -[23:01:52.253] test SocketPermissionTest.connectDatagramSocketTest(): success [16ms] │ │ │ │ │ -[23:01:52.254] config SocketPermissionTest.setupSecurityManager(): success [0ms] │ │ │ │ │ -[23:01:52.257] test SocketPermissionTest.connectSocketTest(): success [1ms] │ │ │ │ │ -[23:01:52.258] config SocketPermissionTest.setupSecurityManager(): success [0ms] │ │ │ │ │ -[23:01:52.269] test SocketPermissionTest.joinGroupMulticastTest(): failure [12ms] │ │ │ │ │ +----------System.out:(97/6917)---------- │ │ │ │ │ +[15:52:49.796] config SocketPermissionTest.setupSecurityManager(): success [0ms] │ │ │ │ │ +[15:52:49.819] test SocketPermissionTest.acceptServerSocketTest(): success [18ms] │ │ │ │ │ +[15:52:49.820] config SocketPermissionTest.setupSecurityManager(): success [0ms] │ │ │ │ │ +[15:52:49.837] test SocketPermissionTest.connectDatagramSocketTest(): success [16ms] │ │ │ │ │ +[15:52:49.838] config SocketPermissionTest.setupSecurityManager(): success [0ms] │ │ │ │ │ +[15:52:49.840] test SocketPermissionTest.connectSocketTest(): success [1ms] │ │ │ │ │ +[15:52:49.841] config SocketPermissionTest.setupSecurityManager(): success [0ms] │ │ │ │ │ +[15:52:49.847] test SocketPermissionTest.joinGroupMulticastTest(): failure [7ms] │ │ │ │ │ java.util.NoSuchElementException: No value present │ │ │ │ │ at java.base/java.util.Optional.get(Optional.java:143) │ │ │ │ │ at SocketPermissionTest.joinGroupMulticastTest(SocketPermissionTest.java:227) │ │ │ │ │ at java.base/jdk.internal.reflect.DirectMethodHandleAccessor.invoke(DirectMethodHandleAccessor.java:103) │ │ │ │ │ at java.base/java.lang.reflect.Method.invoke(Method.java:580) │ │ │ │ │ at org.testng.internal.invokers.MethodInvocationHelper.invokeMethod(MethodInvocationHelper.java:136) │ │ │ │ │ at org.testng.internal.invokers.TestInvoker.invokeMethod(TestInvoker.java:658) │ │ │ │ │ @@ -111,22 +111,22 @@ │ │ │ │ │ at org.testng.TestNG.run(TestNG.java:1060) │ │ │ │ │ at com.sun.javatest.regtest.agent.TestNGRunner.main(TestNGRunner.java:109) │ │ │ │ │ at com.sun.javatest.regtest.agent.TestNGRunner.main(TestNGRunner.java:65) │ │ │ │ │ at java.base/jdk.internal.reflect.DirectMethodHandleAccessor.invoke(DirectMethodHandleAccessor.java:103) │ │ │ │ │ at java.base/java.lang.reflect.Method.invoke(Method.java:580) │ │ │ │ │ at com.sun.javatest.regtest.agent.MainWrapper$MainTask.run(MainWrapper.java:143) │ │ │ │ │ at java.base/java.lang.Thread.run(Thread.java:1583) │ │ │ │ │ -[23:01:52.274] config SocketPermissionTest.setupSecurityManager(): success [0ms] │ │ │ │ │ -[23:01:52.276] test SocketPermissionTest.listenDatagramSocketTest(): success [2ms] │ │ │ │ │ -[23:01:52.278] config SocketPermissionTest.setupSecurityManager(): success [0ms] │ │ │ │ │ -[23:01:52.280] test SocketPermissionTest.listenMulticastSocketTest(): success [1ms] │ │ │ │ │ -[23:01:52.282] config SocketPermissionTest.setupSecurityManager(): success [0ms] │ │ │ │ │ -[23:01:52.283] test SocketPermissionTest.listenServerSocketTest(): success [1ms] │ │ │ │ │ -[23:01:52.285] config SocketPermissionTest.setupSecurityManager(): success [0ms] │ │ │ │ │ -[23:01:52.287] test SocketPermissionTest.sendDatagramPacketTest(): failure [2ms] │ │ │ │ │ +[15:52:49.850] config SocketPermissionTest.setupSecurityManager(): success [0ms] │ │ │ │ │ +[15:52:49.852] test SocketPermissionTest.listenDatagramSocketTest(): success [1ms] │ │ │ │ │ +[15:52:49.852] config SocketPermissionTest.setupSecurityManager(): success [0ms] │ │ │ │ │ +[15:52:49.854] test SocketPermissionTest.listenMulticastSocketTest(): success [1ms] │ │ │ │ │ +[15:52:49.854] config SocketPermissionTest.setupSecurityManager(): success [0ms] │ │ │ │ │ +[15:52:49.856] test SocketPermissionTest.listenServerSocketTest(): success [0ms] │ │ │ │ │ +[15:52:49.856] config SocketPermissionTest.setupSecurityManager(): success [0ms] │ │ │ │ │ +[15:52:49.857] test SocketPermissionTest.sendDatagramPacketTest(): failure [1ms] │ │ │ │ │ java.security.PrivilegedActionException: java.net.SocketException: Network is unreachable │ │ │ │ │ at java.base/java.security.AccessController.doPrivileged(AccessController.java:718) │ │ │ │ │ at SocketPermissionTest.sendDatagramPacketTest(SocketPermissionTest.java:195) │ │ │ │ │ at java.base/jdk.internal.reflect.DirectMethodHandleAccessor.invoke(DirectMethodHandleAccessor.java:103) │ │ │ │ │ at java.base/java.lang.reflect.Method.invoke(Method.java:580) │ │ │ │ │ at org.testng.internal.invokers.MethodInvocationHelper.invokeMethod(MethodInvocationHelper.java:136) │ │ │ │ │ at org.testng.internal.invokers.TestInvoker.invokeMethod(TestInvoker.java:658) │ │ │ │ ├── jtreg-test-output/jdk/JTwork/sun/security/krb5/auto/Addresses.jtr │ │ │ │ │ @@ -1,44 +1,44 @@ │ │ │ │ │ #Test Results (version 2) │ │ │ │ │ -#Thu Oct 08 23:01:56 UTC 2026 │ │ │ │ │ +#Tue Oct 20 15:52:52 UTC 2026 │ │ │ │ │ #-----testdescription----- │ │ │ │ │ $file=/build/reproducible-path/openjdk-21-21.0.13~8ea/test/jdk/sun/security/krb5/auto/Addresses.java │ │ │ │ │ $root=/build/reproducible-path/openjdk-21-21.0.13~8ea/test/jdk │ │ │ │ │ keywords=bug8031111 bug8194486 othervm │ │ │ │ │ library=/test/lib │ │ │ │ │ modules=java.base/jdk.internal.misc java.base/sun.security.util java.security.jgss/sun.security.jgss java.security.jgss/sun.security.jgss.krb5 java.security.jgss/sun.security.krb5\:+open java.security.jgss/sun.security.krb5.internal\:+open java.security.jgss/sun.security.krb5.internal.ccache java.security.jgss/sun.security.krb5.internal.rcache java.security.jgss/sun.security.krb5.internal.crypto java.security.jgss/sun.security.krb5.internal.ktab jdk.security.auth jdk.security.jgss │ │ │ │ │ run=USER_SPECIFIED compile -XDignore.symbol.file Addresses.java\nUSER_SPECIFIED main jdk.test.lib.FileInstaller TestHosts TestHosts\nUSER_SPECIFIED main/othervm -Djdk.net.hosts.file\=TestHosts Addresses\n │ │ │ │ │ source=Addresses.java │ │ │ │ │ title=fix krb5 caddr │ │ │ │ │ │ │ │ │ │ #-----environment----- │ │ │ │ │ │ │ │ │ │ #-----testresult----- │ │ │ │ │ description=file\:/build/reproducible-path/openjdk-21-21.0.13~8ea/test/jdk/sun/security/krb5/auto/Addresses.java │ │ │ │ │ -elapsed=3474 0\:00\:03.474 │ │ │ │ │ -end=Thu Oct 08 23\:01\:56 UTC 2026 │ │ │ │ │ +elapsed=2465 0\:00\:02.465 │ │ │ │ │ +end=Tue Oct 20 15\:52\:52 UTC 2026 │ │ │ │ │ environment=regtest │ │ │ │ │ execStatus=Failed. Execution failed\: `main' threw exception\: java.lang.Exception │ │ │ │ │ harnessLoaderMode=Classpath Loader │ │ │ │ │ harnessVariety=Full Bundle │ │ │ │ │ hostname=sbuild │ │ │ │ │ -javatestOS=Linux 6.12.111+deb13-powerpc64le (ppc64le) │ │ │ │ │ +javatestOS=Linux 6.12.113+deb13-powerpc64le-64k (ppc64le) │ │ │ │ │ javatestVersion=6.0-ea+b26-2026-03-18-${BUILT_FROM_COMMIT} │ │ │ │ │ jtregVersion=jtreg 8.3 src 1 │ │ │ │ │ modules=java.base/jdk.internal.misc java.base/sun.security.util java.security.jgss/sun.security.jgss java.security.jgss/sun.security.jgss.krb5 java.security.jgss/sun.security.krb5\:+open java.security.jgss/sun.security.krb5.internal\:+open java.security.jgss/sun.security.krb5.internal.ccache java.security.jgss/sun.security.krb5.internal.rcache java.security.jgss/sun.security.krb5.internal.crypto java.security.jgss/sun.security.krb5.internal.ktab jdk.security.auth jdk.security.jgss │ │ │ │ │ script=com.sun.javatest.regtest.exec.RegressionScript │ │ │ │ │ sections=script_messages compile build main build main │ │ │ │ │ -start=Thu Oct 08 23\:01\:52 UTC 2026 │ │ │ │ │ +start=Tue Oct 20 15\:52\:50 UTC 2026 │ │ │ │ │ test=sun/security/krb5/auto/Addresses.java │ │ │ │ │ testJDK=/build/reproducible-path/openjdk-21-21.0.13~8ea/build/bootcycle-build/images/jdk │ │ │ │ │ -testJDK_OS=[name\:Linux,arch\:ppc64le,version\:6.12.111+deb13-powerpc64le,family\:linux,simple_arch\:ppc64le,simple_version\:6.12,processors\:8,maxMemory\:33706758144,maxSwap\:182536105984] │ │ │ │ │ +testJDK_OS=[name\:Linux,arch\:ppc64le,version\:6.12.113+deb13-powerpc64le-64k,family\:linux,simple_arch\:ppc64le,simple_version\:6.12,processors\:4,maxMemory\:16541548544,maxSwap\:25769738240] │ │ │ │ │ testJDK_os.arch=ppc64le │ │ │ │ │ testJDK_os.name=Linux │ │ │ │ │ -testJDK_os.version=6.12.111+deb13-powerpc64le │ │ │ │ │ -totalTime=3476 │ │ │ │ │ +testJDK_os.version=6.12.113+deb13-powerpc64le-64k │ │ │ │ │ +totalTime=2467 │ │ │ │ │ user.name=sbuild │ │ │ │ │ work=/tmp/jdk/JTwork/sun/security/krb5/auto │ │ │ │ │ │ │ │ │ │ #section:script_messages │ │ │ │ │ ----------messages:(7/471)---------- │ │ │ │ │ JDK under test: /build/reproducible-path/openjdk-21-21.0.13~8ea/build/bootcycle-build/images/jdk │ │ │ │ │ openjdk version "21.0.13-ea" 2026-10-20 │ │ │ │ │ @@ -48,21 +48,21 @@ │ │ │ │ │ source directory: /build/reproducible-path/openjdk-21-21.0.13~8ea/test/lib │ │ │ │ │ class directory: /tmp/jdk/JTwork/classes/sun/security/krb5/auto/Addresses.d/test/lib │ │ │ │ │ │ │ │ │ │ #section:compile │ │ │ │ │ ----------messages:(9/1177)---------- │ │ │ │ │ command: compile -XDignore.symbol.file /build/reproducible-path/openjdk-21-21.0.13~8ea/test/jdk/sun/security/krb5/auto/Addresses.java │ │ │ │ │ reason: User specified action: run compile -XDignore.symbol.file Addresses.java │ │ │ │ │ -started: Thu Oct 08 23:01:52.739 UTC 2026 │ │ │ │ │ +started: Tue Oct 20 15:52:50.308 UTC 2026 │ │ │ │ │ Additional options from @modules: --add-modules java.base,java.security.jgss,jdk.security.auth,jdk.security.jgss --add-exports java.base/jdk.internal.misc=ALL-UNNAMED --add-exports java.base/sun.security.util=ALL-UNNAMED --add-exports java.security.jgss/sun.security.jgss=ALL-UNNAMED --add-exports java.security.jgss/sun.security.jgss.krb5=ALL-UNNAMED --add-exports java.security.jgss/sun.security.krb5=ALL-UNNAMED --add-exports java.security.jgss/sun.security.krb5.internal=ALL-UNNAMED --add-exports java.security.jgss/sun.security.krb5.internal.ccache=ALL-UNNAMED --add-exports java.security.jgss/sun.security.krb5.internal.rcache=ALL-UNNAMED --add-exports java.security.jgss/sun.security.krb5.internal.crypto=ALL-UNNAMED --add-exports java.security.jgss/sun.security.krb5.internal.ktab=ALL-UNNAMED │ │ │ │ │ Mode: agentvm │ │ │ │ │ Agent id: 2 │ │ │ │ │ -Process id: 2763316 │ │ │ │ │ -finished: Thu Oct 08 23:01:54.037 UTC 2026 │ │ │ │ │ -elapsed time (seconds): 1.298 │ │ │ │ │ +Process id: 2782721 │ │ │ │ │ +finished: Tue Oct 20 15:52:51.085 UTC 2026 │ │ │ │ │ +elapsed time (seconds): 0.777 │ │ │ │ │ ----------configuration:(23/1529)---------- │ │ │ │ │ Boot Layer (javac runtime environment) │ │ │ │ │ class path: /usr/share/jtreg/lib/javatest.jar │ │ │ │ │ /usr/share/jtreg/lib/jtreg.jar │ │ │ │ │ patch: java.base /tmp/jdk/JTwork/patches/java.base │ │ │ │ │ │ │ │ │ │ javac compilation environment │ │ │ │ │ @@ -135,31 +135,31 @@ │ │ │ │ │ ----------stderr:(0/0)---------- │ │ │ │ │ result: Passed. Compilation successful │ │ │ │ │ │ │ │ │ │ #section:build │ │ │ │ │ ----------messages:(5/196)---------- │ │ │ │ │ command: build jdk.test.lib.FileInstaller │ │ │ │ │ reason: Named class compiled on demand │ │ │ │ │ -started: Thu Oct 08 23:01:54.038 UTC 2026 │ │ │ │ │ -finished: Thu Oct 08 23:01:54.039 UTC 2026 │ │ │ │ │ +started: Tue Oct 20 15:52:51.090 UTC 2026 │ │ │ │ │ +finished: Tue Oct 20 15:52:51.091 UTC 2026 │ │ │ │ │ elapsed time (seconds): 0.001 │ │ │ │ │ result: Passed. All files up to date │ │ │ │ │ │ │ │ │ │ #section:main │ │ │ │ │ -----------messages:(10/925)---------- │ │ │ │ │ +----------messages:(10/924)---------- │ │ │ │ │ command: main jdk.test.lib.FileInstaller TestHosts TestHosts │ │ │ │ │ reason: User specified action: run main jdk.test.lib.FileInstaller TestHosts TestHosts │ │ │ │ │ -started: Thu Oct 08 23:01:54.039 UTC 2026 │ │ │ │ │ +started: Tue Oct 20 15:52:51.091 UTC 2026 │ │ │ │ │ Mode: agentvm │ │ │ │ │ Agent id: 1 │ │ │ │ │ -Process id: 2763194 │ │ │ │ │ +Process id: 2782600 │ │ │ │ │ Additional exports to unnamed modules from @modules: java.base/jdk.internal.misc java.base/sun.security.util java.security.jgss/sun.security.jgss java.security.jgss/sun.security.jgss.krb5 java.security.jgss/sun.security.krb5 java.security.jgss/sun.security.krb5.internal java.security.jgss/sun.security.krb5.internal.ccache java.security.jgss/sun.security.krb5.internal.rcache java.security.jgss/sun.security.krb5.internal.crypto java.security.jgss/sun.security.krb5.internal.ktab │ │ │ │ │ Additional opens to unnamed modules from @modules: java.security.jgss/sun.security.krb5 java.security.jgss/sun.security.krb5.internal │ │ │ │ │ -finished: Thu Oct 08 23:01:54.111 UTC 2026 │ │ │ │ │ -elapsed time (seconds): 0.072 │ │ │ │ │ +finished: Tue Oct 20 15:52:51.151 UTC 2026 │ │ │ │ │ +elapsed time (seconds): 0.06 │ │ │ │ │ ----------configuration:(29/1786)---------- │ │ │ │ │ Boot Layer │ │ │ │ │ class path: /usr/share/jtreg/lib/javatest.jar │ │ │ │ │ /usr/share/jtreg/lib/jtreg.jar │ │ │ │ │ /usr/share/jtreg/lib/junit-platform-console-standalone.jar │ │ │ │ │ /usr/share/jtreg/lib/testng.jar │ │ │ │ │ /usr/share/jtreg/lib/guice.jar │ │ │ │ │ @@ -224,32 +224,32 @@ │ │ │ │ │ ----------System.err:(3/35)---------- │ │ │ │ │ │ │ │ │ │ JavaTest Message: Test complete. │ │ │ │ │ │ │ │ │ │ result: Passed. Execution successful │ │ │ │ │ │ │ │ │ │ #section:build │ │ │ │ │ -----------messages:(5/177)---------- │ │ │ │ │ +----------messages:(5/179)---------- │ │ │ │ │ command: build Addresses │ │ │ │ │ reason: Named class compiled on demand │ │ │ │ │ -started: Thu Oct 08 23:01:54.111 UTC 2026 │ │ │ │ │ -finished: Thu Oct 08 23:01:54.111 UTC 2026 │ │ │ │ │ -elapsed time (seconds): 0.0 │ │ │ │ │ +started: Tue Oct 20 15:52:51.151 UTC 2026 │ │ │ │ │ +finished: Tue Oct 20 15:52:51.152 UTC 2026 │ │ │ │ │ +elapsed time (seconds): 0.001 │ │ │ │ │ result: Passed. All files up to date │ │ │ │ │ │ │ │ │ │ #section:main │ │ │ │ │ ----------messages:(8/1247)---------- │ │ │ │ │ command: main -Djdk.net.hosts.file=TestHosts Addresses │ │ │ │ │ reason: User specified action: run main/othervm -Djdk.net.hosts.file=TestHosts Addresses │ │ │ │ │ -started: Thu Oct 08 23:01:54.112 UTC 2026 │ │ │ │ │ +started: Tue Oct 20 15:52:51.152 UTC 2026 │ │ │ │ │ Mode: othervm [/othervm specified] │ │ │ │ │ Additional options from @modules: --add-modules java.base,java.security.jgss,jdk.security.auth,jdk.security.jgss --add-exports java.base/jdk.internal.misc=ALL-UNNAMED --add-exports java.base/sun.security.util=ALL-UNNAMED --add-exports java.security.jgss/sun.security.jgss=ALL-UNNAMED --add-exports java.security.jgss/sun.security.jgss.krb5=ALL-UNNAMED --add-exports java.security.jgss/sun.security.krb5=ALL-UNNAMED --add-opens java.security.jgss/sun.security.krb5=ALL-UNNAMED --add-exports java.security.jgss/sun.security.krb5.internal=ALL-UNNAMED --add-opens java.security.jgss/sun.security.krb5.internal=ALL-UNNAMED --add-exports java.security.jgss/sun.security.krb5.internal.ccache=ALL-UNNAMED --add-exports java.security.jgss/sun.security.krb5.internal.rcache=ALL-UNNAMED --add-exports java.security.jgss/sun.security.krb5.internal.crypto=ALL-UNNAMED --add-exports java.security.jgss/sun.security.krb5.internal.ktab=ALL-UNNAMED │ │ │ │ │ -Process id: 2763346 │ │ │ │ │ -finished: Thu Oct 08 23:01:56.207 UTC 2026 │ │ │ │ │ -elapsed time (seconds): 2.095 │ │ │ │ │ +Process id: 2782747 │ │ │ │ │ +finished: Tue Oct 20 15:52:52.769 UTC 2026 │ │ │ │ │ +elapsed time (seconds): 1.617 │ │ │ │ │ ----------configuration:(15/1053)---------- │ │ │ │ │ Boot Layer │ │ │ │ │ add modules: java.base java.security.jgss jdk.security.auth jdk.security.jgss │ │ │ │ │ add exports: java.base/jdk.internal.misc ALL-UNNAMED │ │ │ │ │ java.base/sun.security.util ALL-UNNAMED │ │ │ │ │ java.security.jgss/sun.security.jgss ALL-UNNAMED │ │ │ │ │ java.security.jgss/sun.security.jgss.krb5 ALL-UNNAMED │ │ │ │ │ @@ -258,28 +258,28 @@ │ │ │ │ │ java.security.jgss/sun.security.krb5.internal.ccache ALL-UNNAMED │ │ │ │ │ java.security.jgss/sun.security.krb5.internal.crypto ALL-UNNAMED │ │ │ │ │ java.security.jgss/sun.security.krb5.internal.ktab ALL-UNNAMED │ │ │ │ │ java.security.jgss/sun.security.krb5.internal.rcache ALL-UNNAMED │ │ │ │ │ add opens: java.security.jgss/sun.security.krb5 ALL-UNNAMED │ │ │ │ │ java.security.jgss/sun.security.krb5.internal ALL-UNNAMED │ │ │ │ │ │ │ │ │ │ -----------System.out:(24/849)---------- │ │ │ │ │ -Start KDC on 9649 │ │ │ │ │ +----------System.out:(24/852)---------- │ │ │ │ │ +Start KDC on 13104 │ │ │ │ │ ----------------------------------------------- │ │ │ │ │ >>>>> UDP packet received │ │ │ │ │ -RABBIT.HOLE:9649> dummy@RABBIT.HOLE sends AS-REQ for krbtgt/RABBIT.HOLE@RABBIT.HOLE, KDCOptions: │ │ │ │ │ +RABBIT.HOLE:13104> dummy@RABBIT.HOLE sends AS-REQ for krbtgt/RABBIT.HOLE@RABBIT.HOLE, KDCOptions: │ │ │ │ │ KrbException: Additional pre-authentication required (25) │ │ │ │ │ at KDC.processAsReq(KDC.java:1335) │ │ │ │ │ at KDC.processMessage(KDC.java:809) │ │ │ │ │ at KDC$1.run(KDC.java:1565) │ │ │ │ │ Error 25 Additional pre-authentication required │ │ │ │ │ >>>>> UDP request honored │ │ │ │ │ ----------------------------------------------- │ │ │ │ │ >>>>> UDP packet received │ │ │ │ │ -RABBIT.HOLE:9649> dummy@RABBIT.HOLE sends AS-REQ for krbtgt/RABBIT.HOLE@RABBIT.HOLE, KDCOptions: │ │ │ │ │ +RABBIT.HOLE:13104> dummy@RABBIT.HOLE sends AS-REQ for krbtgt/RABBIT.HOLE@RABBIT.HOLE, KDCOptions: │ │ │ │ │ Return dummy@RABBIT.HOLE ticket for krbtgt/RABBIT.HOLE@RABBIT.HOLE, flags INITIAL;PRE-AUTHENT │ │ │ │ │ >>>>> UDP request honored │ │ │ │ │ /10.0.0.10 │ │ │ │ │ extra1 found │ │ │ │ │ /10.0.0.11 │ │ │ │ │ extra2 found │ │ │ │ │ /10.0.0.12 │ │ │ │ │ --- /dev/null │ │ │ │ ├── +++ jtreg-test-output/hotspot/JTwork/runtime/cds/appcds/dynamicArchive/TestAutoCreateSharedArchiveUpgrade.jtr │ │ │ │ │ @@ -0,0 +1,439 @@ │ │ │ │ │ +#Test Results (version 2) │ │ │ │ │ +#Tue Oct 20 11:17:35 UTC 2026 │ │ │ │ │ +#-----testdescription----- │ │ │ │ │ +$file=/build/reproducible-path/openjdk-21-21.0.13~8ea/test/hotspot/jtreg/runtime/cds/appcds/dynamicArchive/TestAutoCreateSharedArchiveUpgrade.java │ │ │ │ │ +$root=/build/reproducible-path/openjdk-21-21.0.13~8ea/test/hotspot/jtreg │ │ │ │ │ +keywords=driver │ │ │ │ │ +library=/test/lib │ │ │ │ │ +maxTimeout=600 │ │ │ │ │ +requires=vm.cds & vm.bits \=\= "64" │ │ │ │ │ +run=USER_SPECIFIED compile -source 1.8 -target 1.8 ../test-classes/HelloJDK8.java\nUSER_SPECIFIED driver jdk.test.lib.helpers.ClassFileInstaller -jar Hello.jar HelloJDK8\nUSER_SPECIFIED driver/timeout\=600 TestAutoCreateSharedArchiveUpgrade\n │ │ │ │ │ +source=TestAutoCreateSharedArchiveUpgrade.java │ │ │ │ │ +title=Check that -XX\:+AutoCreateSharedArchive automatically recreates an archive when you change the JDK version. │ │ │ │ │ + │ │ │ │ │ +#-----environment----- │ │ │ │ │ + │ │ │ │ │ +#-----testresult----- │ │ │ │ │ +description=file\:/build/reproducible-path/openjdk-21-21.0.13~8ea/test/hotspot/jtreg/runtime/cds/appcds/dynamicArchive/TestAutoCreateSharedArchiveUpgrade.java │ │ │ │ │ +elapsed=1312 0\:00\:01.312 │ │ │ │ │ +end=Tue Oct 20 11\:17\:35 UTC 2026 │ │ │ │ │ +environment=regtest │ │ │ │ │ +execStatus=Failed. Execution failed\: `main' threw exception\: java.lang.RuntimeException\: 'Dumping shared data to file' missing from stdout/stderr │ │ │ │ │ +harnessLoaderMode=Classpath Loader │ │ │ │ │ +harnessVariety=Full Bundle │ │ │ │ │ +hostname=sbuild │ │ │ │ │ +javatestOS=Linux 6.12.113+deb13-powerpc64le-64k (ppc64le) │ │ │ │ │ +javatestVersion=6.0-ea+b26-2026-03-18-${BUILT_FROM_COMMIT} │ │ │ │ │ +jtregVersion=jtreg 8.3 src 1 │ │ │ │ │ +script=com.sun.javatest.regtest.exec.RegressionScript │ │ │ │ │ +sections=script_messages compile build driver build driver │ │ │ │ │ +start=Tue Oct 20 11\:17\:34 UTC 2026 │ │ │ │ │ +test=runtime/cds/appcds/dynamicArchive/TestAutoCreateSharedArchiveUpgrade.java │ │ │ │ │ +testJDK=/build/reproducible-path/openjdk-21-21.0.13~8ea/build/bootcycle-build/images/jdk │ │ │ │ │ +testJDK_OS=[name\:Linux,arch\:ppc64le,version\:6.12.113+deb13-powerpc64le-64k,family\:linux,simple_arch\:ppc64le,simple_version\:6.12,processors\:4,maxMemory\:16541548544,maxSwap\:25769738240] │ │ │ │ │ +testJDK_os.arch=ppc64le │ │ │ │ │ +testJDK_os.name=Linux │ │ │ │ │ +testJDK_os.version=6.12.113+deb13-powerpc64le-64k │ │ │ │ │ +totalTime=1315 │ │ │ │ │ +user.name=sbuild │ │ │ │ │ +work=/tmp/hotspot/JTwork/runtime/cds/appcds/dynamicArchive │ │ │ │ │ + │ │ │ │ │ +#section:script_messages │ │ │ │ │ +----------messages:(7/511)---------- │ │ │ │ │ +JDK under test: /build/reproducible-path/openjdk-21-21.0.13~8ea/build/bootcycle-build/images/jdk │ │ │ │ │ +openjdk version "21.0.13-ea" 2026-10-20 │ │ │ │ │ +OpenJDK Runtime Environment (build 21.0.13-ea+8-1-Debian) │ │ │ │ │ +OpenJDK 64-Bit Server VM (build 21.0.13-ea+8-1-Debian, mixed mode, sharing) │ │ │ │ │ +Library /test/lib; kind: packages │ │ │ │ │ + source directory: /build/reproducible-path/openjdk-21-21.0.13~8ea/test/lib │ │ │ │ │ + class directory: /tmp/hotspot/JTwork/classes/runtime/cds/appcds/dynamicArchive/TestAutoCreateSharedArchiveUpgrade.d/test/lib │ │ │ │ │ + │ │ │ │ │ +#section:compile │ │ │ │ │ +----------messages:(8/433)---------- │ │ │ │ │ +command: compile -source 1.8 -target 1.8 /build/reproducible-path/openjdk-21-21.0.13~8ea/test/hotspot/jtreg/runtime/cds/appcds/dynamicArchive/../test-classes/HelloJDK8.java │ │ │ │ │ +reason: User specified action: run compile -source 1.8 -target 1.8 ../test-classes/HelloJDK8.java │ │ │ │ │ +started: Tue Oct 20 11:17:34.362 UTC 2026 │ │ │ │ │ +Mode: agentvm │ │ │ │ │ +Agent id: 1 │ │ │ │ │ +Process id: 2231667 │ │ │ │ │ +finished: Tue Oct 20 11:17:34.999 UTC 2026 │ │ │ │ │ +elapsed time (seconds): 0.637 │ │ │ │ │ +----------configuration:(12/769)---------- │ │ │ │ │ +Boot Layer (javac runtime environment) │ │ │ │ │ + class path: /usr/share/jtreg/lib/javatest.jar │ │ │ │ │ + /usr/share/jtreg/lib/jtreg.jar │ │ │ │ │ + patch: java.base /tmp/hotspot/JTwork/patches/java.base │ │ │ │ │ + │ │ │ │ │ +javac compilation environment │ │ │ │ │ + source path: /build/reproducible-path/openjdk-21-21.0.13~8ea/test/hotspot/jtreg/runtime/cds/appcds/dynamicArchive │ │ │ │ │ + /build/reproducible-path/openjdk-21-21.0.13~8ea/test/lib │ │ │ │ │ + class path: /build/reproducible-path/openjdk-21-21.0.13~8ea/test/hotspot/jtreg/runtime/cds/appcds/dynamicArchive │ │ │ │ │ + /tmp/hotspot/JTwork/classes/runtime/cds/appcds/dynamicArchive/TestAutoCreateSharedArchiveUpgrade.d │ │ │ │ │ + /tmp/hotspot/JTwork/classes/runtime/cds/appcds/dynamicArchive/TestAutoCreateSharedArchiveUpgrade.d/test/lib │ │ │ │ │ + │ │ │ │ │ +----------rerun:(34/3504)*---------- │ │ │ │ │ +cd /tmp/hotspot/JTwork/scratch && \\ │ │ │ │ │ +HOME=/sbuild-nonexistent \\ │ │ │ │ │ +JTREG_OPTIONS= \\ │ │ │ │ │ +LC_CTYPE=C.UTF-8 \\ │ │ │ │ │ +NSS_DEFAULT_DB_TYPE=sql \\ │ │ │ │ │ +PATH=/bin:/usr/bin:/usr/sbin \\ │ │ │ │ │ + /build/reproducible-path/openjdk-21-21.0.13~8ea/build/bootcycle-build/images/jdk/bin/javac \\ │ │ │ │ │ + -J-Dtest.boot.jdk=/usr/lib/jvm/java-21-openjdk-ppc64el \\ │ │ │ │ │ + -J-XX:MaxRAMPercentage=25 \\ │ │ │ │ │ + -J-Duser.home=/tmp/ \\ │ │ │ │ │ + -J-Djava.io.tmpdir=/tmp/ \\ │ │ │ │ │ + -J-Dtest.vm.opts='-Dtest.boot.jdk=/usr/lib/jvm/java-21-openjdk-ppc64el -XX:MaxRAMPercentage=25 -Duser.home=/tmp/ -Djava.io.tmpdir=/tmp/' \\ │ │ │ │ │ + -J-Dtest.tool.vm.opts='-J-Dtest.boot.jdk=/usr/lib/jvm/java-21-openjdk-ppc64el -J-XX:MaxRAMPercentage=25 -J-Duser.home=/tmp/ -J-Djava.io.tmpdir=/tmp/' \\ │ │ │ │ │ + -J-Dtest.compiler.opts= \\ │ │ │ │ │ + -J-Dtest.java.opts= \\ │ │ │ │ │ + -J-Dtest.jdk=/build/reproducible-path/openjdk-21-21.0.13~8ea/build/bootcycle-build/images/jdk \\ │ │ │ │ │ + -J-Dcompile.jdk=/build/reproducible-path/openjdk-21-21.0.13~8ea/build/bootcycle-build/images/jdk \\ │ │ │ │ │ + -J-Dtest.timeout.factor=10.0 \\ │ │ │ │ │ + -J-Dtest.nativepath=/build/reproducible-path/openjdk-21-21.0.13~8ea/build/images/test/hotspot/jtreg/native \\ │ │ │ │ │ + -J-Dtest.root=/build/reproducible-path/openjdk-21-21.0.13~8ea/test/hotspot/jtreg \\ │ │ │ │ │ + -J-Dtest.name=runtime/cds/appcds/dynamicArchive/TestAutoCreateSharedArchiveUpgrade.java \\ │ │ │ │ │ + -J-Dtest.verbose=Verbose[p=SUMMARY,f=SUMMARY,e=SUMMARY,t=false,m=false] \\ │ │ │ │ │ + -J-Dtest.file=/build/reproducible-path/openjdk-21-21.0.13~8ea/test/hotspot/jtreg/runtime/cds/appcds/dynamicArchive/TestAutoCreateSharedArchiveUpgrade.java \\ │ │ │ │ │ + -J-Dtest.main.class=TestAutoCreateSharedArchiveUpgrade \\ │ │ │ │ │ + -J-Dtest.src=/build/reproducible-path/openjdk-21-21.0.13~8ea/test/hotspot/jtreg/runtime/cds/appcds/dynamicArchive \\ │ │ │ │ │ + -J-Dtest.src.path=/build/reproducible-path/openjdk-21-21.0.13~8ea/test/hotspot/jtreg/runtime/cds/appcds/dynamicArchive:/build/reproducible-path/openjdk-21-21.0.13~8ea/test/lib \\ │ │ │ │ │ + -J-Dtest.classes=/tmp/hotspot/JTwork/classes/runtime/cds/appcds/dynamicArchive/TestAutoCreateSharedArchiveUpgrade.d \\ │ │ │ │ │ + -J-Dtest.class.path=/tmp/hotspot/JTwork/classes/runtime/cds/appcds/dynamicArchive/TestAutoCreateSharedArchiveUpgrade.d:/tmp/hotspot/JTwork/classes/runtime/cds/appcds/dynamicArchive/TestAutoCreateSharedArchiveUpgrade.d/test/lib \\ │ │ │ │ │ + -J-Dtest.class.path.prefix=/tmp/hotspot/JTwork/classes/runtime/cds/appcds/dynamicArchive/TestAutoCreateSharedArchiveUpgrade.d:/build/reproducible-path/openjdk-21-21.0.13~8ea/test/hotspot/jtreg/runtime/cds/appcds/dynamicArchive:/tmp/hotspot/JTwork/classes/runtime/cds/appcds/dynamicArchive/TestAutoCreateSharedArchiveUpgrade.d/test/lib \\ │ │ │ │ │ + -d /tmp/hotspot/JTwork/classes/runtime/cds/appcds/dynamicArchive/TestAutoCreateSharedArchiveUpgrade.d \\ │ │ │ │ │ + -sourcepath /build/reproducible-path/openjdk-21-21.0.13~8ea/test/hotspot/jtreg/runtime/cds/appcds/dynamicArchive:/build/reproducible-path/openjdk-21-21.0.13~8ea/test/lib \\ │ │ │ │ │ + -classpath /build/reproducible-path/openjdk-21-21.0.13~8ea/test/hotspot/jtreg/runtime/cds/appcds/dynamicArchive:/tmp/hotspot/JTwork/classes/runtime/cds/appcds/dynamicArchive/TestAutoCreateSharedArchiveUpgrade.d:/tmp/hotspot/JTwork/classes/runtime/cds/appcds/dynamicArchive/TestAutoCreateSharedArchiveUpgrade.d/test/lib \\ │ │ │ │ │ + -source 1.8 \\ │ │ │ │ │ + -target 1.8 /build/reproducible-path/openjdk-21-21.0.13~8ea/test/hotspot/jtreg/runtime/cds/appcds/dynamicArchive/../test-classes/HelloJDK8.java │ │ │ │ │ +----------stdout:(0/0)---------- │ │ │ │ │ +----------stderr:(0/0)---------- │ │ │ │ │ +----------direct:(5/346)---------- │ │ │ │ │ +warning: [options] bootstrap class path not set in conjunction with -source 8 │ │ │ │ │ +warning: [options] source value 8 is obsolete and will be removed in a future release │ │ │ │ │ +warning: [options] target value 8 is obsolete and will be removed in a future release │ │ │ │ │ +warning: [options] To suppress warnings about obsolete options, use -Xlint:-options. │ │ │ │ │ +4 warnings │ │ │ │ │ +result: Passed. Compilation successful │ │ │ │ │ + │ │ │ │ │ +#section:build │ │ │ │ │ +----------messages:(5/209)---------- │ │ │ │ │ +command: build jdk.test.lib.helpers.ClassFileInstaller │ │ │ │ │ +reason: Named class compiled on demand │ │ │ │ │ +started: Tue Oct 20 11:17:35.000 UTC 2026 │ │ │ │ │ +finished: Tue Oct 20 11:17:35.001 UTC 2026 │ │ │ │ │ +elapsed time (seconds): 0.001 │ │ │ │ │ +result: Passed. All files up to date │ │ │ │ │ + │ │ │ │ │ +#section:driver │ │ │ │ │ +----------messages:(8/350)---------- │ │ │ │ │ +command: driver jdk.test.lib.helpers.ClassFileInstaller -jar Hello.jar HelloJDK8 │ │ │ │ │ +reason: User specified action: run driver jdk.test.lib.helpers.ClassFileInstaller -jar Hello.jar HelloJDK8 │ │ │ │ │ +started: Tue Oct 20 11:17:35.001 UTC 2026 │ │ │ │ │ +Mode: agentvm │ │ │ │ │ +Agent id: 2 │ │ │ │ │ +Process id: 2231693 │ │ │ │ │ +finished: Tue Oct 20 11:17:35.314 UTC 2026 │ │ │ │ │ +elapsed time (seconds): 0.313 │ │ │ │ │ +----------configuration:(17/923)---------- │ │ │ │ │ +Boot Layer │ │ │ │ │ + class path: /usr/share/jtreg/lib/javatest.jar │ │ │ │ │ + /usr/share/jtreg/lib/jtreg.jar │ │ │ │ │ + /usr/share/jtreg/lib/junit-platform-console-standalone.jar │ │ │ │ │ + /usr/share/jtreg/lib/testng.jar │ │ │ │ │ + /usr/share/jtreg/lib/guice.jar │ │ │ │ │ + /usr/share/jtreg/lib/jcommander.jar │ │ │ │ │ + /usr/share/jtreg/lib/slf4j-simple.jar │ │ │ │ │ + /usr/share/jtreg/lib/slf4j-api.jar │ │ │ │ │ + patch: java.base /tmp/hotspot/JTwork/patches/java.base │ │ │ │ │ + │ │ │ │ │ +Test Layer │ │ │ │ │ + class path: /tmp/hotspot/JTwork/classes/runtime/cds/appcds/dynamicArchive/TestAutoCreateSharedArchiveUpgrade.d │ │ │ │ │ + /build/reproducible-path/openjdk-21-21.0.13~8ea/test/hotspot/jtreg/runtime/cds/appcds/dynamicArchive │ │ │ │ │ + /tmp/hotspot/JTwork/classes/runtime/cds/appcds/dynamicArchive/TestAutoCreateSharedArchiveUpgrade.d/test/lib │ │ │ │ │ + /build/reproducible-path/openjdk-21-21.0.13~8ea/test/lib │ │ │ │ │ + │ │ │ │ │ +----------rerun:(27/3023)*---------- │ │ │ │ │ +cd /tmp/hotspot/JTwork/scratch && \\ │ │ │ │ │ +HOME=/sbuild-nonexistent \\ │ │ │ │ │ +JTREG_OPTIONS= \\ │ │ │ │ │ +LC_CTYPE=C.UTF-8 \\ │ │ │ │ │ +NSS_DEFAULT_DB_TYPE=sql \\ │ │ │ │ │ +PATH=/bin:/usr/bin:/usr/sbin \\ │ │ │ │ │ + /build/reproducible-path/openjdk-21-21.0.13~8ea/build/bootcycle-build/images/jdk/bin/java \\ │ │ │ │ │ + -Dtest.vm.opts='-Dtest.boot.jdk=/usr/lib/jvm/java-21-openjdk-ppc64el -XX:MaxRAMPercentage=25 -Duser.home=/tmp/ -Djava.io.tmpdir=/tmp/' \\ │ │ │ │ │ + -Dtest.tool.vm.opts='-J-Dtest.boot.jdk=/usr/lib/jvm/java-21-openjdk-ppc64el -J-XX:MaxRAMPercentage=25 -J-Duser.home=/tmp/ -J-Djava.io.tmpdir=/tmp/' \\ │ │ │ │ │ + -Dtest.compiler.opts= \\ │ │ │ │ │ + -Dtest.java.opts= \\ │ │ │ │ │ + -Dtest.jdk=/build/reproducible-path/openjdk-21-21.0.13~8ea/build/bootcycle-build/images/jdk \\ │ │ │ │ │ + -Dcompile.jdk=/build/reproducible-path/openjdk-21-21.0.13~8ea/build/bootcycle-build/images/jdk \\ │ │ │ │ │ + -Dtest.timeout.factor=10.0 \\ │ │ │ │ │ + -Dtest.nativepath=/build/reproducible-path/openjdk-21-21.0.13~8ea/build/images/test/hotspot/jtreg/native \\ │ │ │ │ │ + -Dtest.root=/build/reproducible-path/openjdk-21-21.0.13~8ea/test/hotspot/jtreg \\ │ │ │ │ │ + -Dtest.name=runtime/cds/appcds/dynamicArchive/TestAutoCreateSharedArchiveUpgrade.java \\ │ │ │ │ │ + -Dtest.verbose=Verbose[p=SUMMARY,f=SUMMARY,e=SUMMARY,t=false,m=false] \\ │ │ │ │ │ + -Dtest.file=/build/reproducible-path/openjdk-21-21.0.13~8ea/test/hotspot/jtreg/runtime/cds/appcds/dynamicArchive/TestAutoCreateSharedArchiveUpgrade.java \\ │ │ │ │ │ + -Dtest.main.class=TestAutoCreateSharedArchiveUpgrade \\ │ │ │ │ │ + -Dtest.src=/build/reproducible-path/openjdk-21-21.0.13~8ea/test/hotspot/jtreg/runtime/cds/appcds/dynamicArchive \\ │ │ │ │ │ + -Dtest.src.path=/build/reproducible-path/openjdk-21-21.0.13~8ea/test/hotspot/jtreg/runtime/cds/appcds/dynamicArchive:/build/reproducible-path/openjdk-21-21.0.13~8ea/test/lib \\ │ │ │ │ │ + -Dtest.classes=/tmp/hotspot/JTwork/classes/runtime/cds/appcds/dynamicArchive/TestAutoCreateSharedArchiveUpgrade.d \\ │ │ │ │ │ + -Dtest.class.path=/tmp/hotspot/JTwork/classes/runtime/cds/appcds/dynamicArchive/TestAutoCreateSharedArchiveUpgrade.d:/tmp/hotspot/JTwork/classes/runtime/cds/appcds/dynamicArchive/TestAutoCreateSharedArchiveUpgrade.d/test/lib \\ │ │ │ │ │ + -Dtest.class.path.prefix=/tmp/hotspot/JTwork/classes/runtime/cds/appcds/dynamicArchive/TestAutoCreateSharedArchiveUpgrade.d:/build/reproducible-path/openjdk-21-21.0.13~8ea/test/hotspot/jtreg/runtime/cds/appcds/dynamicArchive:/tmp/hotspot/JTwork/classes/runtime/cds/appcds/dynamicArchive/TestAutoCreateSharedArchiveUpgrade.d/test/lib \\ │ │ │ │ │ + -classpath /tmp/hotspot/JTwork/classes/runtime/cds/appcds/dynamicArchive/TestAutoCreateSharedArchiveUpgrade.d:/build/reproducible-path/openjdk-21-21.0.13~8ea/test/hotspot/jtreg/runtime/cds/appcds/dynamicArchive:/tmp/hotspot/JTwork/classes/runtime/cds/appcds/dynamicArchive/TestAutoCreateSharedArchiveUpgrade.d/test/lib:/build/reproducible-path/openjdk-21-21.0.13~8ea/test/lib:/usr/share/jtreg/lib/javatest.jar:/usr/share/jtreg/lib/jtreg.jar \\ │ │ │ │ │ + jdk.test.lib.helpers.ClassFileInstaller -jar Hello.jar HelloJDK8 │ │ │ │ │ +----------stdout:(0/0)---------- │ │ │ │ │ +----------stderr:(0/0)---------- │ │ │ │ │ +----------System.err:(3/35)---------- │ │ │ │ │ + │ │ │ │ │ +JavaTest Message: Test complete. │ │ │ │ │ + │ │ │ │ │ +result: Passed. Execution successful │ │ │ │ │ + │ │ │ │ │ +#section:build │ │ │ │ │ +----------messages:(5/202)---------- │ │ │ │ │ +command: build TestAutoCreateSharedArchiveUpgrade │ │ │ │ │ +reason: Named class compiled on demand │ │ │ │ │ +started: Tue Oct 20 11:17:35.315 UTC 2026 │ │ │ │ │ +finished: Tue Oct 20 11:17:35.315 UTC 2026 │ │ │ │ │ +elapsed time (seconds): 0.0 │ │ │ │ │ +result: Passed. All files up to date │ │ │ │ │ + │ │ │ │ │ +#section:driver │ │ │ │ │ +----------messages:(8/300)---------- │ │ │ │ │ +command: driver TestAutoCreateSharedArchiveUpgrade │ │ │ │ │ +reason: User specified action: run driver/timeout=600 TestAutoCreateSharedArchiveUpgrade │ │ │ │ │ +started: Tue Oct 20 11:17:35.315 UTC 2026 │ │ │ │ │ +Mode: agentvm │ │ │ │ │ +Agent id: 2 │ │ │ │ │ +Process id: 2231693 │ │ │ │ │ +finished: Tue Oct 20 11:17:35.615 UTC 2026 │ │ │ │ │ +elapsed time (seconds): 0.3 │ │ │ │ │ +----------configuration:(17/923)---------- │ │ │ │ │ +Boot Layer │ │ │ │ │ + class path: /usr/share/jtreg/lib/javatest.jar │ │ │ │ │ + /usr/share/jtreg/lib/jtreg.jar │ │ │ │ │ + /usr/share/jtreg/lib/junit-platform-console-standalone.jar │ │ │ │ │ + /usr/share/jtreg/lib/testng.jar │ │ │ │ │ + /usr/share/jtreg/lib/guice.jar │ │ │ │ │ + /usr/share/jtreg/lib/jcommander.jar │ │ │ │ │ + /usr/share/jtreg/lib/slf4j-simple.jar │ │ │ │ │ + /usr/share/jtreg/lib/slf4j-api.jar │ │ │ │ │ + patch: java.base /tmp/hotspot/JTwork/patches/java.base │ │ │ │ │ + │ │ │ │ │ +Test Layer │ │ │ │ │ + class path: /tmp/hotspot/JTwork/classes/runtime/cds/appcds/dynamicArchive/TestAutoCreateSharedArchiveUpgrade.d │ │ │ │ │ + /build/reproducible-path/openjdk-21-21.0.13~8ea/test/hotspot/jtreg/runtime/cds/appcds/dynamicArchive │ │ │ │ │ + /tmp/hotspot/JTwork/classes/runtime/cds/appcds/dynamicArchive/TestAutoCreateSharedArchiveUpgrade.d/test/lib │ │ │ │ │ + /build/reproducible-path/openjdk-21-21.0.13~8ea/test/lib │ │ │ │ │ + │ │ │ │ │ +----------rerun:(27/2993)*---------- │ │ │ │ │ +cd /tmp/hotspot/JTwork/scratch && \\ │ │ │ │ │ +HOME=/sbuild-nonexistent \\ │ │ │ │ │ +JTREG_OPTIONS= \\ │ │ │ │ │ +LC_CTYPE=C.UTF-8 \\ │ │ │ │ │ +NSS_DEFAULT_DB_TYPE=sql \\ │ │ │ │ │ +PATH=/bin:/usr/bin:/usr/sbin \\ │ │ │ │ │ + /build/reproducible-path/openjdk-21-21.0.13~8ea/build/bootcycle-build/images/jdk/bin/java \\ │ │ │ │ │ + -Dtest.vm.opts='-Dtest.boot.jdk=/usr/lib/jvm/java-21-openjdk-ppc64el -XX:MaxRAMPercentage=25 -Duser.home=/tmp/ -Djava.io.tmpdir=/tmp/' \\ │ │ │ │ │ + -Dtest.tool.vm.opts='-J-Dtest.boot.jdk=/usr/lib/jvm/java-21-openjdk-ppc64el -J-XX:MaxRAMPercentage=25 -J-Duser.home=/tmp/ -J-Djava.io.tmpdir=/tmp/' \\ │ │ │ │ │ + -Dtest.compiler.opts= \\ │ │ │ │ │ + -Dtest.java.opts= \\ │ │ │ │ │ + -Dtest.jdk=/build/reproducible-path/openjdk-21-21.0.13~8ea/build/bootcycle-build/images/jdk \\ │ │ │ │ │ + -Dcompile.jdk=/build/reproducible-path/openjdk-21-21.0.13~8ea/build/bootcycle-build/images/jdk \\ │ │ │ │ │ + -Dtest.timeout.factor=10.0 \\ │ │ │ │ │ + -Dtest.nativepath=/build/reproducible-path/openjdk-21-21.0.13~8ea/build/images/test/hotspot/jtreg/native \\ │ │ │ │ │ + -Dtest.root=/build/reproducible-path/openjdk-21-21.0.13~8ea/test/hotspot/jtreg \\ │ │ │ │ │ + -Dtest.name=runtime/cds/appcds/dynamicArchive/TestAutoCreateSharedArchiveUpgrade.java \\ │ │ │ │ │ + -Dtest.verbose=Verbose[p=SUMMARY,f=SUMMARY,e=SUMMARY,t=false,m=false] \\ │ │ │ │ │ + -Dtest.file=/build/reproducible-path/openjdk-21-21.0.13~8ea/test/hotspot/jtreg/runtime/cds/appcds/dynamicArchive/TestAutoCreateSharedArchiveUpgrade.java \\ │ │ │ │ │ + -Dtest.main.class=TestAutoCreateSharedArchiveUpgrade \\ │ │ │ │ │ + -Dtest.src=/build/reproducible-path/openjdk-21-21.0.13~8ea/test/hotspot/jtreg/runtime/cds/appcds/dynamicArchive \\ │ │ │ │ │ + -Dtest.src.path=/build/reproducible-path/openjdk-21-21.0.13~8ea/test/hotspot/jtreg/runtime/cds/appcds/dynamicArchive:/build/reproducible-path/openjdk-21-21.0.13~8ea/test/lib \\ │ │ │ │ │ + -Dtest.classes=/tmp/hotspot/JTwork/classes/runtime/cds/appcds/dynamicArchive/TestAutoCreateSharedArchiveUpgrade.d \\ │ │ │ │ │ + -Dtest.class.path=/tmp/hotspot/JTwork/classes/runtime/cds/appcds/dynamicArchive/TestAutoCreateSharedArchiveUpgrade.d:/tmp/hotspot/JTwork/classes/runtime/cds/appcds/dynamicArchive/TestAutoCreateSharedArchiveUpgrade.d/test/lib \\ │ │ │ │ │ + -Dtest.class.path.prefix=/tmp/hotspot/JTwork/classes/runtime/cds/appcds/dynamicArchive/TestAutoCreateSharedArchiveUpgrade.d:/build/reproducible-path/openjdk-21-21.0.13~8ea/test/hotspot/jtreg/runtime/cds/appcds/dynamicArchive:/tmp/hotspot/JTwork/classes/runtime/cds/appcds/dynamicArchive/TestAutoCreateSharedArchiveUpgrade.d/test/lib \\ │ │ │ │ │ + -classpath /tmp/hotspot/JTwork/classes/runtime/cds/appcds/dynamicArchive/TestAutoCreateSharedArchiveUpgrade.d:/build/reproducible-path/openjdk-21-21.0.13~8ea/test/hotspot/jtreg/runtime/cds/appcds/dynamicArchive:/tmp/hotspot/JTwork/classes/runtime/cds/appcds/dynamicArchive/TestAutoCreateSharedArchiveUpgrade.d/test/lib:/build/reproducible-path/openjdk-21-21.0.13~8ea/test/lib:/usr/share/jtreg/lib/javatest.jar:/usr/share/jtreg/lib/jtreg.jar \\ │ │ │ │ │ + TestAutoCreateSharedArchiveUpgrade │ │ │ │ │ +----------stdout:(0/0)---------- │ │ │ │ │ +----------stderr:(0/0)---------- │ │ │ │ │ +----------System.out:(140/11759)---------- │ │ │ │ │ +JDK_VERSIONS not specified │ │ │ │ │ +Using newJVM = /build/reproducible-path/openjdk-21-21.0.13~8ea/build/bootcycle-build/images/jdk/bin/java │ │ │ │ │ +Using oldJVM = /usr/lib/jvm/java-21-openjdk-ppc64el/bin/java │ │ │ │ │ +Command line: [/build/reproducible-path/openjdk-21-21.0.13~8ea/build/bootcycle-build/images/jdk/bin/java -XX:+AutoCreateSharedArchive -XX:SharedArchiveFile=/tmp/hotspot/JTwork/scratch/Hello.jsa -Xlog:cds -cp /tmp/hotspot/JTwork/scratch/Hello.jar HelloJDK8] │ │ │ │ │ +[2026-10-20T11:17:35.355663770Z] Gathering output for process 2231718 │ │ │ │ │ +[2026-10-20T11:17:35.369011677Z] Waiting for completion for process 2231718 │ │ │ │ │ +[2026-10-20T11:17:35.502328617Z] Waiting for completion finished for process 2231718 │ │ │ │ │ +Output and diagnostic info for process 2231718 was saved into 'pid-2231718-output.log' │ │ │ │ │ +[0.001s][info][cds] Specified shared archive not found (/tmp/hotspot/JTwork/scratch/Hello.jsa) │ │ │ │ │ +[0.005s][info][cds] trying to map /build/reproducible-path/openjdk-21-21.0.13~8ea/build/bootcycle-build/images/jdk/lib/server/classes.jsa │ │ │ │ │ +[0.005s][info][cds] Opened archive /build/reproducible-path/openjdk-21-21.0.13~8ea/build/bootcycle-build/images/jdk/lib/server/classes.jsa. │ │ │ │ │ +[0.005s][info][cds] Archive was created with UseCompressedOops = 1, UseCompressedClassPointers = 1 │ │ │ │ │ +[0.005s][info][cds] Core region alignment: 65536 │ │ │ │ │ +[0.005s][info][cds] ArchiveRelocationMode == 1: always map archive(s) at an alternative address │ │ │ │ │ +[0.005s][info][cds] Try to map archive(s) at an alternative address │ │ │ │ │ +[0.005s][info][cds] Reserved archive_space_rs [0x0000000500000000 - 0x0000000501000000] (16777216) bytes │ │ │ │ │ +[0.005s][info][cds] Reserved class_space_rs [0x0000000501000000 - 0x0000000541000000] (1073741824) bytes │ │ │ │ │ +[0.005s][info][cds] Mapped static region #0 at base 0x0000000500000000 top 0x0000000500490000 (ReadWrite) │ │ │ │ │ +[0.005s][info][cds] Mapped static region #1 at base 0x0000000500490000 top 0x0000000500cb0000 (ReadOnly) │ │ │ │ │ +[0.006s][info][cds] Mapped static region #2 at base 0x00007fff94010000 top 0x00007fff94050000 (Bitmap) │ │ │ │ │ +[0.011s][info][cds] CDS archive was created with max heap size = 128M, and the following configuration: │ │ │ │ │ +[0.012s][info][cds] narrow_klass_base = 0x0000000500000000, narrow_klass_shift = 0 │ │ │ │ │ +[0.012s][info][cds] narrow_oop_mode = 0, narrow_oop_base = 0x0000000000000000, narrow_oop_shift = 0 │ │ │ │ │ +[0.012s][info][cds] heap range = [0x00000000f8000000 - 0x0000000100000000] │ │ │ │ │ +[0.012s][info][cds] The current max heap size = 3968M, HeapRegion::GrainBytes = 2097152 │ │ │ │ │ +[0.012s][info][cds] narrow_klass_base = 0x0000000500000000, narrow_klass_shift = 0 │ │ │ │ │ +[0.012s][info][cds] narrow_oop_mode = 1, narrow_oop_base = 0x0000000000000000, narrow_oop_shift = 3 │ │ │ │ │ +[0.012s][info][cds] heap range = [0x0000000708000000 - 0x0000000800000000] │ │ │ │ │ +[0.012s][info][cds] Requested heap region [0x00000000ffe00000 - 0x00000000fff0c210] = 1098256 bytes │ │ │ │ │ +[0.012s][info][cds] CDS heap data needs to be relocated because the archive was created with an incompatible oop encoding mode. │ │ │ │ │ +[0.012s][info][cds] CDS heap data relocation delta = 30064771072 bytes │ │ │ │ │ +[0.012s][info][cds] Trying to map heap data at 0x00000007ffe00000, size = 1098256 bytes │ │ │ │ │ +[0.012s][info][cds] optimized module handling: enabled │ │ │ │ │ +[0.012s][info][cds] full module graph: enabled │ │ │ │ │ +[0.012s][info][cds] use_full_module_graph = true; java.base = 0x000000050047c4b8 │ │ │ │ │ +[0.012s][info][cds] patching heap embedded pointers: narrowOop 0xffe00000 -> 0xfffc0000 │ │ │ │ │ +[0.012s][info][cds] CDS heap data quick relocation not possible │ │ │ │ │ +[0.012s][info][cds] Unmapping region #2 at base 0x00007fff94010000 (Bitmap) │ │ │ │ │ +This class is compiled by JDK 8 │ │ │ │ │ +[0.035s][info][cds] Regenerate MethodHandle Holder classes... │ │ │ │ │ +[0.136s][info][cds] Regenerate MethodHandle Holder classes...done │ │ │ │ │ +[0.139s][info][cds] Gathering all archivable objects ... │ │ │ │ │ +[0.139s][info][cds] Gathering classes and symbols ... │ │ │ │ │ +[0.140s][info][cds] _estimated_hashtable_bytes = 1944 + 624 = 2568 │ │ │ │ │ +[0.140s][info][cds] _estimated_metaspaceobj_bytes = 119392 │ │ │ │ │ +[0.140s][info][cds] total estimate bytes = 253032 │ │ │ │ │ +[0.140s][info][cds] Reserved output buffer space at 0x00007fff706c0000 [262144 bytes] │ │ │ │ │ +[0.140s][info][cds] Allocating RW objects ... │ │ │ │ │ +[0.140s][info][cds] done (465 objects) │ │ │ │ │ +[0.140s][info][cds] Allocating RO objects ... │ │ │ │ │ +[0.140s][info][cds] done (887 objects) │ │ │ │ │ +[0.140s][info][cds] Relocating embedded pointers in core regions ... │ │ │ │ │ +[0.141s][info][cds] MetaspaceObjs estimate = 119392 used = 119392; diff = 0 bytes │ │ │ │ │ +[0.141s][info][cds] Hashtables estimate = 2568 used = 880; diff = 1688 bytes │ │ │ │ │ +[0.141s][info][cds] Make classes shareable │ │ │ │ │ +[0.141s][info][cds] Number of classes 9 │ │ │ │ │ +[0.141s][info][cds] instance classes = 9 │ │ │ │ │ +[0.141s][info][cds] boot = 8 │ │ │ │ │ +[0.141s][info][cds] app = 1 │ │ │ │ │ +[0.141s][info][cds] platform = 0 │ │ │ │ │ +[0.141s][info][cds] unregistered = 0 │ │ │ │ │ +[0.141s][info][cds] (hidden) = 3 │ │ │ │ │ +[0.141s][info][cds] (unlinked) = 0 │ │ │ │ │ +[0.141s][info][cds] obj array classes = 0 │ │ │ │ │ +[0.141s][info][cds] type array classes = 0 │ │ │ │ │ +[0.141s][info][cds] symbols = 12 │ │ │ │ │ +[0.141s][info][cds] Adjust lambda proxy class dictionary │ │ │ │ │ +[0.141s][info][cds] Dumping shared data to file: │ │ │ │ │ +[0.141s][info][cds] /tmp/hotspot/JTwork/scratch/Hello.jsa │ │ │ │ │ +[0.141s][info][cds] Shared file region (rw) 0: 53728 bytes, addr 0x0000000800cb0000 file offset 0x00010000 crc 0x1a28a27c │ │ │ │ │ +[0.141s][info][cds] Shared file region (ro) 1: 66544 bytes, addr 0x0000000800cc0000 file offset 0x00020000 crc 0x268515c9 │ │ │ │ │ +[0.141s][info][cds] Shared file region (bm) 2: 2064 bytes, addr 0x0000000000000000 file offset 0x00040000 crc 0x47201e09 │ │ │ │ │ + │ │ │ │ │ +Command line: [/build/reproducible-path/openjdk-21-21.0.13~8ea/build/bootcycle-build/images/jdk/bin/java -XX:+AutoCreateSharedArchive -XX:SharedArchiveFile=/tmp/hotspot/JTwork/scratch/Hello.jsa -Xlog:cds -cp /tmp/hotspot/JTwork/scratch/Hello.jar HelloJDK8] │ │ │ │ │ +[2026-10-20T11:17:35.511080624Z] Gathering output for process 2231739 │ │ │ │ │ +[2026-10-20T11:17:35.511786407Z] Waiting for completion for process 2231739 │ │ │ │ │ +[2026-10-20T11:17:35.537521451Z] Waiting for completion finished for process 2231739 │ │ │ │ │ +Output and diagnostic info for process 2231739 was saved into 'pid-2231739-output.log' │ │ │ │ │ +[0.004s][info][cds] trying to map /build/reproducible-path/openjdk-21-21.0.13~8ea/build/bootcycle-build/images/jdk/lib/server/classes.jsa │ │ │ │ │ +[0.004s][info][cds] Opened archive /build/reproducible-path/openjdk-21-21.0.13~8ea/build/bootcycle-build/images/jdk/lib/server/classes.jsa. │ │ │ │ │ +[0.004s][info][cds] Archive was created with UseCompressedOops = 1, UseCompressedClassPointers = 1 │ │ │ │ │ +[0.004s][info][cds] Core region alignment: 65536 │ │ │ │ │ +[0.004s][info][cds] trying to map /tmp/hotspot/JTwork/scratch/Hello.jsa │ │ │ │ │ +[0.004s][info][cds] Opened archive /tmp/hotspot/JTwork/scratch/Hello.jsa. │ │ │ │ │ +[0.004s][info][cds] Archive was created with UseCompressedOops = 1, UseCompressedClassPointers = 1 │ │ │ │ │ +[0.004s][info][cds] ArchiveRelocationMode == 1: always map archive(s) at an alternative address │ │ │ │ │ +[0.004s][info][cds] Try to map archive(s) at an alternative address │ │ │ │ │ +[0.004s][info][cds] Reserved archive_space_rs [0x000000f000000000 - 0x000000f001000000] (16777216) bytes │ │ │ │ │ +[0.004s][info][cds] Reserved class_space_rs [0x000000f001000000 - 0x000000f041000000] (1073741824) bytes │ │ │ │ │ +[0.004s][info][cds] Mapped static region #0 at base 0x000000f000000000 top 0x000000f000490000 (ReadWrite) │ │ │ │ │ +[0.004s][info][cds] Mapped static region #1 at base 0x000000f000490000 top 0x000000f000cb0000 (ReadOnly) │ │ │ │ │ +[0.004s][info][cds] Mapped static region #2 at base 0x00007fff88800000 top 0x00007fff88840000 (Bitmap) │ │ │ │ │ +[0.008s][info][cds] Mapped dynamic region #0 at base 0x000000f000cb0000 top 0x000000f000cc0000 (ReadWrite) │ │ │ │ │ +[0.008s][info][cds] Mapped dynamic region #1 at base 0x000000f000cc0000 top 0x000000f000ce0000 (ReadOnly) │ │ │ │ │ +[0.008s][info][cds] Mapped dynamic region #2 at base 0x00007fff8a5a0000 top 0x00007fff8a5b0000 (Bitmap) │ │ │ │ │ +[0.008s][info][cds] CDS archive was created with max heap size = 128M, and the following configuration: │ │ │ │ │ +[0.008s][info][cds] narrow_klass_base = 0x000000f000000000, narrow_klass_shift = 0 │ │ │ │ │ +[0.008s][info][cds] narrow_oop_mode = 0, narrow_oop_base = 0x0000000000000000, narrow_oop_shift = 0 │ │ │ │ │ +[0.008s][info][cds] heap range = [0x00000000f8000000 - 0x0000000100000000] │ │ │ │ │ +[0.008s][info][cds] The current max heap size = 3968M, HeapRegion::GrainBytes = 2097152 │ │ │ │ │ +[0.008s][info][cds] narrow_klass_base = 0x000000f000000000, narrow_klass_shift = 0 │ │ │ │ │ +[0.008s][info][cds] narrow_oop_mode = 1, narrow_oop_base = 0x0000000000000000, narrow_oop_shift = 3 │ │ │ │ │ +[0.008s][info][cds] heap range = [0x0000000708000000 - 0x0000000800000000] │ │ │ │ │ +[0.008s][info][cds] Requested heap region [0x00000000ffe00000 - 0x00000000fff0c210] = 1098256 bytes │ │ │ │ │ +[0.008s][info][cds] CDS heap data needs to be relocated because the archive was created with an incompatible oop encoding mode. │ │ │ │ │ +[0.008s][info][cds] CDS heap data relocation delta = 30064771072 bytes │ │ │ │ │ +[0.008s][info][cds] Trying to map heap data at 0x00000007ffe00000, size = 1098256 bytes │ │ │ │ │ +[0.008s][info][cds] optimized module handling: enabled │ │ │ │ │ +[0.008s][info][cds] full module graph: enabled │ │ │ │ │ +[0.008s][info][cds] use_full_module_graph = true; java.base = 0x000000f00047c4b8 │ │ │ │ │ +[0.008s][info][cds] patching heap embedded pointers: narrowOop 0xffe00000 -> 0xfffc0000 │ │ │ │ │ +[0.008s][info][cds] CDS heap data quick relocation not possible │ │ │ │ │ +[0.009s][info][cds] Unmapping region #2 at base 0x00007fff88800000 (Bitmap) │ │ │ │ │ +[0.009s][info][cds] Unmapping region #2 at base 0x00007fff8a5a0000 (Bitmap) │ │ │ │ │ +This class is compiled by JDK 8 │ │ │ │ │ + │ │ │ │ │ +Command line: [/usr/lib/jvm/java-21-openjdk-ppc64el/bin/java -XX:+AutoCreateSharedArchive -XX:SharedArchiveFile=/tmp/hotspot/JTwork/scratch/Hello.jsa -Xlog:cds -cp /tmp/hotspot/JTwork/scratch/Hello.jar HelloJDK8] │ │ │ │ │ +[2026-10-20T11:17:35.540286054Z] Gathering output for process 2231759 │ │ │ │ │ +[2026-10-20T11:17:35.540620735Z] Waiting for completion for process 2231759 │ │ │ │ │ +[2026-10-20T11:17:35.605844057Z] Waiting for completion finished for process 2231759 │ │ │ │ │ +Output and diagnostic info for process 2231759 was saved into 'pid-2231759-output.log' │ │ │ │ │ +[0.004s][info][cds] trying to map /usr/lib/jvm/java-21-openjdk-ppc64el/lib/server/classes.jsa │ │ │ │ │ +[0.004s][info][cds] Opened archive /usr/lib/jvm/java-21-openjdk-ppc64el/lib/server/classes.jsa. │ │ │ │ │ +[0.004s][info][cds] Archive was created with UseCompressedOops = 1, UseCompressedClassPointers = 1 │ │ │ │ │ +[0.004s][info][cds] Core region alignment: 4096 │ │ │ │ │ +[0.004s][info][cds] trying to map /tmp/hotspot/JTwork/scratch/Hello.jsa │ │ │ │ │ +[0.004s][info][cds] Opened archive /tmp/hotspot/JTwork/scratch/Hello.jsa. │ │ │ │ │ +[0.004s][info][cds] _jvm_ident expected: OpenJDK 64-Bit Server VM (21.0.13-ea+6-1-Debian) for linux-ppc64le JRE (21.0.13-ea+6-1-Debian), built on 2026-09-15T20:41:53Z by "sbuild" with gcc 16.2.0 │ │ │ │ │ +[0.004s][info][cds] actual: OpenJDK 64-Bit Server VM (21.0.13-ea+8-1-Debian) for linux-ppc64le JRE (21.0.13-ea+8-1-Debian), built on 2026-10-08T06:37:43Z by "sbuild" with gcc 16.2.0 │ │ │ │ │ +[0.004s][warning][cds] The shared archive file was created by a different version or build of HotSpot │ │ │ │ │ +[0.004s][info ][cds] Initialize dynamic archive failed. │ │ │ │ │ +[0.004s][info ][cds] ArchiveRelocationMode == 1: always map archive(s) at an alternative address │ │ │ │ │ +[0.004s][info ][cds] Try to map archive(s) at an alternative address │ │ │ │ │ +[0.004s][info ][cds] Reserved archive_space_rs [0x000000c000000000 - 0x000000c001000000] (16777216) bytes │ │ │ │ │ +[0.004s][info ][cds] Reserved class_space_rs [0x000000c001000000 - 0x000000c041000000] (1073741824) bytes │ │ │ │ │ +[0.004s][info ][cds] Unable to map CDS archive -- core_region_alignment() expected: 4096 actual: 65536 │ │ │ │ │ +[0.004s][warning][cds] -XX:ArchiveClassesAtExit is unsupported when base CDS archive is not loaded. Run with -Xlog:cds for more info. │ │ │ │ │ +[0.004s][info ][cds] Unable to map shared spaces │ │ │ │ │ +This class is compiled by JDK 8 │ │ │ │ │ + │ │ │ │ │ +----------System.err:(35/2655)---------- │ │ │ │ │ + stdout: [[0.004s][info][cds] trying to map /usr/lib/jvm/java-21-openjdk-ppc64el/lib/server/classes.jsa │ │ │ │ │ +[0.004s][info][cds] Opened archive /usr/lib/jvm/java-21-openjdk-ppc64el/lib/server/classes.jsa. │ │ │ │ │ +[0.004s][info][cds] Archive was created with UseCompressedOops = 1, UseCompressedClassPointers = 1 │ │ │ │ │ +[0.004s][info][cds] Core region alignment: 4096 │ │ │ │ │ +[0.004s][info][cds] trying to map /tmp/hotspot/JTwork/scratch/Hello.jsa │ │ │ │ │ +[0.004s][info][cds] Opened archive /tmp/hotspot/JTwork/scratch/Hello.jsa. │ │ │ │ │ +[0.004s][info][cds] _jvm_ident expected: OpenJDK 64-Bit Server VM (21.0.13-ea+6-1-Debian) for linux-ppc64le JRE (21.0.13-ea+6-1-Debian), built on 2026-09-15T20:41:53Z by "sbuild" with gcc 16.2.0 │ │ │ │ │ +[0.004s][info][cds] actual: OpenJDK 64-Bit Server VM (21.0.13-ea+8-1-Debian) for linux-ppc64le JRE (21.0.13-ea+8-1-Debian), built on 2026-10-08T06:37:43Z by "sbuild" with gcc 16.2.0 │ │ │ │ │ +[0.004s][warning][cds] The shared archive file was created by a different version or build of HotSpot │ │ │ │ │ +[0.004s][info ][cds] Initialize dynamic archive failed. │ │ │ │ │ +[0.004s][info ][cds] ArchiveRelocationMode == 1: always map archive(s) at an alternative address │ │ │ │ │ +[0.004s][info ][cds] Try to map archive(s) at an alternative address │ │ │ │ │ +[0.004s][info ][cds] Reserved archive_space_rs [0x000000c000000000 - 0x000000c001000000] (16777216) bytes │ │ │ │ │ +[0.004s][info ][cds] Reserved class_space_rs [0x000000c001000000 - 0x000000c041000000] (1073741824) bytes │ │ │ │ │ +[0.004s][info ][cds] Unable to map CDS archive -- core_region_alignment() expected: 4096 actual: 65536 │ │ │ │ │ +[0.004s][warning][cds] -XX:ArchiveClassesAtExit is unsupported when base CDS archive is not loaded. Run with -Xlog:cds for more info. │ │ │ │ │ +[0.004s][info ][cds] Unable to map shared spaces │ │ │ │ │ +This class is compiled by JDK 8 │ │ │ │ │ +]; │ │ │ │ │ + stderr: [] │ │ │ │ │ + exitValue = 0 │ │ │ │ │ + │ │ │ │ │ +java.lang.RuntimeException: 'Dumping shared data to file' missing from stdout/stderr │ │ │ │ │ + at jdk.test.lib.process.OutputAnalyzer.shouldContain(OutputAnalyzer.java:252) │ │ │ │ │ + at TestAutoCreateSharedArchiveUpgrade.assertCreatedJSA(TestAutoCreateSharedArchiveUpgrade.java:169) │ │ │ │ │ + at TestAutoCreateSharedArchiveUpgrade.doTest(TestAutoCreateSharedArchiveUpgrade.java:141) │ │ │ │ │ + at TestAutoCreateSharedArchiveUpgrade.main(TestAutoCreateSharedArchiveUpgrade.java:83) │ │ │ │ │ + at java.base/jdk.internal.reflect.DirectMethodHandleAccessor.invoke(DirectMethodHandleAccessor.java:103) │ │ │ │ │ + at java.base/java.lang.reflect.Method.invoke(Method.java:580) │ │ │ │ │ + at com.sun.javatest.regtest.agent.MainActionHelper$AgentVMRunnable.run(MainActionHelper.java:360) │ │ │ │ │ + at java.base/java.lang.Thread.run(Thread.java:1583) │ │ │ │ │ + │ │ │ │ │ +JavaTest Message: Test threw exception: java.lang.RuntimeException │ │ │ │ │ +JavaTest Message: shutting down test │ │ │ │ │ + │ │ │ │ │ +result: Failed. Execution failed: `main' threw exception: java.lang.RuntimeException: 'Dumping shared data to file' missing from stdout/stderr │ │ │ │ │ + │ │ │ │ │ + │ │ │ │ │ +test result: Failed. Execution failed: `main' threw exception: java.lang.RuntimeException: 'Dumping shared data to file' missing from stdout/stderr │ │ ├── ./usr/share/doc/openjdk-21-jre-headless/test-ppc64el/jtreg-summary-hotspot.log │ │ │ @@ -1,13 +1,16 @@ │ │ │ --------------- jtreg console summary for hotspot --------------- │ │ │ -Test results: passed: 3,002; skipped: 4; excluded: 43; did not match keywords: 75; did not meet module requirements: 85; did not meet platform requirements: 239 │ │ │ +FAILED: runtime/cds/appcds/dynamicArchive/TestAutoCreateSharedArchiveUpgrade.java │ │ │ +Test results: passed: 3,001; failed: 1; skipped: 4; excluded: 43; did not match keywords: 75; did not meet module requirements: 85; did not meet platform requirements: 239 │ │ │ Framework-based tests: 448 = 409 TestNG + 39 JUnit │ │ │ +FAILED: runtime/cds/appcds/dynamicArchive/TestAutoCreateSharedArchiveUpgrade.java │ │ │ +Test results: failed: 1; excluded: 43; did not match keywords: 75; did not match prior status: 3,325 │ │ │ +FAILED: runtime/cds/appcds/dynamicArchive/TestAutoCreateSharedArchiveUpgrade.java │ │ │ +Test results: failed: 1; excluded: 43; did not match keywords: 75; did not match prior status: 3,325 │ │ │ [debian/tests/jtreg-autopkgtest.sh] nothing to cleanup │ │ │ -Unable to compare jtreg results: no build jtreport found for hotspot/ppc64el. │ │ │ -Reason: '/usr/share/doc/openjdk-21-jre-headless//test-ppc64el/jtreport-hotspot.tar.gz' does not exist. │ │ │ --------------- jtreg console summary for langtools --------------- │ │ │ Test results: passed: 4,433; skipped: 1; excluded: 12; did not match keywords: 1; did not meet platform requirements: 1 │ │ │ Framework-based tests: 4,126 = 3,147 TestNG + 979 JUnit │ │ │ [debian/tests/jtreg-autopkgtest.sh] nothing to cleanup │ │ │ Unable to compare jtreg results: no build jtreport found for hotspot/ppc64el. │ │ │ Reason: '/usr/share/doc/openjdk-21-jre-headless//test-ppc64el/jtreport-hotspot.tar.gz' does not exist. │ │ │ --------------- jtreg console summary for jaxp --------------- │ │ │ @@ -22,16 +25,16 @@ │ │ │ FAILED: java/net/MulticastSocket/Promiscuous.java │ │ │ FAILED: java/net/MulticastSocket/SetLoopbackMode.java │ │ │ FAILED: java/net/MulticastSocket/SetLoopbackModeIPv4.java │ │ │ FAILED: java/net/MulticastSocket/Test.java │ │ │ FAILED: java/net/SocketOption/OptionsTest.java │ │ │ FAILED: java/net/SocketPermission/SocketPermissionTest.java │ │ │ FAILED: sun/security/krb5/auto/Addresses.java │ │ │ -Test results: passed: 6,500; failed: 9; skipped: 114; excluded: 39; did not match keywords: 37; did not meet module requirements: 3; did not meet platform requirements: 100 │ │ │ -Framework-based tests: 335,207 = 164,249 TestNG + 170,958 JUnit │ │ │ +Test results: passed: 6,498; failed: 9; skipped: 114; excluded: 39; did not match keywords: 37; did not meet module requirements: 3; did not meet platform requirements: 102 │ │ │ +Framework-based tests: 335,188 = 164,230 TestNG + 170,958 JUnit │ │ │ FAILED: java/net/MulticastSocket/B6427403.java │ │ │ FAILED: java/net/MulticastSocket/NoLoopbackPackets.java │ │ │ FAILED: java/net/MulticastSocket/Promiscuous.java │ │ │ FAILED: java/net/MulticastSocket/SetLoopbackMode.java │ │ │ FAILED: java/net/MulticastSocket/SetLoopbackModeIPv4.java │ │ │ FAILED: java/net/MulticastSocket/Test.java │ │ │ FAILED: java/net/SocketOption/OptionsTest.java │ │ ├── ./usr/share/doc/openjdk-21-jre-headless/test-ppc64el/jtreg_output-hotspot.log.gz │ │ │ ├── jtreg_output-hotspot.log │ │ │ │ @@ -2258,15 +2258,15 @@ │ │ │ │ Passed: runtime/cds/appcds/dynamicArchive/RegularHiddenClass.java │ │ │ │ Passed: runtime/cds/appcds/dynamicArchive/RelativePath.java │ │ │ │ Passed: runtime/cds/appcds/dynamicArchive/SharedArchiveFileOption.java │ │ │ │ Passed: runtime/cds/appcds/dynamicArchive/SharedBaseAddressOption.java │ │ │ │ Passed: runtime/cds/appcds/dynamicArchive/StaticInnerTest.java │ │ │ │ Passed: runtime/cds/appcds/dynamicArchive/TestAutoCreateSharedArchive.java │ │ │ │ Passed: runtime/cds/appcds/dynamicArchive/TestAutoCreateSharedArchiveNoDefaultArchive.java │ │ │ │ -Passed: runtime/cds/appcds/dynamicArchive/TestAutoCreateSharedArchiveUpgrade.java │ │ │ │ +FAILED: runtime/cds/appcds/dynamicArchive/TestAutoCreateSharedArchiveUpgrade.java │ │ │ │ Passed: runtime/cds/appcds/dynamicArchive/TestDynamicDumpAtOom.java │ │ │ │ Passed: runtime/cds/appcds/dynamicArchive/TestDynamicRegenerateHolderClasses.java │ │ │ │ Passed: runtime/cds/appcds/dynamicArchive/TestLambdaInvokers.java │ │ │ │ Passed: runtime/cds/appcds/dynamicArchive/UnsupportedBaseArchive.java │ │ │ │ Passed: runtime/cds/appcds/dynamicArchive/UnusedCPDuringDump.java │ │ │ │ Passed: runtime/cds/appcds/dynamicArchive/UsedAllArchivedLambdas.java │ │ │ │ Passed: runtime/cds/appcds/dynamicArchive/VerifyObjArrayCloneTest.java │ │ │ │ @@ -3013,46 +3013,56 @@ │ │ │ │ Passed: serviceability/tmtools/jstat/GcCapacityTest.java │ │ │ │ Passed: serviceability/tmtools/jstat/GcCauseTest01.java │ │ │ │ Passed: serviceability/tmtools/jstat/GcCauseTest02.java │ │ │ │ Passed: serviceability/tmtools/jstat/GcCauseTest03.java │ │ │ │ Passed: serviceability/tmtools/jstat/GcNewTest.java │ │ │ │ Passed: serviceability/tmtools/jstat/GcTest01.java │ │ │ │ Passed: serviceability/tmtools/jstat/GcTest02.java │ │ │ │ -Test results: passed: 3,002; skipped: 4; excluded: 43; did not match keywords: 75; did not meet module requirements: 85; did not meet platform requirements: 239 │ │ │ │ +Test results: passed: 3,001; failed: 1; skipped: 4; excluded: 43; did not match keywords: 75; did not meet module requirements: 85; did not meet platform requirements: 239 │ │ │ │ Framework-based tests: 448 = 409 TestNG + 39 JUnit │ │ │ │ Report written to /build/reproducible-path/openjdk-21-21.0.13~8ea/jtreg-test-output/hotspot/0/JTreport/html/report.html │ │ │ │ Results written to /tmp/hotspot/JTwork │ │ │ │ +Error: Some tests failed or other problems occurred. │ │ │ │ +Directory "jtreg-test-output/hotspot/1/JTreport" not found: creating │ │ │ │ +FAILED: runtime/cds/appcds/dynamicArchive/TestAutoCreateSharedArchiveUpgrade.java │ │ │ │ +Test results: failed: 1; excluded: 43; did not match keywords: 75; did not match prior status: 3,325 │ │ │ │ +Report written to /build/reproducible-path/openjdk-21-21.0.13~8ea/jtreg-test-output/hotspot/1/JTreport/html/report.html │ │ │ │ +Results written to /tmp/hotspot/JTwork │ │ │ │ +Error: Some tests failed or other problems occurred. │ │ │ │ +Directory "jtreg-test-output/hotspot/2/JTreport" not found: creating │ │ │ │ +FAILED: runtime/cds/appcds/dynamicArchive/TestAutoCreateSharedArchiveUpgrade.java │ │ │ │ +Test results: failed: 1; excluded: 43; did not match keywords: 75; did not match prior status: 3,325 │ │ │ │ +Report written to /build/reproducible-path/openjdk-21-21.0.13~8ea/jtreg-test-output/hotspot/2/JTreport/html/report.html │ │ │ │ +Results written to /tmp/hotspot/JTwork │ │ │ │ +Error: Some tests failed or other problems occurred. │ │ │ │ [debian/tests/jtreg-autopkgtest.sh] nothing to cleanup │ │ │ │ -grep: debian/tests/hotspot-archs: No such file or directory │ │ │ │ -Unable to compare jtreg results: no build jtreport found for hotspot/ppc64el. │ │ │ │ -Reason: '/usr/share/doc/openjdk-21-jre-headless//test-ppc64el/jtreport-hotspot.tar.gz' does not exist. │ │ │ │ -Command exited with non-zero status 77 │ │ │ │ +Command exited with non-zero status 2 │ │ │ │ Command being timed: "debian/tests/hotspot" │ │ │ │ - User time (seconds): 18712.51 │ │ │ │ - System time (seconds): 1805.76 │ │ │ │ - Percent of CPU this job got: 146% │ │ │ │ - Elapsed (wall clock) time (h:mm:ss or m:ss): 3:53:54 │ │ │ │ + User time (seconds): 12148.83 │ │ │ │ + System time (seconds): 1114.41 │ │ │ │ + Percent of CPU this job got: 127% │ │ │ │ + Elapsed (wall clock) time (h:mm:ss or m:ss): 2:53:35 │ │ │ │ Average shared text size (kbytes): 0 │ │ │ │ Average unshared data size (kbytes): 0 │ │ │ │ Average stack size (kbytes): 0 │ │ │ │ Average total size (kbytes): 0 │ │ │ │ - Maximum resident set size (kbytes): 5890976 │ │ │ │ + Maximum resident set size (kbytes): 4015872 │ │ │ │ Average resident set size (kbytes): 0 │ │ │ │ - Major (requiring I/O) page faults: 373 │ │ │ │ - Minor (reclaiming a frame) page faults: 120500977 │ │ │ │ - Voluntary context switches: 44261937 │ │ │ │ - Involuntary context switches: 5722148 │ │ │ │ + Major (requiring I/O) page faults: 1608 │ │ │ │ + Minor (reclaiming a frame) page faults: 15298009 │ │ │ │ + Voluntary context switches: 37498259 │ │ │ │ + Involuntary context switches: 26372971 │ │ │ │ Swaps: 0 │ │ │ │ - File system inputs: 169744 │ │ │ │ - File system outputs: 0 │ │ │ │ + File system inputs: 1937544 │ │ │ │ + File system outputs: 38575616 │ │ │ │ Socket messages sent: 0 │ │ │ │ Socket messages received: 0 │ │ │ │ Signals delivered: 0 │ │ │ │ - Page size (bytes): 4096 │ │ │ │ - Exit status: 77 │ │ │ │ + Page size (bytes): 65536 │ │ │ │ + Exit status: 2 │ │ │ │ ===== END check-hotspot ===== │ │ │ │ ===== START check-langtools ===== │ │ │ │ mkdir -p jtreg-test-output/langtools │ │ │ │ BOOTJDK_HOME=/usr/lib/jvm/java-21-openjdk-ppc64el JTREG_OPTIONS= VMNAME=hotspot JDK_TO_TEST=build/bootcycle-build/images/jdk \ │ │ │ │ AUTOPKGTEST_TMP=/tmp/ AUTOPKGTEST_ARTIFACTS=jtreg-test-output/ \ │ │ │ │ /usr/bin/time -v debian/tests/langtools | tee jtreg-test-output/check-langtools.log │ │ │ │ dpkg: error: --compare-versions takes three arguments: │ │ │ │ @@ -7505,35 +7515,35 @@ │ │ │ │ Results written to /tmp/langtools/JTwork │ │ │ │ [debian/tests/jtreg-autopkgtest.sh] nothing to cleanup │ │ │ │ grep: debian/tests/hotspot-archs: No such file or directory │ │ │ │ Unable to compare jtreg results: no build jtreport found for hotspot/ppc64el. │ │ │ │ Reason: '/usr/share/doc/openjdk-21-jre-headless//test-ppc64el/jtreport-hotspot.tar.gz' does not exist. │ │ │ │ Command exited with non-zero status 77 │ │ │ │ Command being timed: "debian/tests/langtools" │ │ │ │ - User time (seconds): 4074.66 │ │ │ │ - System time (seconds): 273.46 │ │ │ │ - Percent of CPU this job got: 140% │ │ │ │ - Elapsed (wall clock) time (h:mm:ss or m:ss): 51:42.97 │ │ │ │ + User time (seconds): 2385.57 │ │ │ │ + System time (seconds): 173.06 │ │ │ │ + Percent of CPU this job got: 112% │ │ │ │ + Elapsed (wall clock) time (h:mm:ss or m:ss): 37:45.28 │ │ │ │ Average shared text size (kbytes): 0 │ │ │ │ Average unshared data size (kbytes): 0 │ │ │ │ Average stack size (kbytes): 0 │ │ │ │ Average total size (kbytes): 0 │ │ │ │ - Maximum resident set size (kbytes): 7651500 │ │ │ │ + Maximum resident set size (kbytes): 3343680 │ │ │ │ Average resident set size (kbytes): 0 │ │ │ │ - Major (requiring I/O) page faults: 21 │ │ │ │ - Minor (reclaiming a frame) page faults: 15886622 │ │ │ │ - Voluntary context switches: 3681120 │ │ │ │ - Involuntary context switches: 346747 │ │ │ │ + Major (requiring I/O) page faults: 212 │ │ │ │ + Minor (reclaiming a frame) page faults: 2626439 │ │ │ │ + Voluntary context switches: 3051036 │ │ │ │ + Involuntary context switches: 775994 │ │ │ │ Swaps: 0 │ │ │ │ - File system inputs: 91304 │ │ │ │ - File system outputs: 0 │ │ │ │ + File system inputs: 293576 │ │ │ │ + File system outputs: 29441408 │ │ │ │ Socket messages sent: 0 │ │ │ │ Socket messages received: 0 │ │ │ │ Signals delivered: 0 │ │ │ │ - Page size (bytes): 4096 │ │ │ │ + Page size (bytes): 65536 │ │ │ │ Exit status: 77 │ │ │ │ ===== END check-langtools ===== │ │ │ │ ===== START check-jaxp ===== │ │ │ │ mkdir -p jtreg-test-output/jaxp │ │ │ │ BOOTJDK_HOME=/usr/lib/jvm/java-21-openjdk-ppc64el JTREG_OPTIONS= VMNAME=hotspot JDK_TO_TEST=build/bootcycle-build/images/jdk \ │ │ │ │ AUTOPKGTEST_TMP=/tmp/ AUTOPKGTEST_ARTIFACTS=jtreg-test-output/ \ │ │ │ │ /usr/bin/time -v debian/tests/jaxp | tee jtreg-test-output/check-jaxp.log │ │ │ │ @@ -8055,62 +8065,62 @@ │ │ │ │ Results written to /tmp/jaxp/JTwork │ │ │ │ [debian/tests/jtreg-autopkgtest.sh] nothing to cleanup │ │ │ │ grep: debian/tests/hotspot-archs: No such file or directory │ │ │ │ Unable to compare jtreg results: no build jtreport found for hotspot/ppc64el. │ │ │ │ Reason: '/usr/share/doc/openjdk-21-jre-headless//test-ppc64el/jtreport-hotspot.tar.gz' does not exist. │ │ │ │ Command exited with non-zero status 77 │ │ │ │ Command being timed: "debian/tests/jaxp" │ │ │ │ - User time (seconds): 3776.93 │ │ │ │ - System time (seconds): 179.34 │ │ │ │ - Percent of CPU this job got: 230% │ │ │ │ - Elapsed (wall clock) time (h:mm:ss or m:ss): 28:38.12 │ │ │ │ + User time (seconds): 1915.94 │ │ │ │ + System time (seconds): 91.57 │ │ │ │ + Percent of CPU this job got: 231% │ │ │ │ + Elapsed (wall clock) time (h:mm:ss or m:ss): 14:28.02 │ │ │ │ Average shared text size (kbytes): 0 │ │ │ │ Average unshared data size (kbytes): 0 │ │ │ │ Average stack size (kbytes): 0 │ │ │ │ Average total size (kbytes): 0 │ │ │ │ - Maximum resident set size (kbytes): 447868 │ │ │ │ + Maximum resident set size (kbytes): 343616 │ │ │ │ Average resident set size (kbytes): 0 │ │ │ │ - Major (requiring I/O) page faults: 6 │ │ │ │ - Minor (reclaiming a frame) page faults: 20535988 │ │ │ │ - Voluntary context switches: 3385750 │ │ │ │ - Involuntary context switches: 150235 │ │ │ │ + Major (requiring I/O) page faults: 1 │ │ │ │ + Minor (reclaiming a frame) page faults: 2421512 │ │ │ │ + Voluntary context switches: 2490157 │ │ │ │ + Involuntary context switches: 166522 │ │ │ │ Swaps: 0 │ │ │ │ - File system inputs: 20608 │ │ │ │ - File system outputs: 0 │ │ │ │ + File system inputs: 1025584 │ │ │ │ + File system outputs: 3771392 │ │ │ │ Socket messages sent: 0 │ │ │ │ Socket messages received: 0 │ │ │ │ Signals delivered: 0 │ │ │ │ - Page size (bytes): 4096 │ │ │ │ + Page size (bytes): 65536 │ │ │ │ Exit status: 77 │ │ │ │ ===== END check-jaxp ===== │ │ │ │ ===== START check-jdk ===== │ │ │ │ mkdir -p jtreg-test-output/jdk │ │ │ │ BOOTJDK_HOME=/usr/lib/jvm/java-21-openjdk-ppc64el JTREG_OPTIONS= VMNAME=hotspot JDK_TO_TEST=build/bootcycle-build/images/jdk \ │ │ │ │ AUTOPKGTEST_TMP=/tmp/ AUTOPKGTEST_ARTIFACTS=jtreg-test-output/ \ │ │ │ │ /usr/bin/time -v debian/tests/jdk | tee jtreg-test-output/check-jdk.log │ │ │ │ │ │ │ │ -(xfwm4:2278872): atspi-WARNING **: 17:55:45.396: AT-SPI: Error retrieving accessibility bus address: org.freedesktop.DBus.Error.ServiceUnknown: The name org.a11y.Bus was not provided by any .service files │ │ │ │ +(xfwm4:2317969): atspi-WARNING **: 12:09:58.360: AT-SPI: Error retrieving accessibility bus address: org.freedesktop.DBus.Error.ServiceUnknown: The name org.a11y.Bus was not provided by any .service files │ │ │ │ +dbus-daemon[2317958]: [session uid=999 pid=2317958 pidfd=5] Activating service name='org.xfce.Xfconf' requested by ':1.1' (uid=999 pid=2317969 comm="xfwm4") │ │ │ │ +dbus-daemon[2317958]: [session uid=999 pid=2317958 pidfd=5] Successfully activated service 'org.xfce.Xfconf' │ │ │ │ +WARNING: Glycin running without sandbox. Bubblewrap (bwrap) doesn't work in the environment. │ │ │ │ + │ │ │ │ +(xfwm4:2317969): xfwm4-WARNING **: 12:10:00.573: Another compositing manager is running on screen 0 │ │ │ │ + │ │ │ │ +(xfwm4:2317969): xfwm4-WARNING **: 12:10:00.576: Failed to connect to session manager: Failed to connect to the session manager: SESSION_MANAGER environment variable not defined │ │ │ │ dpkg: error: --compare-versions takes three arguments: │ │ │ │ │ │ │ │ Type dpkg --help for help about installing and deinstalling packages [*]; │ │ │ │ Use 'apt' or 'aptitude' for user-friendly package management; │ │ │ │ Type dpkg -Dhelp for a list of dpkg debug flag values; │ │ │ │ Type dpkg --force-help for a list of forcing options; │ │ │ │ Type dpkg-deb --help for help about manipulating *.deb files; │ │ │ │ │ │ │ │ Options marked [*] produce a lot of output - pipe it through 'less' or 'more' ! │ │ │ │ -dbus-daemon[2278861]: [session uid=999 pid=2278861 pidfd=5] Activating service name='org.xfce.Xfconf' requested by ':1.1' (uid=999 pid=2278872 comm="xfwm4") │ │ │ │ -dbus-daemon[2278861]: [session uid=999 pid=2278861 pidfd=5] Successfully activated service 'org.xfce.Xfconf' │ │ │ │ Directory "/tmp/jdk/JTwork" not found: creating │ │ │ │ Directory "jtreg-test-output/jdk/0/JTreport" not found: creating │ │ │ │ -WARNING: Glycin running without sandbox. Bubblewrap (bwrap) doesn't work in the environment. │ │ │ │ - │ │ │ │ -(xfwm4:2278872): xfwm4-WARNING **: 17:55:50.032: Another compositing manager is running on screen 0 │ │ │ │ - │ │ │ │ -(xfwm4:2278872): xfwm4-WARNING **: 17:55:50.131: Failed to connect to session manager: Failed to connect to the session manager: SESSION_MANAGER environment variable not defined │ │ │ │ Passed: com/sun/jdi/AcceptTimeout.java │ │ │ │ Passed: com/sun/jdi/AccessSpecifierTest.java │ │ │ │ Passed: com/sun/jdi/AfterThreadDeathTest.java │ │ │ │ Passed: com/sun/jdi/ArrayRangeTest.java │ │ │ │ Passed: com/sun/jdi/ConstantPoolInfo.java │ │ │ │ Passed: com/sun/jdi/CountFilterTest.java │ │ │ │ Passed: com/sun/jdi/EarlyReturnNegativeTest.java │ │ │ │ @@ -8773,15 +8783,14 @@ │ │ │ │ Passed: java/io/File/ListRoots.java │ │ │ │ Passed: java/io/File/ListSpace.java │ │ │ │ Passed: java/io/File/MaxPathLength.java │ │ │ │ Passed: java/io/File/Mkdir.java │ │ │ │ Passed: java/io/File/NulFile.java │ │ │ │ Passed: java/io/File/NullArgs.java │ │ │ │ Passed: java/io/File/SetAccess.java │ │ │ │ -Passed: java/io/File/SetLastModified.java │ │ │ │ Passed: java/io/File/SetReadOnly.java │ │ │ │ Passed: java/io/File/SymLinks.java │ │ │ │ Passed: java/io/File/TempDirDoesNotExist.java │ │ │ │ Passed: java/io/File/TimeZoneLastModified.java │ │ │ │ Passed: java/io/File/ToURI.java │ │ │ │ Passed: java/io/File/ToURL.java │ │ │ │ Passed: java/io/File/Unicode.java │ │ │ │ @@ -10777,15 +10786,14 @@ │ │ │ │ Passed: java/nio/channels/AsynchronousSocketChannel/StressLoopback.java │ │ │ │ Passed: java/nio/channels/Channels/Basic.java │ │ │ │ Passed: java/nio/channels/Channels/Basic2.java │ │ │ │ Passed: java/nio/channels/Channels/CloseWriterOnFailedFlush.java │ │ │ │ Passed: java/nio/channels/Channels/EncodingTest.java │ │ │ │ Passed: java/nio/channels/Channels/ReadByte.java │ │ │ │ Passed: java/nio/channels/Channels/ReadOffset.java │ │ │ │ -Passed: java/nio/channels/Channels/ReadXBytes.java │ │ │ │ Passed: java/nio/channels/Channels/ShortWrite.java │ │ │ │ Passed: java/nio/channels/Channels/SocketChannelStreams.java │ │ │ │ Passed: java/nio/channels/Channels/TinyBuffers.java │ │ │ │ Passed: java/nio/channels/Channels/TransferTo_2GB_transferFrom.java │ │ │ │ Passed: java/nio/channels/Channels/TransferTo_2GB_transferTo.java │ │ │ │ Passed: java/nio/channels/Channels/TransferTo.java │ │ │ │ Passed: java/nio/channels/Channels/TransferTo2.java │ │ │ │ @@ -14612,16 +14620,16 @@ │ │ │ │ Passed: tools/launcher/TestXcheckJNIWarnings.java#jdwp-agent │ │ │ │ Passed: tools/launcher/TestXcheckJNIWarnings.java#noagent │ │ │ │ Passed: tools/launcher/ToolsOpts.java │ │ │ │ Passed: tools/launcher/TooSmallStackSize.java │ │ │ │ Passed: tools/launcher/UnicodeTest.java │ │ │ │ Passed: tools/launcher/UnresolvedExceptions.java │ │ │ │ Passed: tools/launcher/VersionCheck.java │ │ │ │ -Test results: passed: 6,500; failed: 9; skipped: 114; excluded: 39; did not match keywords: 37; did not meet module requirements: 3; did not meet platform requirements: 100 │ │ │ │ -Framework-based tests: 335,207 = 164,249 TestNG + 170,958 JUnit │ │ │ │ +Test results: passed: 6,498; failed: 9; skipped: 114; excluded: 39; did not match keywords: 37; did not meet module requirements: 3; did not meet platform requirements: 102 │ │ │ │ +Framework-based tests: 335,188 = 164,230 TestNG + 170,958 JUnit │ │ │ │ Report written to /build/reproducible-path/openjdk-21-21.0.13~8ea/jtreg-test-output/jdk/0/JTreport/html/report.html │ │ │ │ Results written to /tmp/jdk/JTwork │ │ │ │ Error: Some tests failed or other problems occurred. │ │ │ │ Directory "jtreg-test-output/jdk/1/JTreport" not found: creating │ │ │ │ FAILED: java/net/MulticastSocket/B6427403.java │ │ │ │ FAILED: java/net/MulticastSocket/NoLoopbackPackets.java │ │ │ │ FAILED: java/net/MulticastSocket/Promiscuous.java │ │ │ │ @@ -14629,69 +14637,72 @@ │ │ │ │ FAILED: java/net/MulticastSocket/SetLoopbackModeIPv4.java │ │ │ │ FAILED: java/net/MulticastSocket/Test.java │ │ │ │ FAILED: java/net/SocketOption/OptionsTest.java │ │ │ │ FAILED: java/net/SocketPermission/SocketPermissionTest.java │ │ │ │ FAILED: sun/security/krb5/auto/Addresses.java │ │ │ │ Test results: failed: 9; excluded: 39; did not match keywords: 37; did not match prior status: 6,603 │ │ │ │ Framework-based tests: 8 = 8 TestNG + 0 JUnit │ │ │ │ +Error: Some tests failed or other problems occurred. │ │ │ │ Report written to /build/reproducible-path/openjdk-21-21.0.13~8ea/jtreg-test-output/jdk/1/JTreport/html/report.html │ │ │ │ Results written to /tmp/jdk/JTwork │ │ │ │ -Error: Some tests failed or other problems occurred. │ │ │ │ Directory "jtreg-test-output/jdk/2/JTreport" not found: creating │ │ │ │ FAILED: java/net/MulticastSocket/B6427403.java │ │ │ │ FAILED: java/net/MulticastSocket/NoLoopbackPackets.java │ │ │ │ FAILED: java/net/MulticastSocket/Promiscuous.java │ │ │ │ FAILED: java/net/MulticastSocket/SetLoopbackMode.java │ │ │ │ FAILED: java/net/MulticastSocket/SetLoopbackModeIPv4.java │ │ │ │ FAILED: java/net/MulticastSocket/Test.java │ │ │ │ FAILED: java/net/SocketOption/OptionsTest.java │ │ │ │ FAILED: java/net/SocketPermission/SocketPermissionTest.java │ │ │ │ FAILED: sun/security/krb5/auto/Addresses.java │ │ │ │ Test results: failed: 9; excluded: 39; did not match keywords: 37; did not match prior status: 6,603 │ │ │ │ +Error: Some tests failed or other problems occurred. │ │ │ │ Framework-based tests: 8 = 8 TestNG + 0 JUnit │ │ │ │ Report written to /build/reproducible-path/openjdk-21-21.0.13~8ea/jtreg-test-output/jdk/2/JTreport/html/report.html │ │ │ │ Results written to /tmp/jdk/JTwork │ │ │ │ -Error: Some tests failed or other problems occurred. │ │ │ │ [debian/tests/jtreg-autopkgtest.sh] nothing to cleanup │ │ │ │ Command exited with non-zero status 2 │ │ │ │ Command being timed: "debian/tests/jdk" │ │ │ │ - User time (seconds): 25263.06 │ │ │ │ - System time (seconds): 1674.49 │ │ │ │ - Percent of CPU this job got: 146% │ │ │ │ - Elapsed (wall clock) time (h:mm:ss or m:ss): 5:06:41 │ │ │ │ + User time (seconds): 14181.43 │ │ │ │ + System time (seconds): 937.89 │ │ │ │ + Percent of CPU this job got: 112% │ │ │ │ + Elapsed (wall clock) time (h:mm:ss or m:ss): 3:43:09 │ │ │ │ Average shared text size (kbytes): 0 │ │ │ │ Average unshared data size (kbytes): 0 │ │ │ │ Average stack size (kbytes): 0 │ │ │ │ Average total size (kbytes): 0 │ │ │ │ - Maximum resident set size (kbytes): 13842352 │ │ │ │ + Maximum resident set size (kbytes): 7585408 │ │ │ │ Average resident set size (kbytes): 0 │ │ │ │ - Major (requiring I/O) page faults: 913 │ │ │ │ - Minor (reclaiming a frame) page faults: 116468076 │ │ │ │ - Voluntary context switches: 34882943 │ │ │ │ - Involuntary context switches: 2622963 │ │ │ │ + Major (requiring I/O) page faults: 54303 │ │ │ │ + Minor (reclaiming a frame) page faults: 16666090 │ │ │ │ + Voluntary contextKilled │ │ │ │ + switches: 26688344 │ │ │ │ + Involuntary context switches: 4106234 │ │ │ │ Swaps: 0 │ │ │ │ - File system inputs: 546704 │ │ │ │ - File system outputs: 0 │ │ │ │ + File system inputs: 2790072 │ │ │ │ + File system outputs: 114505472 │ │ │ │ Socket messages sent: 0 │ │ │ │ Socket messages received: 0 │ │ │ │ Signals delivered: 0 │ │ │ │ - Page size (bytes): 4096 │ │ │ │ + Page size (bytes): 65536 │ │ │ │ Exit status: 2 │ │ │ │ -Killed │ │ │ │ ===== END check-jdk ===== │ │ │ │ for i in hotspot langtools jaxp jdk; do \ │ │ │ │ echo "--------------- jtreg console summary for $i ---------------"; \ │ │ │ │ egrep -v '^(Passed:|Directory|Re[a-z]+\ written\ to)' jtreg-test-output/check-$i.log; \ │ │ │ │ done | tee jtreg-test-output/jtreg-summary.log │ │ │ │ --------------- jtreg console summary for hotspot --------------- │ │ │ │ -Test results: passed: 3,002; skipped: 4; excluded: 43; did not match keywords: 75; did not meet module requirements: 85; did not meet platform requirements: 239 │ │ │ │ +FAILED: runtime/cds/appcds/dynamicArchive/TestAutoCreateSharedArchiveUpgrade.java │ │ │ │ +Test results: passed: 3,001; failed: 1; skipped: 4; excluded: 43; did not match keywords: 75; did not meet module requirements: 85; did not meet platform requirements: 239 │ │ │ │ Framework-based tests: 448 = 409 TestNG + 39 JUnit │ │ │ │ +FAILED: runtime/cds/appcds/dynamicArchive/TestAutoCreateSharedArchiveUpgrade.java │ │ │ │ +Test results: failed: 1; excluded: 43; did not match keywords: 75; did not match prior status: 3,325 │ │ │ │ +FAILED: runtime/cds/appcds/dynamicArchive/TestAutoCreateSharedArchiveUpgrade.java │ │ │ │ +Test results: failed: 1; excluded: 43; did not match keywords: 75; did not match prior status: 3,325 │ │ │ │ [debian/tests/jtreg-autopkgtest.sh] nothing to cleanup │ │ │ │ -Unable to compare jtreg results: no build jtreport found for hotspot/ppc64el. │ │ │ │ -Reason: '/usr/share/doc/openjdk-21-jre-headless//test-ppc64el/jtreport-hotspot.tar.gz' does not exist. │ │ │ │ --------------- jtreg console summary for langtools --------------- │ │ │ │ Test results: passed: 4,433; skipped: 1; excluded: 12; did not match keywords: 1; did not meet platform requirements: 1 │ │ │ │ Framework-based tests: 4,126 = 3,147 TestNG + 979 JUnit │ │ │ │ [debian/tests/jtreg-autopkgtest.sh] nothing to cleanup │ │ │ │ Unable to compare jtreg results: no build jtreport found for hotspot/ppc64el. │ │ │ │ Reason: '/usr/share/doc/openjdk-21-jre-headless//test-ppc64el/jtreport-hotspot.tar.gz' does not exist. │ │ │ │ --------------- jtreg console summary for jaxp --------------- │ │ │ │ @@ -14706,16 +14717,16 @@ │ │ │ │ FAILED: java/net/MulticastSocket/Promiscuous.java │ │ │ │ FAILED: java/net/MulticastSocket/SetLoopbackMode.java │ │ │ │ FAILED: java/net/MulticastSocket/SetLoopbackModeIPv4.java │ │ │ │ FAILED: java/net/MulticastSocket/Test.java │ │ │ │ FAILED: java/net/SocketOption/OptionsTest.java │ │ │ │ FAILED: java/net/SocketPermission/SocketPermissionTest.java │ │ │ │ FAILED: sun/security/krb5/auto/Addresses.java │ │ │ │ -Test results: passed: 6,500; failed: 9; skipped: 114; excluded: 39; did not match keywords: 37; did not meet module requirements: 3; did not meet platform requirements: 100 │ │ │ │ -Framework-based tests: 335,207 = 164,249 TestNG + 170,958 JUnit │ │ │ │ +Test results: passed: 6,498; failed: 9; skipped: 114; excluded: 39; did not match keywords: 37; did not meet module requirements: 3; did not meet platform requirements: 102 │ │ │ │ +Framework-based tests: 335,188 = 164,230 TestNG + 170,958 JUnit │ │ │ │ FAILED: java/net/MulticastSocket/B6427403.java │ │ │ │ FAILED: java/net/MulticastSocket/NoLoopbackPackets.java │ │ │ │ FAILED: java/net/MulticastSocket/Promiscuous.java │ │ │ │ FAILED: java/net/MulticastSocket/SetLoopbackMode.java │ │ │ │ FAILED: java/net/MulticastSocket/SetLoopbackModeIPv4.java │ │ │ │ FAILED: java/net/MulticastSocket/Test.java │ │ │ │ FAILED: java/net/SocketOption/OptionsTest.java │ │ │ │ @@ -14733,29 +14744,29 @@ │ │ │ │ FAILED: java/net/SocketPermission/SocketPermissionTest.java │ │ │ │ FAILED: sun/security/krb5/auto/Addresses.java │ │ │ │ Test results: failed: 9; excluded: 39; did not match keywords: 37; did not match prior status: 6,603 │ │ │ │ Framework-based tests: 8 = 8 TestNG + 0 JUnit │ │ │ │ [debian/tests/jtreg-autopkgtest.sh] nothing to cleanup │ │ │ │ make[2]: Leaving directory '/build/reproducible-path/openjdk-21-21.0.13~8ea' │ │ │ │ Command being timed: "/usr/bin/make -f debian/rules -k jtregcheck TEST_SUITES=hotspot langtools jaxp jdk JTREG_OPTIONS=" │ │ │ │ - User time (seconds): 51828.29 │ │ │ │ - System time (seconds): 3933.87 │ │ │ │ - Percent of CPU this job got: 149% │ │ │ │ - Elapsed (wall clock) time (h:mm:ss or m:ss): 10:20:58 │ │ │ │ + User time (seconds): 30632.41 │ │ │ │ + System time (seconds): 2317.92 │ │ │ │ + Percent of CPU this job got: 122% │ │ │ │ + Elapsed (wall clock) time (h:mm:ss or m:ss): 7:28:59 │ │ │ │ Average shared text size (kbytes): 0 │ │ │ │ Average unshared data size (kbytes): 0 │ │ │ │ Average stack size (kbytes): 0 │ │ │ │ Average total size (kbytes): 0 │ │ │ │ - Maximum resident set size (kbytes): 13842352 │ │ │ │ + Maximum resident set size (kbytes): 7585408 │ │ │ │ Average resident set size (kbytes): 0 │ │ │ │ - Major (requiring I/O) page faults: 1318 │ │ │ │ - Minor (reclaiming a frame) page faults: 273424266 │ │ │ │ - Voluntary context switches: 86226584 │ │ │ │ - Involuntary context switches: 8845347 │ │ │ │ + Major (requiring I/O) page faults: 56127 │ │ │ │ + Minor (reclaiming a frame) page faults: 37023652 │ │ │ │ + Voluntary context switches: 69742630 │ │ │ │ + Involuntary context switches: 31425572 │ │ │ │ Swaps: 0 │ │ │ │ - File system inputs: 828408 │ │ │ │ - File system outputs: 0 │ │ │ │ + File system inputs: 6048168 │ │ │ │ + File system outputs: 186403840 │ │ │ │ Socket messages sent: 0 │ │ │ │ Socket messages received: 0 │ │ │ │ Signals delivered: 0 │ │ │ │ - Page size (bytes): 4096 │ │ │ │ + Page size (bytes): 65536 │ │ │ │ Exit status: 0 │ │ ├── ./usr/share/doc/openjdk-21-jre-headless/test-ppc64el/jtreport-hotspot.tar.gz │ │ │ ├── jtreport-hotspot.tar │ │ │ │ ├── file list │ │ │ │ │ @@ -1,230 +1,302 @@ │ │ │ │ │ -lrwxrwxrwx 0 sbuild (999) sbuild (999) 0 2026-10-08 23:02:23.000000 jtreg-test-output/jdk/JTreport -> 2/JTreport │ │ │ │ │ -drwxr-xr-x 0 sbuild (999) sbuild (999) 0 2026-10-08 23:02:04.000000 jtreg-test-output/jdk/2/JTreport/ │ │ │ │ │ --rw-r--r-- 0 sbuild (999) sbuild (999) 712 2026-10-08 23:02:04.000000 jtreg-test-output/jdk/2/JTreport/index.html │ │ │ │ │ --rw-r--r-- 0 sbuild (999) sbuild (999) 0 2026-10-08 23:02:04.000000 jtreg-test-output/jdk/2/JTreport/reportdir.dat │ │ │ │ │ -drwxr-xr-x 0 sbuild (999) sbuild (999) 0 2026-10-08 23:02:04.000000 jtreg-test-output/jdk/2/JTreport/html/ │ │ │ │ │ --rw-r--r-- 0 sbuild (999) sbuild (999) 762639 2026-10-08 23:02:04.000000 jtreg-test-output/jdk/2/JTreport/html/notRun_gr.html │ │ │ │ │ --rw-r--r-- 0 sbuild (999) sbuild (999) 762366 2026-10-08 23:02:04.000000 jtreg-test-output/jdk/2/JTreport/html/notRun.html │ │ │ │ │ --rw-r--r-- 0 sbuild (999) sbuild (999) 521 2026-10-08 23:02:04.000000 jtreg-test-output/jdk/2/JTreport/html/error_gr.html │ │ │ │ │ --rw-r--r-- 0 sbuild (999) sbuild (999) 473 2026-10-08 23:02:04.000000 jtreg-test-output/jdk/2/JTreport/html/error.html │ │ │ │ │ --rw-r--r-- 0 sbuild (999) sbuild (999) 2750 2026-10-08 23:02:04.000000 jtreg-test-output/jdk/2/JTreport/html/failed_gr.html │ │ │ │ │ --rw-r--r-- 0 sbuild (999) sbuild (999) 2020 2026-10-08 23:02:04.000000 jtreg-test-output/jdk/2/JTreport/html/failed.html │ │ │ │ │ --rw-r--r-- 0 sbuild (999) sbuild (999) 1251207 2026-10-08 23:02:04.000000 jtreg-test-output/jdk/2/JTreport/html/passed_gr.html │ │ │ │ │ --rw-r--r-- 0 sbuild (999) sbuild (999) 1249854 2026-10-08 23:02:04.000000 jtreg-test-output/jdk/2/JTreport/html/passed.html │ │ │ │ │ --rw-r--r-- 0 sbuild (999) sbuild (999) 83174 2026-10-08 23:02:03.000000 jtreg-test-output/jdk/2/JTreport/html/excluded.html │ │ │ │ │ --rw-r--r-- 0 sbuild (999) sbuild (999) 4256 2026-10-08 23:02:03.000000 jtreg-test-output/jdk/2/JTreport/html/env.html │ │ │ │ │ --rw-r--r-- 0 sbuild (999) sbuild (999) 24358 2026-10-08 23:02:03.000000 jtreg-test-output/jdk/2/JTreport/html/config.html │ │ │ │ │ --rw-r--r-- 0 sbuild (999) sbuild (999) 307 2026-10-08 23:02:03.000000 jtreg-test-output/jdk/2/JTreport/html/report.css │ │ │ │ │ --rw-r--r-- 0 sbuild (999) sbuild (999) 1101685 2026-10-08 23:02:03.000000 jtreg-test-output/jdk/2/JTreport/html/index.html │ │ │ │ │ --rw-r--r-- 0 sbuild (999) sbuild (999) 1101685 2026-10-08 23:02:03.000000 jtreg-test-output/jdk/2/JTreport/html/report.html │ │ │ │ │ -drwxr-xr-x 0 sbuild (999) sbuild (999) 0 2026-10-08 23:02:04.000000 jtreg-test-output/jdk/2/JTreport/text/ │ │ │ │ │ --rw-r--r-- 0 sbuild (999) sbuild (999) 132 2026-10-08 23:02:04.000000 jtreg-test-output/jdk/2/JTreport/text/testng.txt │ │ │ │ │ --rw-r--r-- 0 sbuild (999) sbuild (999) 1023412 2026-10-08 23:02:04.000000 jtreg-test-output/jdk/2/JTreport/text/notRun.txt │ │ │ │ │ --rw-r--r-- 0 sbuild (999) sbuild (999) 101 2026-10-08 23:02:04.000000 jtreg-test-output/jdk/2/JTreport/text/stats.txt │ │ │ │ │ --rw-r--r-- 0 sbuild (999) sbuild (999) 116 2026-10-08 23:02:04.000000 jtreg-test-output/jdk/2/JTreport/text/timeStats.txt │ │ │ │ │ --rw-r--r-- 0 sbuild (999) sbuild (999) 21 2026-10-08 23:02:04.000000 jtreg-test-output/jdk/2/JTreport/text/tc_newfailures.txt │ │ │ │ │ --rw-r--r-- 0 sbuild (999) sbuild (999) 21 2026-10-08 23:02:04.000000 jtreg-test-output/jdk/2/JTreport/text/tc_fail2notrun.txt │ │ │ │ │ --rw-r--r-- 0 sbuild (999) sbuild (999) 20 2026-10-08 23:02:04.000000 jtreg-test-output/jdk/2/JTreport/text/tc_fail2error.txt │ │ │ │ │ --rw-r--r-- 0 sbuild (999) sbuild (999) 19 2026-10-08 23:02:04.000000 jtreg-test-output/jdk/2/JTreport/text/tc_fail2pass.txt │ │ │ │ │ --rw-r--r-- 0 sbuild (999) sbuild (999) 22 2026-10-08 23:02:04.000000 jtreg-test-output/jdk/2/JTreport/text/tc_fail2missing.txt │ │ │ │ │ --rw-r--r-- 0 sbuild (999) sbuild (999) 19 2026-10-08 23:02:04.000000 jtreg-test-output/jdk/2/JTreport/text/other_errors.txt │ │ │ │ │ --rw-r--r-- 0 sbuild (999) sbuild (999) 416 2026-10-08 23:02:04.000000 jtreg-test-output/jdk/2/JTreport/text/newfailures.txt │ │ │ │ │ --rw-r--r-- 0 sbuild (999) sbuild (999) 16 2026-10-08 23:02:04.000000 jtreg-test-output/jdk/2/JTreport/text/fail2fail.txt │ │ │ │ │ --rw-r--r-- 0 sbuild (999) sbuild (999) 18 2026-10-08 23:02:04.000000 jtreg-test-output/jdk/2/JTreport/text/fail2notrun.txt │ │ │ │ │ --rw-r--r-- 0 sbuild (999) sbuild (999) 17 2026-10-08 23:02:04.000000 jtreg-test-output/jdk/2/JTreport/text/faiL2error.txt │ │ │ │ │ --rw-r--r-- 0 sbuild (999) sbuild (999) 16 2026-10-08 23:02:04.000000 jtreg-test-output/jdk/2/JTreport/text/fail2pass.txt │ │ │ │ │ --rw-r--r-- 0 sbuild (999) sbuild (999) 19 2026-10-08 23:02:04.000000 jtreg-test-output/jdk/2/JTreport/text/fail2missing.txt │ │ │ │ │ --rw-r--r-- 0 sbuild (999) sbuild (999) 891389 2026-10-08 23:02:04.000000 jtreg-test-output/jdk/2/JTreport/text/summary.txt │ │ │ │ │ --rw-r--r-- 0 sbuild (999) sbuild (999) 552 2026-10-08 23:01:40.000000 jtreg-test-output/jdk/2/JTreport/text/cmdArgs.txt │ │ │ │ │ -drwxr-xr-x 0 sbuild (999) sbuild (999) 0 2026-10-08 23:01:21.000000 jtreg-test-output/jdk/1/JTreport/ │ │ │ │ │ --rw-r--r-- 0 sbuild (999) sbuild (999) 712 2026-10-08 23:01:21.000000 jtreg-test-output/jdk/1/JTreport/index.html │ │ │ │ │ --rw-r--r-- 0 sbuild (999) sbuild (999) 0 2026-10-08 23:01:21.000000 jtreg-test-output/jdk/1/JTreport/reportdir.dat │ │ │ │ │ -drwxr-xr-x 0 sbuild (999) sbuild (999) 0 2026-10-08 23:01:20.000000 jtreg-test-output/jdk/1/JTreport/html/ │ │ │ │ │ --rw-r--r-- 0 sbuild (999) sbuild (999) 762639 2026-10-08 23:01:20.000000 jtreg-test-output/jdk/1/JTreport/html/notRun_gr.html │ │ │ │ │ --rw-r--r-- 0 sbuild (999) sbuild (999) 762366 2026-10-08 23:01:20.000000 jtreg-test-output/jdk/1/JTreport/html/notRun.html │ │ │ │ │ --rw-r--r-- 0 sbuild (999) sbuild (999) 521 2026-10-08 23:01:20.000000 jtreg-test-output/jdk/1/JTreport/html/error_gr.html │ │ │ │ │ --rw-r--r-- 0 sbuild (999) sbuild (999) 473 2026-10-08 23:01:20.000000 jtreg-test-output/jdk/1/JTreport/html/error.html │ │ │ │ │ --rw-r--r-- 0 sbuild (999) sbuild (999) 2750 2026-10-08 23:01:20.000000 jtreg-test-output/jdk/1/JTreport/html/failed_gr.html │ │ │ │ │ --rw-r--r-- 0 sbuild (999) sbuild (999) 2020 2026-10-08 23:01:20.000000 jtreg-test-output/jdk/1/JTreport/html/failed.html │ │ │ │ │ --rw-r--r-- 0 sbuild (999) sbuild (999) 1251207 2026-10-08 23:01:20.000000 jtreg-test-output/jdk/1/JTreport/html/passed_gr.html │ │ │ │ │ --rw-r--r-- 0 sbuild (999) sbuild (999) 1249854 2026-10-08 23:01:20.000000 jtreg-test-output/jdk/1/JTreport/html/passed.html │ │ │ │ │ --rw-r--r-- 0 sbuild (999) sbuild (999) 83174 2026-10-08 23:01:20.000000 jtreg-test-output/jdk/1/JTreport/html/excluded.html │ │ │ │ │ --rw-r--r-- 0 sbuild (999) sbuild (999) 4256 2026-10-08 23:01:20.000000 jtreg-test-output/jdk/1/JTreport/html/env.html │ │ │ │ │ --rw-r--r-- 0 sbuild (999) sbuild (999) 24358 2026-10-08 23:01:20.000000 jtreg-test-output/jdk/1/JTreport/html/config.html │ │ │ │ │ --rw-r--r-- 0 sbuild (999) sbuild (999) 307 2026-10-08 23:01:20.000000 jtreg-test-output/jdk/1/JTreport/html/report.css │ │ │ │ │ --rw-r--r-- 0 sbuild (999) sbuild (999) 1101685 2026-10-08 23:01:20.000000 jtreg-test-output/jdk/1/JTreport/html/index.html │ │ │ │ │ --rw-r--r-- 0 sbuild (999) sbuild (999) 1101685 2026-10-08 23:01:20.000000 jtreg-test-output/jdk/1/JTreport/html/report.html │ │ │ │ │ -drwxr-xr-x 0 sbuild (999) sbuild (999) 0 2026-10-08 23:01:21.000000 jtreg-test-output/jdk/1/JTreport/text/ │ │ │ │ │ --rw-r--r-- 0 sbuild (999) sbuild (999) 132 2026-10-08 23:01:21.000000 jtreg-test-output/jdk/1/JTreport/text/testng.txt │ │ │ │ │ --rw-r--r-- 0 sbuild (999) sbuild (999) 1023412 2026-10-08 23:01:21.000000 jtreg-test-output/jdk/1/JTreport/text/notRun.txt │ │ │ │ │ --rw-r--r-- 0 sbuild (999) sbuild (999) 101 2026-10-08 23:01:21.000000 jtreg-test-output/jdk/1/JTreport/text/stats.txt │ │ │ │ │ --rw-r--r-- 0 sbuild (999) sbuild (999) 116 2026-10-08 23:01:21.000000 jtreg-test-output/jdk/1/JTreport/text/timeStats.txt │ │ │ │ │ --rw-r--r-- 0 sbuild (999) sbuild (999) 21 2026-10-08 23:01:21.000000 jtreg-test-output/jdk/1/JTreport/text/tc_newfailures.txt │ │ │ │ │ --rw-r--r-- 0 sbuild (999) sbuild (999) 21 2026-10-08 23:01:21.000000 jtreg-test-output/jdk/1/JTreport/text/tc_fail2notrun.txt │ │ │ │ │ --rw-r--r-- 0 sbuild (999) sbuild (999) 20 2026-10-08 23:01:21.000000 jtreg-test-output/jdk/1/JTreport/text/tc_fail2error.txt │ │ │ │ │ --rw-r--r-- 0 sbuild (999) sbuild (999) 19 2026-10-08 23:01:21.000000 jtreg-test-output/jdk/1/JTreport/text/tc_fail2pass.txt │ │ │ │ │ --rw-r--r-- 0 sbuild (999) sbuild (999) 22 2026-10-08 23:01:21.000000 jtreg-test-output/jdk/1/JTreport/text/tc_fail2missing.txt │ │ │ │ │ --rw-r--r-- 0 sbuild (999) sbuild (999) 19 2026-10-08 23:01:21.000000 jtreg-test-output/jdk/1/JTreport/text/other_errors.txt │ │ │ │ │ --rw-r--r-- 0 sbuild (999) sbuild (999) 416 2026-10-08 23:01:21.000000 jtreg-test-output/jdk/1/JTreport/text/newfailures.txt │ │ │ │ │ --rw-r--r-- 0 sbuild (999) sbuild (999) 16 2026-10-08 23:01:21.000000 jtreg-test-output/jdk/1/JTreport/text/fail2fail.txt │ │ │ │ │ --rw-r--r-- 0 sbuild (999) sbuild (999) 18 2026-10-08 23:01:21.000000 jtreg-test-output/jdk/1/JTreport/text/fail2notrun.txt │ │ │ │ │ --rw-r--r-- 0 sbuild (999) sbuild (999) 17 2026-10-08 23:01:21.000000 jtreg-test-output/jdk/1/JTreport/text/faiL2error.txt │ │ │ │ │ --rw-r--r-- 0 sbuild (999) sbuild (999) 16 2026-10-08 23:01:21.000000 jtreg-test-output/jdk/1/JTreport/text/fail2pass.txt │ │ │ │ │ --rw-r--r-- 0 sbuild (999) sbuild (999) 19 2026-10-08 23:01:21.000000 jtreg-test-output/jdk/1/JTreport/text/fail2missing.txt │ │ │ │ │ --rw-r--r-- 0 sbuild (999) sbuild (999) 891389 2026-10-08 23:01:21.000000 jtreg-test-output/jdk/1/JTreport/text/summary.txt │ │ │ │ │ --rw-r--r-- 0 sbuild (999) sbuild (999) 552 2026-10-08 23:00:57.000000 jtreg-test-output/jdk/1/JTreport/text/cmdArgs.txt │ │ │ │ │ -drwxr-xr-x 0 sbuild (999) sbuild (999) 0 2026-10-08 23:00:38.000000 jtreg-test-output/jdk/0/JTreport/ │ │ │ │ │ --rw-r--r-- 0 sbuild (999) sbuild (999) 712 2026-10-08 23:00:38.000000 jtreg-test-output/jdk/0/JTreport/index.html │ │ │ │ │ --rw-r--r-- 0 sbuild (999) sbuild (999) 0 2026-10-08 23:00:38.000000 jtreg-test-output/jdk/0/JTreport/reportdir.dat │ │ │ │ │ -drwxr-xr-x 0 sbuild (999) sbuild (999) 0 2026-10-08 23:00:38.000000 jtreg-test-output/jdk/0/JTreport/html/ │ │ │ │ │ --rw-r--r-- 0 sbuild (999) sbuild (999) 20877 2026-10-08 23:00:38.000000 jtreg-test-output/jdk/0/JTreport/html/notRun_gr.html │ │ │ │ │ --rw-r--r-- 0 sbuild (999) sbuild (999) 20532 2026-10-08 23:00:38.000000 jtreg-test-output/jdk/0/JTreport/html/notRun.html │ │ │ │ │ --rw-r--r-- 0 sbuild (999) sbuild (999) 521 2026-10-08 23:00:38.000000 jtreg-test-output/jdk/0/JTreport/html/error_gr.html │ │ │ │ │ --rw-r--r-- 0 sbuild (999) sbuild (999) 473 2026-10-08 23:00:38.000000 jtreg-test-output/jdk/0/JTreport/html/error.html │ │ │ │ │ --rw-r--r-- 0 sbuild (999) sbuild (999) 2750 2026-10-08 23:00:38.000000 jtreg-test-output/jdk/0/JTreport/html/failed_gr.html │ │ │ │ │ --rw-r--r-- 0 sbuild (999) sbuild (999) 2020 2026-10-08 23:00:38.000000 jtreg-test-output/jdk/0/JTreport/html/failed.html │ │ │ │ │ --rw-r--r-- 0 sbuild (999) sbuild (999) 1251885 2026-10-08 23:00:38.000000 jtreg-test-output/jdk/0/JTreport/html/passed_gr.html │ │ │ │ │ --rw-r--r-- 0 sbuild (999) sbuild (999) 1249854 2026-10-08 23:00:38.000000 jtreg-test-output/jdk/0/JTreport/html/passed.html │ │ │ │ │ --rw-r--r-- 0 sbuild (999) sbuild (999) 83174 2026-10-08 23:00:37.000000 jtreg-test-output/jdk/0/JTreport/html/excluded.html │ │ │ │ │ --rw-r--r-- 0 sbuild (999) sbuild (999) 4237 2026-10-08 23:00:37.000000 jtreg-test-output/jdk/0/JTreport/html/env.html │ │ │ │ │ --rw-r--r-- 0 sbuild (999) sbuild (999) 23926 2026-10-08 23:00:37.000000 jtreg-test-output/jdk/0/JTreport/html/config.html │ │ │ │ │ --rw-r--r-- 0 sbuild (999) sbuild (999) 307 2026-10-08 23:00:37.000000 jtreg-test-output/jdk/0/JTreport/html/report.css │ │ │ │ │ --rw-r--r-- 0 sbuild (999) sbuild (999) 1124333 2026-10-08 23:00:37.000000 jtreg-test-output/jdk/0/JTreport/html/index.html │ │ │ │ │ --rw-r--r-- 0 sbuild (999) sbuild (999) 1124333 2026-10-08 23:00:37.000000 jtreg-test-output/jdk/0/JTreport/html/report.html │ │ │ │ │ -drwxr-xr-x 0 sbuild (999) sbuild (999) 0 2026-10-08 23:00:38.000000 jtreg-test-output/jdk/0/JTreport/text/ │ │ │ │ │ --rw-r--r-- 0 sbuild (999) sbuild (999) 85819 2026-10-08 23:00:38.000000 jtreg-test-output/jdk/0/JTreport/text/junit.txt │ │ │ │ │ --rw-r--r-- 0 sbuild (999) sbuild (999) 132051 2026-10-08 23:00:38.000000 jtreg-test-output/jdk/0/JTreport/text/testng.txt │ │ │ │ │ --rw-r--r-- 0 sbuild (999) sbuild (999) 26565 2026-10-08 23:00:38.000000 jtreg-test-output/jdk/0/JTreport/text/notRun.txt │ │ │ │ │ --rw-r--r-- 0 sbuild (999) sbuild (999) 173 2026-10-08 23:00:38.000000 jtreg-test-output/jdk/0/JTreport/text/stats.txt │ │ │ │ │ --rw-r--r-- 0 sbuild (999) sbuild (999) 1055 2026-10-08 23:00:38.000000 jtreg-test-output/jdk/0/JTreport/text/timeStats.txt │ │ │ │ │ --rw-r--r-- 0 sbuild (999) sbuild (999) 21 2026-10-08 23:00:38.000000 jtreg-test-output/jdk/0/JTreport/text/tc_newfailures.txt │ │ │ │ │ --rw-r--r-- 0 sbuild (999) sbuild (999) 21 2026-10-08 23:00:38.000000 jtreg-test-output/jdk/0/JTreport/text/tc_fail2notrun.txt │ │ │ │ │ --rw-r--r-- 0 sbuild (999) sbuild (999) 20 2026-10-08 23:00:38.000000 jtreg-test-output/jdk/0/JTreport/text/tc_fail2error.txt │ │ │ │ │ --rw-r--r-- 0 sbuild (999) sbuild (999) 19 2026-10-08 23:00:38.000000 jtreg-test-output/jdk/0/JTreport/text/tc_fail2pass.txt │ │ │ │ │ --rw-r--r-- 0 sbuild (999) sbuild (999) 22 2026-10-08 23:00:38.000000 jtreg-test-output/jdk/0/JTreport/text/tc_fail2missing.txt │ │ │ │ │ --rw-r--r-- 0 sbuild (999) sbuild (999) 19 2026-10-08 23:00:38.000000 jtreg-test-output/jdk/0/JTreport/text/other_errors.txt │ │ │ │ │ --rw-r--r-- 0 sbuild (999) sbuild (999) 416 2026-10-08 23:00:38.000000 jtreg-test-output/jdk/0/JTreport/text/newfailures.txt │ │ │ │ │ --rw-r--r-- 0 sbuild (999) sbuild (999) 16 2026-10-08 23:00:38.000000 jtreg-test-output/jdk/0/JTreport/text/fail2fail.txt │ │ │ │ │ --rw-r--r-- 0 sbuild (999) sbuild (999) 18 2026-10-08 23:00:38.000000 jtreg-test-output/jdk/0/JTreport/text/fail2notrun.txt │ │ │ │ │ --rw-r--r-- 0 sbuild (999) sbuild (999) 17 2026-10-08 23:00:38.000000 jtreg-test-output/jdk/0/JTreport/text/faiL2error.txt │ │ │ │ │ --rw-r--r-- 0 sbuild (999) sbuild (999) 16 2026-10-08 23:00:38.000000 jtreg-test-output/jdk/0/JTreport/text/fail2pass.txt │ │ │ │ │ --rw-r--r-- 0 sbuild (999) sbuild (999) 19 2026-10-08 23:00:38.000000 jtreg-test-output/jdk/0/JTreport/text/fail2missing.txt │ │ │ │ │ --rw-r--r-- 0 sbuild (999) sbuild (999) 892067 2026-10-08 23:00:38.000000 jtreg-test-output/jdk/0/JTreport/text/summary.txt │ │ │ │ │ --rw-r--r-- 0 sbuild (999) sbuild (999) 533 2026-10-08 17:55:46.000000 jtreg-test-output/jdk/0/JTreport/text/cmdArgs.txt │ │ │ │ │ -lrwxrwxrwx 0 sbuild (999) sbuild (999) 0 2026-10-08 17:55:42.000000 jtreg-test-output/jaxp/JTreport -> 0/JTreport │ │ │ │ │ -drwxr-xr-x 0 sbuild (999) sbuild (999) 0 2026-10-08 17:55:40.000000 jtreg-test-output/jaxp/0/JTreport/ │ │ │ │ │ --rw-r--r-- 0 sbuild (999) sbuild (999) 714 2026-10-08 17:55:40.000000 jtreg-test-output/jaxp/0/JTreport/index.html │ │ │ │ │ --rw-r--r-- 0 sbuild (999) sbuild (999) 0 2026-10-08 17:55:40.000000 jtreg-test-output/jaxp/0/JTreport/reportdir.dat │ │ │ │ │ -drwxr-xr-x 0 sbuild (999) sbuild (999) 0 2026-10-08 17:55:40.000000 jtreg-test-output/jaxp/0/JTreport/html/ │ │ │ │ │ --rw-r--r-- 0 sbuild (999) sbuild (999) 694 2026-10-08 17:55:40.000000 jtreg-test-output/jaxp/0/JTreport/html/notRun_gr.html │ │ │ │ │ --rw-r--r-- 0 sbuild (999) sbuild (999) 572 2026-10-08 17:55:40.000000 jtreg-test-output/jaxp/0/JTreport/html/notRun.html │ │ │ │ │ --rw-r--r-- 0 sbuild (999) sbuild (999) 520 2026-10-08 17:55:40.000000 jtreg-test-output/jaxp/0/JTreport/html/error_gr.html │ │ │ │ │ --rw-r--r-- 0 sbuild (999) sbuild (999) 472 2026-10-08 17:55:40.000000 jtreg-test-output/jaxp/0/JTreport/html/error.html │ │ │ │ │ --rw-r--r-- 0 sbuild (999) sbuild (999) 512 2026-10-08 17:55:40.000000 jtreg-test-output/jaxp/0/JTreport/html/failed_gr.html │ │ │ │ │ --rw-r--r-- 0 sbuild (999) sbuild (999) 464 2026-10-08 17:55:40.000000 jtreg-test-output/jaxp/0/JTreport/html/failed.html │ │ │ │ │ --rw-r--r-- 0 sbuild (999) sbuild (999) 110061 2026-10-08 17:55:40.000000 jtreg-test-output/jaxp/0/JTreport/html/passed_gr.html │ │ │ │ │ --rw-r--r-- 0 sbuild (999) sbuild (999) 109972 2026-10-08 17:55:40.000000 jtreg-test-output/jaxp/0/JTreport/html/passed.html │ │ │ │ │ --rw-r--r-- 0 sbuild (999) sbuild (999) 3641 2026-10-08 17:55:40.000000 jtreg-test-output/jaxp/0/JTreport/html/excluded.html │ │ │ │ │ --rw-r--r-- 0 sbuild (999) sbuild (999) 4144 2026-10-08 17:55:40.000000 jtreg-test-output/jaxp/0/JTreport/html/env.html │ │ │ │ │ --rw-r--r-- 0 sbuild (999) sbuild (999) 4425 2026-10-08 17:55:40.000000 jtreg-test-output/jaxp/0/JTreport/html/config.html │ │ │ │ │ --rw-r--r-- 0 sbuild (999) sbuild (999) 307 2026-10-08 17:55:40.000000 jtreg-test-output/jaxp/0/JTreport/html/report.css │ │ │ │ │ --rw-r--r-- 0 sbuild (999) sbuild (999) 58501 2026-10-08 17:55:40.000000 jtreg-test-output/jaxp/0/JTreport/html/index.html │ │ │ │ │ --rw-r--r-- 0 sbuild (999) sbuild (999) 58501 2026-10-08 17:55:40.000000 jtreg-test-output/jaxp/0/JTreport/html/report.html │ │ │ │ │ -drwxr-xr-x 0 sbuild (999) sbuild (999) 0 2026-10-08 17:55:41.000000 jtreg-test-output/jaxp/0/JTreport/text/ │ │ │ │ │ --rw-r--r-- 0 sbuild (999) sbuild (999) 200 2026-10-08 17:55:41.000000 jtreg-test-output/jaxp/0/JTreport/text/junit.txt │ │ │ │ │ --rw-r--r-- 0 sbuild (999) sbuild (999) 69461 2026-10-08 17:55:41.000000 jtreg-test-output/jaxp/0/JTreport/text/testng.txt │ │ │ │ │ --rw-r--r-- 0 sbuild (999) sbuild (999) 116 2026-10-08 17:55:40.000000 jtreg-test-output/jaxp/0/JTreport/text/notRun.txt │ │ │ │ │ --rw-r--r-- 0 sbuild (999) sbuild (999) 65 2026-10-08 17:55:40.000000 jtreg-test-output/jaxp/0/JTreport/text/stats.txt │ │ │ │ │ --rw-r--r-- 0 sbuild (999) sbuild (999) 202 2026-10-08 17:55:40.000000 jtreg-test-output/jaxp/0/JTreport/text/timeStats.txt │ │ │ │ │ --rw-r--r-- 0 sbuild (999) sbuild (999) 21 2026-10-08 17:55:40.000000 jtreg-test-output/jaxp/0/JTreport/text/tc_newfailures.txt │ │ │ │ │ --rw-r--r-- 0 sbuild (999) sbuild (999) 21 2026-10-08 17:55:40.000000 jtreg-test-output/jaxp/0/JTreport/text/tc_fail2notrun.txt │ │ │ │ │ --rw-r--r-- 0 sbuild (999) sbuild (999) 20 2026-10-08 17:55:40.000000 jtreg-test-output/jaxp/0/JTreport/text/tc_fail2error.txt │ │ │ │ │ --rw-r--r-- 0 sbuild (999) sbuild (999) 19 2026-10-08 17:55:40.000000 jtreg-test-output/jaxp/0/JTreport/text/tc_fail2pass.txt │ │ │ │ │ --rw-r--r-- 0 sbuild (999) sbuild (999) 22 2026-10-08 17:55:40.000000 jtreg-test-output/jaxp/0/JTreport/text/tc_fail2missing.txt │ │ │ │ │ --rw-r--r-- 0 sbuild (999) sbuild (999) 19 2026-10-08 17:55:40.000000 jtreg-test-output/jaxp/0/JTreport/text/other_errors.txt │ │ │ │ │ --rw-r--r-- 0 sbuild (999) sbuild (999) 18 2026-10-08 17:55:40.000000 jtreg-test-output/jaxp/0/JTreport/text/newfailures.txt │ │ │ │ │ --rw-r--r-- 0 sbuild (999) sbuild (999) 16 2026-10-08 17:55:40.000000 jtreg-test-output/jaxp/0/JTreport/text/fail2fail.txt │ │ │ │ │ --rw-r--r-- 0 sbuild (999) sbuild (999) 18 2026-10-08 17:55:40.000000 jtreg-test-output/jaxp/0/JTreport/text/fail2notrun.txt │ │ │ │ │ --rw-r--r-- 0 sbuild (999) sbuild (999) 17 2026-10-08 17:55:40.000000 jtreg-test-output/jaxp/0/JTreport/text/faiL2error.txt │ │ │ │ │ --rw-r--r-- 0 sbuild (999) sbuild (999) 16 2026-10-08 17:55:40.000000 jtreg-test-output/jaxp/0/JTreport/text/fail2pass.txt │ │ │ │ │ --rw-r--r-- 0 sbuild (999) sbuild (999) 19 2026-10-08 17:55:40.000000 jtreg-test-output/jaxp/0/JTreport/text/fail2missing.txt │ │ │ │ │ --rw-r--r-- 0 sbuild (999) sbuild (999) 59118 2026-10-08 17:55:40.000000 jtreg-test-output/jaxp/0/JTreport/text/summary.txt │ │ │ │ │ --rw-r--r-- 0 sbuild (999) sbuild (999) 441 2026-10-08 17:27:05.000000 jtreg-test-output/jaxp/0/JTreport/text/cmdArgs.txt │ │ │ │ │ -lrwxrwxrwx 0 sbuild (999) sbuild (999) 0 2026-10-08 17:27:04.000000 jtreg-test-output/langtools/JTreport -> 0/JTreport │ │ │ │ │ -drwxr-xr-x 0 sbuild (999) sbuild (999) 0 2026-10-08 17:26:51.000000 jtreg-test-output/langtools/0/JTreport/ │ │ │ │ │ --rw-r--r-- 0 sbuild (999) sbuild (999) 724 2026-10-08 17:26:51.000000 jtreg-test-output/langtools/0/JTreport/index.html │ │ │ │ │ --rw-r--r-- 0 sbuild (999) sbuild (999) 0 2026-10-08 17:26:51.000000 jtreg-test-output/langtools/0/JTreport/reportdir.dat │ │ │ │ │ -drwxr-xr-x 0 sbuild (999) sbuild (999) 0 2026-10-08 17:26:51.000000 jtreg-test-output/langtools/0/JTreport/html/ │ │ │ │ │ --rw-r--r-- 0 sbuild (999) sbuild (999) 2462 2026-10-08 17:26:51.000000 jtreg-test-output/langtools/0/JTreport/html/notRun_gr.html │ │ │ │ │ --rw-r--r-- 0 sbuild (999) sbuild (999) 2173 2026-10-08 17:26:51.000000 jtreg-test-output/langtools/0/JTreport/html/notRun.html │ │ │ │ │ --rw-r--r-- 0 sbuild (999) sbuild (999) 520 2026-10-08 17:26:51.000000 jtreg-test-output/langtools/0/JTreport/html/error_gr.html │ │ │ │ │ --rw-r--r-- 0 sbuild (999) sbuild (999) 472 2026-10-08 17:26:51.000000 jtreg-test-output/langtools/0/JTreport/html/error.html │ │ │ │ │ --rw-r--r-- 0 sbuild (999) sbuild (999) 512 2026-10-08 17:26:51.000000 jtreg-test-output/langtools/0/JTreport/html/failed_gr.html │ │ │ │ │ --rw-r--r-- 0 sbuild (999) sbuild (999) 464 2026-10-08 17:26:51.000000 jtreg-test-output/langtools/0/JTreport/html/failed.html │ │ │ │ │ --rw-r--r-- 0 sbuild (999) sbuild (999) 885491 2026-10-08 17:26:51.000000 jtreg-test-output/langtools/0/JTreport/html/passed_gr.html │ │ │ │ │ --rw-r--r-- 0 sbuild (999) sbuild (999) 885166 2026-10-08 17:26:51.000000 jtreg-test-output/langtools/0/JTreport/html/passed.html │ │ │ │ │ --rw-r--r-- 0 sbuild (999) sbuild (999) 6194 2026-10-08 17:26:50.000000 jtreg-test-output/langtools/0/JTreport/html/excluded.html │ │ │ │ │ --rw-r--r-- 0 sbuild (999) sbuild (999) 4159 2026-10-08 17:26:50.000000 jtreg-test-output/langtools/0/JTreport/html/env.html │ │ │ │ │ --rw-r--r-- 0 sbuild (999) sbuild (999) 10727 2026-10-08 17:26:50.000000 jtreg-test-output/langtools/0/JTreport/html/config.html │ │ │ │ │ --rw-r--r-- 0 sbuild (999) sbuild (999) 307 2026-10-08 17:26:50.000000 jtreg-test-output/langtools/0/JTreport/html/report.css │ │ │ │ │ --rw-r--r-- 0 sbuild (999) sbuild (999) 541946 2026-10-08 17:26:50.000000 jtreg-test-output/langtools/0/JTreport/html/index.html │ │ │ │ │ --rw-r--r-- 0 sbuild (999) sbuild (999) 541946 2026-10-08 17:26:50.000000 jtreg-test-output/langtools/0/JTreport/html/report.html │ │ │ │ │ -drwxr-xr-x 0 sbuild (999) sbuild (999) 0 2026-10-08 17:26:51.000000 jtreg-test-output/langtools/0/JTreport/text/ │ │ │ │ │ --rw-r--r-- 0 sbuild (999) sbuild (999) 18550 2026-10-08 17:26:51.000000 jtreg-test-output/langtools/0/JTreport/text/junit.txt │ │ │ │ │ --rw-r--r-- 0 sbuild (999) sbuild (999) 9538 2026-10-08 17:26:51.000000 jtreg-test-output/langtools/0/JTreport/text/testng.txt │ │ │ │ │ --rw-r--r-- 0 sbuild (999) sbuild (999) 1921 2026-10-08 17:26:51.000000 jtreg-test-output/langtools/0/JTreport/text/notRun.txt │ │ │ │ │ --rw-r--r-- 0 sbuild (999) sbuild (999) 120 2026-10-08 17:26:51.000000 jtreg-test-output/langtools/0/JTreport/text/stats.txt │ │ │ │ │ --rw-r--r-- 0 sbuild (999) sbuild (999) 526 2026-10-08 17:26:51.000000 jtreg-test-output/langtools/0/JTreport/text/timeStats.txt │ │ │ │ │ --rw-r--r-- 0 sbuild (999) sbuild (999) 21 2026-10-08 17:26:51.000000 jtreg-test-output/langtools/0/JTreport/text/tc_newfailures.txt │ │ │ │ │ --rw-r--r-- 0 sbuild (999) sbuild (999) 21 2026-10-08 17:26:51.000000 jtreg-test-output/langtools/0/JTreport/text/tc_fail2notrun.txt │ │ │ │ │ --rw-r--r-- 0 sbuild (999) sbuild (999) 20 2026-10-08 17:26:51.000000 jtreg-test-output/langtools/0/JTreport/text/tc_fail2error.txt │ │ │ │ │ --rw-r--r-- 0 sbuild (999) sbuild (999) 19 2026-10-08 17:26:51.000000 jtreg-test-output/langtools/0/JTreport/text/tc_fail2pass.txt │ │ │ │ │ --rw-r--r-- 0 sbuild (999) sbuild (999) 22 2026-10-08 17:26:51.000000 jtreg-test-output/langtools/0/JTreport/text/tc_fail2missing.txt │ │ │ │ │ --rw-r--r-- 0 sbuild (999) sbuild (999) 19 2026-10-08 17:26:51.000000 jtreg-test-output/langtools/0/JTreport/text/other_errors.txt │ │ │ │ │ --rw-r--r-- 0 sbuild (999) sbuild (999) 18 2026-10-08 17:26:51.000000 jtreg-test-output/langtools/0/JTreport/text/newfailures.txt │ │ │ │ │ --rw-r--r-- 0 sbuild (999) sbuild (999) 16 2026-10-08 17:26:51.000000 jtreg-test-output/langtools/0/JTreport/text/fail2fail.txt │ │ │ │ │ --rw-r--r-- 0 sbuild (999) sbuild (999) 18 2026-10-08 17:26:51.000000 jtreg-test-output/langtools/0/JTreport/text/fail2notrun.txt │ │ │ │ │ --rw-r--r-- 0 sbuild (999) sbuild (999) 17 2026-10-08 17:26:51.000000 jtreg-test-output/langtools/0/JTreport/text/faiL2error.txt │ │ │ │ │ --rw-r--r-- 0 sbuild (999) sbuild (999) 16 2026-10-08 17:26:51.000000 jtreg-test-output/langtools/0/JTreport/text/fail2pass.txt │ │ │ │ │ --rw-r--r-- 0 sbuild (999) sbuild (999) 19 2026-10-08 17:26:51.000000 jtreg-test-output/langtools/0/JTreport/text/fail2missing.txt │ │ │ │ │ --rw-r--r-- 0 sbuild (999) sbuild (999) 643622 2026-10-08 17:26:51.000000 jtreg-test-output/langtools/0/JTreport/text/summary.txt │ │ │ │ │ --rw-r--r-- 0 sbuild (999) sbuild (999) 456 2026-10-08 16:35:22.000000 jtreg-test-output/langtools/0/JTreport/text/cmdArgs.txt │ │ │ │ │ -lrwxrwxrwx 0 sbuild (999) sbuild (999) 0 2026-10-08 16:35:21.000000 jtreg-test-output/hotspot/JTreport -> 0/JTreport │ │ │ │ │ -drwxr-xr-x 0 sbuild (999) sbuild (999) 0 2026-10-08 16:35:12.000000 jtreg-test-output/hotspot/0/JTreport/ │ │ │ │ │ --rw-r--r-- 0 sbuild (999) sbuild (999) 726 2026-10-08 16:35:12.000000 jtreg-test-output/hotspot/0/JTreport/index.html │ │ │ │ │ --rw-r--r-- 0 sbuild (999) sbuild (999) 0 2026-10-08 16:35:12.000000 jtreg-test-output/hotspot/0/JTreport/reportdir.dat │ │ │ │ │ -drwxr-xr-x 0 sbuild (999) sbuild (999) 0 2026-10-08 16:35:12.000000 jtreg-test-output/hotspot/0/JTreport/html/ │ │ │ │ │ --rw-r--r-- 0 sbuild (999) sbuild (999) 49643 2026-10-08 16:35:12.000000 jtreg-test-output/hotspot/0/JTreport/html/notRun_gr.html │ │ │ │ │ --rw-r--r-- 0 sbuild (999) sbuild (999) 49298 2026-10-08 16:35:12.000000 jtreg-test-output/hotspot/0/JTreport/html/notRun.html │ │ │ │ │ --rw-r--r-- 0 sbuild (999) sbuild (999) 520 2026-10-08 16:35:12.000000 jtreg-test-output/hotspot/0/JTreport/html/error_gr.html │ │ │ │ │ --rw-r--r-- 0 sbuild (999) sbuild (999) 472 2026-10-08 16:35:12.000000 jtreg-test-output/hotspot/0/JTreport/html/error.html │ │ │ │ │ --rw-r--r-- 0 sbuild (999) sbuild (999) 512 2026-10-08 16:35:12.000000 jtreg-test-output/hotspot/0/JTreport/html/failed_gr.html │ │ │ │ │ --rw-r--r-- 0 sbuild (999) sbuild (999) 464 2026-10-08 16:35:12.000000 jtreg-test-output/hotspot/0/JTreport/html/failed.html │ │ │ │ │ --rw-r--r-- 0 sbuild (999) sbuild (999) 607779 2026-10-08 16:35:12.000000 jtreg-test-output/hotspot/0/JTreport/html/passed_gr.html │ │ │ │ │ --rw-r--r-- 0 sbuild (999) sbuild (999) 607388 2026-10-08 16:35:12.000000 jtreg-test-output/hotspot/0/JTreport/html/passed.html │ │ │ │ │ --rw-r--r-- 0 sbuild (999) sbuild (999) 18323 2026-10-08 16:35:12.000000 jtreg-test-output/hotspot/0/JTreport/html/excluded.html │ │ │ │ │ --rw-r--r-- 0 sbuild (999) sbuild (999) 4258 2026-10-08 16:35:12.000000 jtreg-test-output/hotspot/0/JTreport/html/env.html │ │ │ │ │ --rw-r--r-- 0 sbuild (999) sbuild (999) 78259 2026-10-08 16:35:12.000000 jtreg-test-output/hotspot/0/JTreport/html/config.html │ │ │ │ │ --rw-r--r-- 0 sbuild (999) sbuild (999) 307 2026-10-08 16:35:12.000000 jtreg-test-output/hotspot/0/JTreport/html/report.css │ │ │ │ │ --rw-r--r-- 0 sbuild (999) sbuild (999) 529190 2026-10-08 16:35:12.000000 jtreg-test-output/hotspot/0/JTreport/html/index.html │ │ │ │ │ --rw-r--r-- 0 sbuild (999) sbuild (999) 529190 2026-10-08 16:35:12.000000 jtreg-test-output/hotspot/0/JTreport/html/report.html │ │ │ │ │ -drwxr-xr-x 0 sbuild (999) sbuild (999) 0 2026-10-08 16:35:12.000000 jtreg-test-output/hotspot/0/JTreport/text/ │ │ │ │ │ --rw-r--r-- 0 sbuild (999) sbuild (999) 3273 2026-10-08 16:35:12.000000 jtreg-test-output/hotspot/0/JTreport/text/junit.txt │ │ │ │ │ --rw-r--r-- 0 sbuild (999) sbuild (999) 7594 2026-10-08 16:35:12.000000 jtreg-test-output/hotspot/0/JTreport/text/testng.txt │ │ │ │ │ --rw-r--r-- 0 sbuild (999) sbuild (999) 76794 2026-10-08 16:35:12.000000 jtreg-test-output/hotspot/0/JTreport/text/notRun.txt │ │ │ │ │ --rw-r--r-- 0 sbuild (999) sbuild (999) 161 2026-10-08 16:35:12.000000 jtreg-test-output/hotspot/0/JTreport/text/stats.txt │ │ │ │ │ --rw-r--r-- 0 sbuild (999) sbuild (999) 1007 2026-10-08 16:35:12.000000 jtreg-test-output/hotspot/0/JTreport/text/timeStats.txt │ │ │ │ │ --rw-r--r-- 0 sbuild (999) sbuild (999) 21 2026-10-08 16:35:12.000000 jtreg-test-output/hotspot/0/JTreport/text/tc_newfailures.txt │ │ │ │ │ --rw-r--r-- 0 sbuild (999) sbuild (999) 21 2026-10-08 16:35:12.000000 jtreg-test-output/hotspot/0/JTreport/text/tc_fail2notrun.txt │ │ │ │ │ --rw-r--r-- 0 sbuild (999) sbuild (999) 20 2026-10-08 16:35:12.000000 jtreg-test-output/hotspot/0/JTreport/text/tc_fail2error.txt │ │ │ │ │ --rw-r--r-- 0 sbuild (999) sbuild (999) 19 2026-10-08 16:35:12.000000 jtreg-test-output/hotspot/0/JTreport/text/tc_fail2pass.txt │ │ │ │ │ --rw-r--r-- 0 sbuild (999) sbuild (999) 22 2026-10-08 16:35:12.000000 jtreg-test-output/hotspot/0/JTreport/text/tc_fail2missing.txt │ │ │ │ │ --rw-r--r-- 0 sbuild (999) sbuild (999) 19 2026-10-08 16:35:12.000000 jtreg-test-output/hotspot/0/JTreport/text/other_errors.txt │ │ │ │ │ --rw-r--r-- 0 sbuild (999) sbuild (999) 18 2026-10-08 16:35:12.000000 jtreg-test-output/hotspot/0/JTreport/text/newfailures.txt │ │ │ │ │ --rw-r--r-- 0 sbuild (999) sbuild (999) 16 2026-10-08 16:35:12.000000 jtreg-test-output/hotspot/0/JTreport/text/fail2fail.txt │ │ │ │ │ --rw-r--r-- 0 sbuild (999) sbuild (999) 18 2026-10-08 16:35:12.000000 jtreg-test-output/hotspot/0/JTreport/text/fail2notrun.txt │ │ │ │ │ --rw-r--r-- 0 sbuild (999) sbuild (999) 17 2026-10-08 16:35:12.000000 jtreg-test-output/hotspot/0/JTreport/text/faiL2error.txt │ │ │ │ │ --rw-r--r-- 0 sbuild (999) sbuild (999) 16 2026-10-08 16:35:12.000000 jtreg-test-output/hotspot/0/JTreport/text/fail2pass.txt │ │ │ │ │ --rw-r--r-- 0 sbuild (999) sbuild (999) 19 2026-10-08 16:35:12.000000 jtreg-test-output/hotspot/0/JTreport/text/fail2missing.txt │ │ │ │ │ --rw-r--r-- 0 sbuild (999) sbuild (999) 456559 2026-10-08 16:35:12.000000 jtreg-test-output/hotspot/0/JTreport/text/summary.txt │ │ │ │ │ --rw-r--r-- 0 sbuild (999) sbuild (999) 555 2026-10-08 12:41:27.000000 jtreg-test-output/hotspot/0/JTreport/text/cmdArgs.txt │ │ │ │ │ +drwxr-xr-x 0 sbuild (999) sbuild (999) 0 2026-10-20 11:17:26.000000 jtreg-test-output/hotspot/1/JTreport/ │ │ │ │ │ +-rw-r--r-- 0 sbuild (999) sbuild (999) 0 2026-10-20 11:17:26.000000 jtreg-test-output/hotspot/1/JTreport/reportdir.dat │ │ │ │ │ +drwxr-xr-x 0 sbuild (999) sbuild (999) 0 2026-10-20 11:17:26.000000 jtreg-test-output/hotspot/1/JTreport/html/ │ │ │ │ │ +-rw-r--r-- 0 sbuild (999) sbuild (999) 18325 2026-10-20 11:17:26.000000 jtreg-test-output/hotspot/1/JTreport/html/excluded.html │ │ │ │ │ +-rw-r--r-- 0 sbuild (999) sbuild (999) 607485 2026-10-20 11:17:26.000000 jtreg-test-output/hotspot/1/JTreport/html/passed_gr.html │ │ │ │ │ +-rw-r--r-- 0 sbuild (999) sbuild (999) 307 2026-10-20 11:17:25.000000 jtreg-test-output/hotspot/1/JTreport/html/report.css │ │ │ │ │ +-rw-r--r-- 0 sbuild (999) sbuild (999) 762 2026-10-20 11:17:26.000000 jtreg-test-output/hotspot/1/JTreport/html/failed.html │ │ │ │ │ +-rw-r--r-- 0 sbuild (999) sbuild (999) 593197 2026-10-20 11:17:26.000000 jtreg-test-output/hotspot/1/JTreport/html/report.html │ │ │ │ │ +-rw-r--r-- 0 sbuild (999) sbuild (999) 607094 2026-10-20 11:17:26.000000 jtreg-test-output/hotspot/1/JTreport/html/passed.html │ │ │ │ │ +-rw-r--r-- 0 sbuild (999) sbuild (999) 78691 2026-10-20 11:17:26.000000 jtreg-test-output/hotspot/1/JTreport/html/config.html │ │ │ │ │ +-rw-r--r-- 0 sbuild (999) sbuild (999) 957 2026-10-20 11:17:26.000000 jtreg-test-output/hotspot/1/JTreport/html/failed_gr.html │ │ │ │ │ +-rw-r--r-- 0 sbuild (999) sbuild (999) 522 2026-10-20 11:17:26.000000 jtreg-test-output/hotspot/1/JTreport/html/error_gr.html │ │ │ │ │ +-rw-r--r-- 0 sbuild (999) sbuild (999) 4283 2026-10-20 11:17:26.000000 jtreg-test-output/hotspot/1/JTreport/html/env.html │ │ │ │ │ +-rw-r--r-- 0 sbuild (999) sbuild (999) 404060 2026-10-20 11:17:26.000000 jtreg-test-output/hotspot/1/JTreport/html/notRun_gr.html │ │ │ │ │ +-rw-r--r-- 0 sbuild (999) sbuild (999) 593197 2026-10-20 11:17:26.000000 jtreg-test-output/hotspot/1/JTreport/html/index.html │ │ │ │ │ +-rw-r--r-- 0 sbuild (999) sbuild (999) 403787 2026-10-20 11:17:26.000000 jtreg-test-output/hotspot/1/JTreport/html/notRun.html │ │ │ │ │ +-rw-r--r-- 0 sbuild (999) sbuild (999) 474 2026-10-20 11:17:26.000000 jtreg-test-output/hotspot/1/JTreport/html/error.html │ │ │ │ │ +drwxr-xr-x 0 sbuild (999) sbuild (999) 0 2026-10-20 11:17:26.000000 jtreg-test-output/hotspot/1/JTreport/text/ │ │ │ │ │ +-rw-r--r-- 0 sbuild (999) sbuild (999) 17 2026-10-20 11:17:26.000000 jtreg-test-output/hotspot/1/JTreport/text/faiL2error.txt │ │ │ │ │ +-rw-r--r-- 0 sbuild (999) sbuild (999) 21 2026-10-20 11:17:26.000000 jtreg-test-output/hotspot/1/JTreport/text/tc_fail2notrun.txt │ │ │ │ │ +-rw-r--r-- 0 sbuild (999) sbuild (999) 16 2026-10-20 11:17:26.000000 jtreg-test-output/hotspot/1/JTreport/text/fail2pass.txt │ │ │ │ │ +-rw-r--r-- 0 sbuild (999) sbuild (999) 456665 2026-10-20 11:17:26.000000 jtreg-test-output/hotspot/1/JTreport/text/summary.txt │ │ │ │ │ +-rw-r--r-- 0 sbuild (999) sbuild (999) 22 2026-10-20 11:17:26.000000 jtreg-test-output/hotspot/1/JTreport/text/tc_fail2missing.txt │ │ │ │ │ +-rw-r--r-- 0 sbuild (999) sbuild (999) 16 2026-10-20 11:17:26.000000 jtreg-test-output/hotspot/1/JTreport/text/fail2fail.txt │ │ │ │ │ +-rw-r--r-- 0 sbuild (999) sbuild (999) 101 2026-10-20 11:17:26.000000 jtreg-test-output/hotspot/1/JTreport/text/stats.txt │ │ │ │ │ +-rw-r--r-- 0 sbuild (999) sbuild (999) 93 2026-10-20 11:17:26.000000 jtreg-test-output/hotspot/1/JTreport/text/newfailures.txt │ │ │ │ │ +-rw-r--r-- 0 sbuild (999) sbuild (999) 19 2026-10-20 11:17:26.000000 jtreg-test-output/hotspot/1/JTreport/text/tc_fail2pass.txt │ │ │ │ │ +-rw-r--r-- 0 sbuild (999) sbuild (999) 19 2026-10-20 11:17:26.000000 jtreg-test-output/hotspot/1/JTreport/text/fail2missing.txt │ │ │ │ │ +-rw-r--r-- 0 sbuild (999) sbuild (999) 574 2026-10-20 11:17:15.000000 jtreg-test-output/hotspot/1/JTreport/text/cmdArgs.txt │ │ │ │ │ +-rw-r--r-- 0 sbuild (999) sbuild (999) 104 2026-10-20 11:17:26.000000 jtreg-test-output/hotspot/1/JTreport/text/timeStats.txt │ │ │ │ │ +-rw-r--r-- 0 sbuild (999) sbuild (999) 584814 2026-10-20 11:17:26.000000 jtreg-test-output/hotspot/1/JTreport/text/notRun.txt │ │ │ │ │ +-rw-r--r-- 0 sbuild (999) sbuild (999) 19 2026-10-20 11:17:26.000000 jtreg-test-output/hotspot/1/JTreport/text/other_errors.txt │ │ │ │ │ +-rw-r--r-- 0 sbuild (999) sbuild (999) 18 2026-10-20 11:17:26.000000 jtreg-test-output/hotspot/1/JTreport/text/fail2notrun.txt │ │ │ │ │ +-rw-r--r-- 0 sbuild (999) sbuild (999) 21 2026-10-20 11:17:26.000000 jtreg-test-output/hotspot/1/JTreport/text/tc_newfailures.txt │ │ │ │ │ +-rw-r--r-- 0 sbuild (999) sbuild (999) 20 2026-10-20 11:17:26.000000 jtreg-test-output/hotspot/1/JTreport/text/tc_fail2error.txt │ │ │ │ │ +-rw-r--r-- 0 sbuild (999) sbuild (999) 726 2026-10-20 11:17:26.000000 jtreg-test-output/hotspot/1/JTreport/index.html │ │ │ │ │ +drwxr-xr-x 0 sbuild (999) sbuild (999) 0 2026-10-20 11:17:40.000000 jtreg-test-output/hotspot/2/JTreport/ │ │ │ │ │ +-rw-r--r-- 0 sbuild (999) sbuild (999) 0 2026-10-20 11:17:40.000000 jtreg-test-output/hotspot/2/JTreport/reportdir.dat │ │ │ │ │ +drwxr-xr-x 0 sbuild (999) sbuild (999) 0 2026-10-20 11:17:40.000000 jtreg-test-output/hotspot/2/JTreport/html/ │ │ │ │ │ +-rw-r--r-- 0 sbuild (999) sbuild (999) 18325 2026-10-20 11:17:40.000000 jtreg-test-output/hotspot/2/JTreport/html/excluded.html │ │ │ │ │ +-rw-r--r-- 0 sbuild (999) sbuild (999) 607485 2026-10-20 11:17:40.000000 jtreg-test-output/hotspot/2/JTreport/html/passed_gr.html │ │ │ │ │ +-rw-r--r-- 0 sbuild (999) sbuild (999) 307 2026-10-20 11:17:40.000000 jtreg-test-output/hotspot/2/JTreport/html/report.css │ │ │ │ │ +-rw-r--r-- 0 sbuild (999) sbuild (999) 762 2026-10-20 11:17:40.000000 jtreg-test-output/hotspot/2/JTreport/html/failed.html │ │ │ │ │ +-rw-r--r-- 0 sbuild (999) sbuild (999) 593197 2026-10-20 11:17:40.000000 jtreg-test-output/hotspot/2/JTreport/html/report.html │ │ │ │ │ +-rw-r--r-- 0 sbuild (999) sbuild (999) 607094 2026-10-20 11:17:40.000000 jtreg-test-output/hotspot/2/JTreport/html/passed.html │ │ │ │ │ +-rw-r--r-- 0 sbuild (999) sbuild (999) 78691 2026-10-20 11:17:40.000000 jtreg-test-output/hotspot/2/JTreport/html/config.html │ │ │ │ │ +-rw-r--r-- 0 sbuild (999) sbuild (999) 957 2026-10-20 11:17:40.000000 jtreg-test-output/hotspot/2/JTreport/html/failed_gr.html │ │ │ │ │ +-rw-r--r-- 0 sbuild (999) sbuild (999) 522 2026-10-20 11:17:40.000000 jtreg-test-output/hotspot/2/JTreport/html/error_gr.html │ │ │ │ │ +-rw-r--r-- 0 sbuild (999) sbuild (999) 4283 2026-10-20 11:17:40.000000 jtreg-test-output/hotspot/2/JTreport/html/env.html │ │ │ │ │ +-rw-r--r-- 0 sbuild (999) sbuild (999) 404060 2026-10-20 11:17:40.000000 jtreg-test-output/hotspot/2/JTreport/html/notRun_gr.html │ │ │ │ │ +-rw-r--r-- 0 sbuild (999) sbuild (999) 593197 2026-10-20 11:17:40.000000 jtreg-test-output/hotspot/2/JTreport/html/index.html │ │ │ │ │ +-rw-r--r-- 0 sbuild (999) sbuild (999) 403787 2026-10-20 11:17:40.000000 jtreg-test-output/hotspot/2/JTreport/html/notRun.html │ │ │ │ │ +-rw-r--r-- 0 sbuild (999) sbuild (999) 474 2026-10-20 11:17:40.000000 jtreg-test-output/hotspot/2/JTreport/html/error.html │ │ │ │ │ +drwxr-xr-x 0 sbuild (999) sbuild (999) 0 2026-10-20 11:17:40.000000 jtreg-test-output/hotspot/2/JTreport/text/ │ │ │ │ │ +-rw-r--r-- 0 sbuild (999) sbuild (999) 17 2026-10-20 11:17:40.000000 jtreg-test-output/hotspot/2/JTreport/text/faiL2error.txt │ │ │ │ │ +-rw-r--r-- 0 sbuild (999) sbuild (999) 21 2026-10-20 11:17:40.000000 jtreg-test-output/hotspot/2/JTreport/text/tc_fail2notrun.txt │ │ │ │ │ +-rw-r--r-- 0 sbuild (999) sbuild (999) 16 2026-10-20 11:17:40.000000 jtreg-test-output/hotspot/2/JTreport/text/fail2pass.txt │ │ │ │ │ +-rw-r--r-- 0 sbuild (999) sbuild (999) 456665 2026-10-20 11:17:40.000000 jtreg-test-output/hotspot/2/JTreport/text/summary.txt │ │ │ │ │ +-rw-r--r-- 0 sbuild (999) sbuild (999) 22 2026-10-20 11:17:40.000000 jtreg-test-output/hotspot/2/JTreport/text/tc_fail2missing.txt │ │ │ │ │ +-rw-r--r-- 0 sbuild (999) sbuild (999) 16 2026-10-20 11:17:40.000000 jtreg-test-output/hotspot/2/JTreport/text/fail2fail.txt │ │ │ │ │ +-rw-r--r-- 0 sbuild (999) sbuild (999) 101 2026-10-20 11:17:40.000000 jtreg-test-output/hotspot/2/JTreport/text/stats.txt │ │ │ │ │ +-rw-r--r-- 0 sbuild (999) sbuild (999) 93 2026-10-20 11:17:40.000000 jtreg-test-output/hotspot/2/JTreport/text/newfailures.txt │ │ │ │ │ +-rw-r--r-- 0 sbuild (999) sbuild (999) 19 2026-10-20 11:17:40.000000 jtreg-test-output/hotspot/2/JTreport/text/tc_fail2pass.txt │ │ │ │ │ +-rw-r--r-- 0 sbuild (999) sbuild (999) 19 2026-10-20 11:17:40.000000 jtreg-test-output/hotspot/2/JTreport/text/fail2missing.txt │ │ │ │ │ +-rw-r--r-- 0 sbuild (999) sbuild (999) 574 2026-10-20 11:17:30.000000 jtreg-test-output/hotspot/2/JTreport/text/cmdArgs.txt │ │ │ │ │ +-rw-r--r-- 0 sbuild (999) sbuild (999) 104 2026-10-20 11:17:40.000000 jtreg-test-output/hotspot/2/JTreport/text/timeStats.txt │ │ │ │ │ +-rw-r--r-- 0 sbuild (999) sbuild (999) 584814 2026-10-20 11:17:40.000000 jtreg-test-output/hotspot/2/JTreport/text/notRun.txt │ │ │ │ │ +-rw-r--r-- 0 sbuild (999) sbuild (999) 19 2026-10-20 11:17:40.000000 jtreg-test-output/hotspot/2/JTreport/text/other_errors.txt │ │ │ │ │ +-rw-r--r-- 0 sbuild (999) sbuild (999) 18 2026-10-20 11:17:40.000000 jtreg-test-output/hotspot/2/JTreport/text/fail2notrun.txt │ │ │ │ │ +-rw-r--r-- 0 sbuild (999) sbuild (999) 21 2026-10-20 11:17:40.000000 jtreg-test-output/hotspot/2/JTreport/text/tc_newfailures.txt │ │ │ │ │ +-rw-r--r-- 0 sbuild (999) sbuild (999) 20 2026-10-20 11:17:40.000000 jtreg-test-output/hotspot/2/JTreport/text/tc_fail2error.txt │ │ │ │ │ +-rw-r--r-- 0 sbuild (999) sbuild (999) 726 2026-10-20 11:17:40.000000 jtreg-test-output/hotspot/2/JTreport/index.html │ │ │ │ │ +drwxr-xr-x 0 sbuild (999) sbuild (999) 0 2026-10-20 11:17:09.000000 jtreg-test-output/hotspot/0/JTreport/ │ │ │ │ │ +-rw-r--r-- 0 sbuild (999) sbuild (999) 0 2026-10-20 11:17:09.000000 jtreg-test-output/hotspot/0/JTreport/reportdir.dat │ │ │ │ │ +drwxr-xr-x 0 sbuild (999) sbuild (999) 0 2026-10-20 11:17:09.000000 jtreg-test-output/hotspot/0/JTreport/html/ │ │ │ │ │ +-rw-r--r-- 0 sbuild (999) sbuild (999) 18325 2026-10-20 11:17:09.000000 jtreg-test-output/hotspot/0/JTreport/html/excluded.html │ │ │ │ │ +-rw-r--r-- 0 sbuild (999) sbuild (999) 607485 2026-10-20 11:17:09.000000 jtreg-test-output/hotspot/0/JTreport/html/passed_gr.html │ │ │ │ │ +-rw-r--r-- 0 sbuild (999) sbuild (999) 307 2026-10-20 11:17:09.000000 jtreg-test-output/hotspot/0/JTreport/html/report.css │ │ │ │ │ +-rw-r--r-- 0 sbuild (999) sbuild (999) 762 2026-10-20 11:17:09.000000 jtreg-test-output/hotspot/0/JTreport/html/failed.html │ │ │ │ │ +-rw-r--r-- 0 sbuild (999) sbuild (999) 600683 2026-10-20 11:17:09.000000 jtreg-test-output/hotspot/0/JTreport/html/report.html │ │ │ │ │ +-rw-r--r-- 0 sbuild (999) sbuild (999) 607094 2026-10-20 11:17:09.000000 jtreg-test-output/hotspot/0/JTreport/html/passed.html │ │ │ │ │ +-rw-r--r-- 0 sbuild (999) sbuild (999) 78259 2026-10-20 11:17:09.000000 jtreg-test-output/hotspot/0/JTreport/html/config.html │ │ │ │ │ +-rw-r--r-- 0 sbuild (999) sbuild (999) 957 2026-10-20 11:17:09.000000 jtreg-test-output/hotspot/0/JTreport/html/failed_gr.html │ │ │ │ │ +-rw-r--r-- 0 sbuild (999) sbuild (999) 522 2026-10-20 11:17:09.000000 jtreg-test-output/hotspot/0/JTreport/html/error_gr.html │ │ │ │ │ +-rw-r--r-- 0 sbuild (999) sbuild (999) 4264 2026-10-20 11:17:09.000000 jtreg-test-output/hotspot/0/JTreport/html/env.html │ │ │ │ │ +-rw-r--r-- 0 sbuild (999) sbuild (999) 49645 2026-10-20 11:17:09.000000 jtreg-test-output/hotspot/0/JTreport/html/notRun_gr.html │ │ │ │ │ +-rw-r--r-- 0 sbuild (999) sbuild (999) 600683 2026-10-20 11:17:09.000000 jtreg-test-output/hotspot/0/JTreport/html/index.html │ │ │ │ │ +-rw-r--r-- 0 sbuild (999) sbuild (999) 49300 2026-10-20 11:17:09.000000 jtreg-test-output/hotspot/0/JTreport/html/notRun.html │ │ │ │ │ +-rw-r--r-- 0 sbuild (999) sbuild (999) 474 2026-10-20 11:17:09.000000 jtreg-test-output/hotspot/0/JTreport/html/error.html │ │ │ │ │ +drwxr-xr-x 0 sbuild (999) sbuild (999) 0 2026-10-20 11:17:09.000000 jtreg-test-output/hotspot/0/JTreport/text/ │ │ │ │ │ +-rw-r--r-- 0 sbuild (999) sbuild (999) 17 2026-10-20 11:17:09.000000 jtreg-test-output/hotspot/0/JTreport/text/faiL2error.txt │ │ │ │ │ +-rw-r--r-- 0 sbuild (999) sbuild (999) 21 2026-10-20 11:17:09.000000 jtreg-test-output/hotspot/0/JTreport/text/tc_fail2notrun.txt │ │ │ │ │ +-rw-r--r-- 0 sbuild (999) sbuild (999) 16 2026-10-20 11:17:09.000000 jtreg-test-output/hotspot/0/JTreport/text/fail2pass.txt │ │ │ │ │ +-rw-r--r-- 0 sbuild (999) sbuild (999) 456665 2026-10-20 11:17:09.000000 jtreg-test-output/hotspot/0/JTreport/text/summary.txt │ │ │ │ │ +-rw-r--r-- 0 sbuild (999) sbuild (999) 22 2026-10-20 11:17:09.000000 jtreg-test-output/hotspot/0/JTreport/text/tc_fail2missing.txt │ │ │ │ │ +-rw-r--r-- 0 sbuild (999) sbuild (999) 3273 2026-10-20 11:17:09.000000 jtreg-test-output/hotspot/0/JTreport/text/junit.txt │ │ │ │ │ +-rw-r--r-- 0 sbuild (999) sbuild (999) 16 2026-10-20 11:17:09.000000 jtreg-test-output/hotspot/0/JTreport/text/fail2fail.txt │ │ │ │ │ +-rw-r--r-- 0 sbuild (999) sbuild (999) 172 2026-10-20 11:17:09.000000 jtreg-test-output/hotspot/0/JTreport/text/stats.txt │ │ │ │ │ +-rw-r--r-- 0 sbuild (999) sbuild (999) 93 2026-10-20 11:17:09.000000 jtreg-test-output/hotspot/0/JTreport/text/newfailures.txt │ │ │ │ │ +-rw-r--r-- 0 sbuild (999) sbuild (999) 19 2026-10-20 11:17:09.000000 jtreg-test-output/hotspot/0/JTreport/text/tc_fail2pass.txt │ │ │ │ │ +-rw-r--r-- 0 sbuild (999) sbuild (999) 19 2026-10-20 11:17:09.000000 jtreg-test-output/hotspot/0/JTreport/text/fail2missing.txt │ │ │ │ │ +-rw-r--r-- 0 sbuild (999) sbuild (999) 555 2026-10-20 08:24:09.000000 jtreg-test-output/hotspot/0/JTreport/text/cmdArgs.txt │ │ │ │ │ +-rw-r--r-- 0 sbuild (999) sbuild (999) 851 2026-10-20 11:17:09.000000 jtreg-test-output/hotspot/0/JTreport/text/timeStats.txt │ │ │ │ │ +-rw-r--r-- 0 sbuild (999) sbuild (999) 7594 2026-10-20 11:17:09.000000 jtreg-test-output/hotspot/0/JTreport/text/testng.txt │ │ │ │ │ +-rw-r--r-- 0 sbuild (999) sbuild (999) 76794 2026-10-20 11:17:09.000000 jtreg-test-output/hotspot/0/JTreport/text/notRun.txt │ │ │ │ │ +-rw-r--r-- 0 sbuild (999) sbuild (999) 19 2026-10-20 11:17:09.000000 jtreg-test-output/hotspot/0/JTreport/text/other_errors.txt │ │ │ │ │ +-rw-r--r-- 0 sbuild (999) sbuild (999) 18 2026-10-20 11:17:09.000000 jtreg-test-output/hotspot/0/JTreport/text/fail2notrun.txt │ │ │ │ │ +-rw-r--r-- 0 sbuild (999) sbuild (999) 21 2026-10-20 11:17:09.000000 jtreg-test-output/hotspot/0/JTreport/text/tc_newfailures.txt │ │ │ │ │ +-rw-r--r-- 0 sbuild (999) sbuild (999) 20 2026-10-20 11:17:09.000000 jtreg-test-output/hotspot/0/JTreport/text/tc_fail2error.txt │ │ │ │ │ +-rw-r--r-- 0 sbuild (999) sbuild (999) 726 2026-10-20 11:17:09.000000 jtreg-test-output/hotspot/0/JTreport/index.html │ │ │ │ │ +lrwxrwxrwx 0 sbuild (999) sbuild (999) 0 2026-10-20 11:17:44.000000 jtreg-test-output/hotspot/JTreport -> 2/JTreport │ │ │ │ │ +drwxr-xr-x 0 sbuild (999) sbuild (999) 0 2026-10-20 12:09:57.000000 jtreg-test-output/jaxp/0/JTreport/ │ │ │ │ │ +-rw-r--r-- 0 sbuild (999) sbuild (999) 0 2026-10-20 12:09:57.000000 jtreg-test-output/jaxp/0/JTreport/reportdir.dat │ │ │ │ │ +drwxr-xr-x 0 sbuild (999) sbuild (999) 0 2026-10-20 12:09:57.000000 jtreg-test-output/jaxp/0/JTreport/html/ │ │ │ │ │ +-rw-r--r-- 0 sbuild (999) sbuild (999) 3643 2026-10-20 12:09:57.000000 jtreg-test-output/jaxp/0/JTreport/html/excluded.html │ │ │ │ │ +-rw-r--r-- 0 sbuild (999) sbuild (999) 110063 2026-10-20 12:09:57.000000 jtreg-test-output/jaxp/0/JTreport/html/passed_gr.html │ │ │ │ │ +-rw-r--r-- 0 sbuild (999) sbuild (999) 307 2026-10-20 12:09:57.000000 jtreg-test-output/jaxp/0/JTreport/html/report.css │ │ │ │ │ +-rw-r--r-- 0 sbuild (999) sbuild (999) 466 2026-10-20 12:09:57.000000 jtreg-test-output/jaxp/0/JTreport/html/failed.html │ │ │ │ │ +-rw-r--r-- 0 sbuild (999) sbuild (999) 58503 2026-10-20 12:09:57.000000 jtreg-test-output/jaxp/0/JTreport/html/report.html │ │ │ │ │ +-rw-r--r-- 0 sbuild (999) sbuild (999) 109974 2026-10-20 12:09:57.000000 jtreg-test-output/jaxp/0/JTreport/html/passed.html │ │ │ │ │ +-rw-r--r-- 0 sbuild (999) sbuild (999) 4425 2026-10-20 12:09:57.000000 jtreg-test-output/jaxp/0/JTreport/html/config.html │ │ │ │ │ +-rw-r--r-- 0 sbuild (999) sbuild (999) 514 2026-10-20 12:09:57.000000 jtreg-test-output/jaxp/0/JTreport/html/failed_gr.html │ │ │ │ │ +-rw-r--r-- 0 sbuild (999) sbuild (999) 522 2026-10-20 12:09:57.000000 jtreg-test-output/jaxp/0/JTreport/html/error_gr.html │ │ │ │ │ +-rw-r--r-- 0 sbuild (999) sbuild (999) 4150 2026-10-20 12:09:57.000000 jtreg-test-output/jaxp/0/JTreport/html/env.html │ │ │ │ │ +-rw-r--r-- 0 sbuild (999) sbuild (999) 696 2026-10-20 12:09:57.000000 jtreg-test-output/jaxp/0/JTreport/html/notRun_gr.html │ │ │ │ │ +-rw-r--r-- 0 sbuild (999) sbuild (999) 58503 2026-10-20 12:09:57.000000 jtreg-test-output/jaxp/0/JTreport/html/index.html │ │ │ │ │ +-rw-r--r-- 0 sbuild (999) sbuild (999) 574 2026-10-20 12:09:57.000000 jtreg-test-output/jaxp/0/JTreport/html/notRun.html │ │ │ │ │ +-rw-r--r-- 0 sbuild (999) sbuild (999) 474 2026-10-20 12:09:57.000000 jtreg-test-output/jaxp/0/JTreport/html/error.html │ │ │ │ │ +drwxr-xr-x 0 sbuild (999) sbuild (999) 0 2026-10-20 12:09:57.000000 jtreg-test-output/jaxp/0/JTreport/text/ │ │ │ │ │ +-rw-r--r-- 0 sbuild (999) sbuild (999) 17 2026-10-20 12:09:57.000000 jtreg-test-output/jaxp/0/JTreport/text/faiL2error.txt │ │ │ │ │ +-rw-r--r-- 0 sbuild (999) sbuild (999) 21 2026-10-20 12:09:57.000000 jtreg-test-output/jaxp/0/JTreport/text/tc_fail2notrun.txt │ │ │ │ │ +-rw-r--r-- 0 sbuild (999) sbuild (999) 16 2026-10-20 12:09:57.000000 jtreg-test-output/jaxp/0/JTreport/text/fail2pass.txt │ │ │ │ │ +-rw-r--r-- 0 sbuild (999) sbuild (999) 59118 2026-10-20 12:09:57.000000 jtreg-test-output/jaxp/0/JTreport/text/summary.txt │ │ │ │ │ +-rw-r--r-- 0 sbuild (999) sbuild (999) 22 2026-10-20 12:09:57.000000 jtreg-test-output/jaxp/0/JTreport/text/tc_fail2missing.txt │ │ │ │ │ +-rw-r--r-- 0 sbuild (999) sbuild (999) 200 2026-10-20 12:09:57.000000 jtreg-test-output/jaxp/0/JTreport/text/junit.txt │ │ │ │ │ +-rw-r--r-- 0 sbuild (999) sbuild (999) 16 2026-10-20 12:09:57.000000 jtreg-test-output/jaxp/0/JTreport/text/fail2fail.txt │ │ │ │ │ +-rw-r--r-- 0 sbuild (999) sbuild (999) 65 2026-10-20 12:09:57.000000 jtreg-test-output/jaxp/0/JTreport/text/stats.txt │ │ │ │ │ +-rw-r--r-- 0 sbuild (999) sbuild (999) 18 2026-10-20 12:09:57.000000 jtreg-test-output/jaxp/0/JTreport/text/newfailures.txt │ │ │ │ │ +-rw-r--r-- 0 sbuild (999) sbuild (999) 19 2026-10-20 12:09:57.000000 jtreg-test-output/jaxp/0/JTreport/text/tc_fail2pass.txt │ │ │ │ │ +-rw-r--r-- 0 sbuild (999) sbuild (999) 19 2026-10-20 12:09:57.000000 jtreg-test-output/jaxp/0/JTreport/text/fail2missing.txt │ │ │ │ │ +-rw-r--r-- 0 sbuild (999) sbuild (999) 441 2026-10-20 11:55:30.000000 jtreg-test-output/jaxp/0/JTreport/text/cmdArgs.txt │ │ │ │ │ +-rw-r--r-- 0 sbuild (999) sbuild (999) 166 2026-10-20 12:09:57.000000 jtreg-test-output/jaxp/0/JTreport/text/timeStats.txt │ │ │ │ │ +-rw-r--r-- 0 sbuild (999) sbuild (999) 69461 2026-10-20 12:09:57.000000 jtreg-test-output/jaxp/0/JTreport/text/testng.txt │ │ │ │ │ +-rw-r--r-- 0 sbuild (999) sbuild (999) 116 2026-10-20 12:09:57.000000 jtreg-test-output/jaxp/0/JTreport/text/notRun.txt │ │ │ │ │ +-rw-r--r-- 0 sbuild (999) sbuild (999) 19 2026-10-20 12:09:57.000000 jtreg-test-output/jaxp/0/JTreport/text/other_errors.txt │ │ │ │ │ +-rw-r--r-- 0 sbuild (999) sbuild (999) 18 2026-10-20 12:09:57.000000 jtreg-test-output/jaxp/0/JTreport/text/fail2notrun.txt │ │ │ │ │ +-rw-r--r-- 0 sbuild (999) sbuild (999) 21 2026-10-20 12:09:57.000000 jtreg-test-output/jaxp/0/JTreport/text/tc_newfailures.txt │ │ │ │ │ +-rw-r--r-- 0 sbuild (999) sbuild (999) 20 2026-10-20 12:09:57.000000 jtreg-test-output/jaxp/0/JTreport/text/tc_fail2error.txt │ │ │ │ │ +-rw-r--r-- 0 sbuild (999) sbuild (999) 714 2026-10-20 12:09:57.000000 jtreg-test-output/jaxp/0/JTreport/index.html │ │ │ │ │ +lrwxrwxrwx 0 sbuild (999) sbuild (999) 0 2026-10-20 12:09:58.000000 jtreg-test-output/jaxp/JTreport -> 0/JTreport │ │ │ │ │ +drwxr-xr-x 0 sbuild (999) sbuild (999) 0 2026-10-20 15:52:32.000000 jtreg-test-output/jdk/1/JTreport/ │ │ │ │ │ +-rw-r--r-- 0 sbuild (999) sbuild (999) 0 2026-10-20 15:52:32.000000 jtreg-test-output/jdk/1/JTreport/reportdir.dat │ │ │ │ │ +drwxr-xr-x 0 sbuild (999) sbuild (999) 0 2026-10-20 15:52:32.000000 jtreg-test-output/jdk/1/JTreport/html/ │ │ │ │ │ +-rw-r--r-- 0 sbuild (999) sbuild (999) 83174 2026-10-20 15:52:32.000000 jtreg-test-output/jdk/1/JTreport/html/excluded.html │ │ │ │ │ +-rw-r--r-- 0 sbuild (999) sbuild (999) 1250603 2026-10-20 15:52:32.000000 jtreg-test-output/jdk/1/JTreport/html/passed_gr.html │ │ │ │ │ +-rw-r--r-- 0 sbuild (999) sbuild (999) 307 2026-10-20 15:52:31.000000 jtreg-test-output/jdk/1/JTreport/html/report.css │ │ │ │ │ +-rw-r--r-- 0 sbuild (999) sbuild (999) 2020 2026-10-20 15:52:32.000000 jtreg-test-output/jdk/1/JTreport/html/failed.html │ │ │ │ │ +-rw-r--r-- 0 sbuild (999) sbuild (999) 1101695 2026-10-20 15:52:32.000000 jtreg-test-output/jdk/1/JTreport/html/report.html │ │ │ │ │ +-rw-r--r-- 0 sbuild (999) sbuild (999) 1249528 2026-10-20 15:52:32.000000 jtreg-test-output/jdk/1/JTreport/html/passed.html │ │ │ │ │ +-rw-r--r-- 0 sbuild (999) sbuild (999) 24358 2026-10-20 15:52:32.000000 jtreg-test-output/jdk/1/JTreport/html/config.html │ │ │ │ │ +-rw-r--r-- 0 sbuild (999) sbuild (999) 2750 2026-10-20 15:52:32.000000 jtreg-test-output/jdk/1/JTreport/html/failed_gr.html │ │ │ │ │ +-rw-r--r-- 0 sbuild (999) sbuild (999) 521 2026-10-20 15:52:32.000000 jtreg-test-output/jdk/1/JTreport/html/error_gr.html │ │ │ │ │ +-rw-r--r-- 0 sbuild (999) sbuild (999) 4260 2026-10-20 15:52:32.000000 jtreg-test-output/jdk/1/JTreport/html/env.html │ │ │ │ │ +-rw-r--r-- 0 sbuild (999) sbuild (999) 762639 2026-10-20 15:52:32.000000 jtreg-test-output/jdk/1/JTreport/html/notRun_gr.html │ │ │ │ │ +-rw-r--r-- 0 sbuild (999) sbuild (999) 1101695 2026-10-20 15:52:32.000000 jtreg-test-output/jdk/1/JTreport/html/index.html │ │ │ │ │ +-rw-r--r-- 0 sbuild (999) sbuild (999) 762366 2026-10-20 15:52:32.000000 jtreg-test-output/jdk/1/JTreport/html/notRun.html │ │ │ │ │ +-rw-r--r-- 0 sbuild (999) sbuild (999) 473 2026-10-20 15:52:32.000000 jtreg-test-output/jdk/1/JTreport/html/error.html │ │ │ │ │ +drwxr-xr-x 0 sbuild (999) sbuild (999) 0 2026-10-20 15:52:32.000000 jtreg-test-output/jdk/1/JTreport/text/ │ │ │ │ │ +-rw-r--r-- 0 sbuild (999) sbuild (999) 17 2026-10-20 15:52:32.000000 jtreg-test-output/jdk/1/JTreport/text/faiL2error.txt │ │ │ │ │ +-rw-r--r-- 0 sbuild (999) sbuild (999) 21 2026-10-20 15:52:32.000000 jtreg-test-output/jdk/1/JTreport/text/tc_fail2notrun.txt │ │ │ │ │ +-rw-r--r-- 0 sbuild (999) sbuild (999) 16 2026-10-20 15:52:32.000000 jtreg-test-output/jdk/1/JTreport/text/fail2pass.txt │ │ │ │ │ +-rw-r--r-- 0 sbuild (999) sbuild (999) 890881 2026-10-20 15:52:32.000000 jtreg-test-output/jdk/1/JTreport/text/summary.txt │ │ │ │ │ +-rw-r--r-- 0 sbuild (999) sbuild (999) 22 2026-10-20 15:52:32.000000 jtreg-test-output/jdk/1/JTreport/text/tc_fail2missing.txt │ │ │ │ │ +-rw-r--r-- 0 sbuild (999) sbuild (999) 16 2026-10-20 15:52:32.000000 jtreg-test-output/jdk/1/JTreport/text/fail2fail.txt │ │ │ │ │ +-rw-r--r-- 0 sbuild (999) sbuild (999) 101 2026-10-20 15:52:32.000000 jtreg-test-output/jdk/1/JTreport/text/stats.txt │ │ │ │ │ +-rw-r--r-- 0 sbuild (999) sbuild (999) 416 2026-10-20 15:52:32.000000 jtreg-test-output/jdk/1/JTreport/text/newfailures.txt │ │ │ │ │ +-rw-r--r-- 0 sbuild (999) sbuild (999) 19 2026-10-20 15:52:32.000000 jtreg-test-output/jdk/1/JTreport/text/tc_fail2pass.txt │ │ │ │ │ +-rw-r--r-- 0 sbuild (999) sbuild (999) 19 2026-10-20 15:52:32.000000 jtreg-test-output/jdk/1/JTreport/text/fail2missing.txt │ │ │ │ │ +-rw-r--r-- 0 sbuild (999) sbuild (999) 552 2026-10-20 15:52:15.000000 jtreg-test-output/jdk/1/JTreport/text/cmdArgs.txt │ │ │ │ │ +-rw-r--r-- 0 sbuild (999) sbuild (999) 116 2026-10-20 15:52:32.000000 jtreg-test-output/jdk/1/JTreport/text/timeStats.txt │ │ │ │ │ +-rw-r--r-- 0 sbuild (999) sbuild (999) 132 2026-10-20 15:52:32.000000 jtreg-test-output/jdk/1/JTreport/text/testng.txt │ │ │ │ │ +-rw-r--r-- 0 sbuild (999) sbuild (999) 1023412 2026-10-20 15:52:32.000000 jtreg-test-output/jdk/1/JTreport/text/notRun.txt │ │ │ │ │ +-rw-r--r-- 0 sbuild (999) sbuild (999) 19 2026-10-20 15:52:32.000000 jtreg-test-output/jdk/1/JTreport/text/other_errors.txt │ │ │ │ │ +-rw-r--r-- 0 sbuild (999) sbuild (999) 18 2026-10-20 15:52:32.000000 jtreg-test-output/jdk/1/JTreport/text/fail2notrun.txt │ │ │ │ │ +-rw-r--r-- 0 sbuild (999) sbuild (999) 21 2026-10-20 15:52:32.000000 jtreg-test-output/jdk/1/JTreport/text/tc_newfailures.txt │ │ │ │ │ +-rw-r--r-- 0 sbuild (999) sbuild (999) 20 2026-10-20 15:52:32.000000 jtreg-test-output/jdk/1/JTreport/text/tc_fail2error.txt │ │ │ │ │ +-rw-r--r-- 0 sbuild (999) sbuild (999) 712 2026-10-20 15:52:32.000000 jtreg-test-output/jdk/1/JTreport/index.html │ │ │ │ │ +drwxr-xr-x 0 sbuild (999) sbuild (999) 0 2026-10-20 15:52:58.000000 jtreg-test-output/jdk/2/JTreport/ │ │ │ │ │ +-rw-r--r-- 0 sbuild (999) sbuild (999) 0 2026-10-20 15:52:58.000000 jtreg-test-output/jdk/2/JTreport/reportdir.dat │ │ │ │ │ +drwxr-xr-x 0 sbuild (999) sbuild (999) 0 2026-10-20 15:52:58.000000 jtreg-test-output/jdk/2/JTreport/html/ │ │ │ │ │ +-rw-r--r-- 0 sbuild (999) sbuild (999) 83174 2026-10-20 15:52:57.000000 jtreg-test-output/jdk/2/JTreport/html/excluded.html │ │ │ │ │ +-rw-r--r-- 0 sbuild (999) sbuild (999) 1250603 2026-10-20 15:52:58.000000 jtreg-test-output/jdk/2/JTreport/html/passed_gr.html │ │ │ │ │ +-rw-r--r-- 0 sbuild (999) sbuild (999) 307 2026-10-20 15:52:57.000000 jtreg-test-output/jdk/2/JTreport/html/report.css │ │ │ │ │ +-rw-r--r-- 0 sbuild (999) sbuild (999) 2020 2026-10-20 15:52:58.000000 jtreg-test-output/jdk/2/JTreport/html/failed.html │ │ │ │ │ +-rw-r--r-- 0 sbuild (999) sbuild (999) 1101695 2026-10-20 15:52:57.000000 jtreg-test-output/jdk/2/JTreport/html/report.html │ │ │ │ │ +-rw-r--r-- 0 sbuild (999) sbuild (999) 1249528 2026-10-20 15:52:58.000000 jtreg-test-output/jdk/2/JTreport/html/passed.html │ │ │ │ │ +-rw-r--r-- 0 sbuild (999) sbuild (999) 24358 2026-10-20 15:52:57.000000 jtreg-test-output/jdk/2/JTreport/html/config.html │ │ │ │ │ +-rw-r--r-- 0 sbuild (999) sbuild (999) 2750 2026-10-20 15:52:58.000000 jtreg-test-output/jdk/2/JTreport/html/failed_gr.html │ │ │ │ │ +-rw-r--r-- 0 sbuild (999) sbuild (999) 521 2026-10-20 15:52:58.000000 jtreg-test-output/jdk/2/JTreport/html/error_gr.html │ │ │ │ │ +-rw-r--r-- 0 sbuild (999) sbuild (999) 4260 2026-10-20 15:52:57.000000 jtreg-test-output/jdk/2/JTreport/html/env.html │ │ │ │ │ +-rw-r--r-- 0 sbuild (999) sbuild (999) 762639 2026-10-20 15:52:58.000000 jtreg-test-output/jdk/2/JTreport/html/notRun_gr.html │ │ │ │ │ +-rw-r--r-- 0 sbuild (999) sbuild (999) 1101695 2026-10-20 15:52:57.000000 jtreg-test-output/jdk/2/JTreport/html/index.html │ │ │ │ │ +-rw-r--r-- 0 sbuild (999) sbuild (999) 762366 2026-10-20 15:52:58.000000 jtreg-test-output/jdk/2/JTreport/html/notRun.html │ │ │ │ │ +-rw-r--r-- 0 sbuild (999) sbuild (999) 473 2026-10-20 15:52:58.000000 jtreg-test-output/jdk/2/JTreport/html/error.html │ │ │ │ │ +drwxr-xr-x 0 sbuild (999) sbuild (999) 0 2026-10-20 15:52:58.000000 jtreg-test-output/jdk/2/JTreport/text/ │ │ │ │ │ +-rw-r--r-- 0 sbuild (999) sbuild (999) 17 2026-10-20 15:52:58.000000 jtreg-test-output/jdk/2/JTreport/text/faiL2error.txt │ │ │ │ │ +-rw-r--r-- 0 sbuild (999) sbuild (999) 21 2026-10-20 15:52:58.000000 jtreg-test-output/jdk/2/JTreport/text/tc_fail2notrun.txt │ │ │ │ │ +-rw-r--r-- 0 sbuild (999) sbuild (999) 16 2026-10-20 15:52:58.000000 jtreg-test-output/jdk/2/JTreport/text/fail2pass.txt │ │ │ │ │ +-rw-r--r-- 0 sbuild (999) sbuild (999) 890881 2026-10-20 15:52:58.000000 jtreg-test-output/jdk/2/JTreport/text/summary.txt │ │ │ │ │ +-rw-r--r-- 0 sbuild (999) sbuild (999) 22 2026-10-20 15:52:58.000000 jtreg-test-output/jdk/2/JTreport/text/tc_fail2missing.txt │ │ │ │ │ +-rw-r--r-- 0 sbuild (999) sbuild (999) 16 2026-10-20 15:52:58.000000 jtreg-test-output/jdk/2/JTreport/text/fail2fail.txt │ │ │ │ │ +-rw-r--r-- 0 sbuild (999) sbuild (999) 101 2026-10-20 15:52:58.000000 jtreg-test-output/jdk/2/JTreport/text/stats.txt │ │ │ │ │ +-rw-r--r-- 0 sbuild (999) sbuild (999) 416 2026-10-20 15:52:58.000000 jtreg-test-output/jdk/2/JTreport/text/newfailures.txt │ │ │ │ │ +-rw-r--r-- 0 sbuild (999) sbuild (999) 19 2026-10-20 15:52:58.000000 jtreg-test-output/jdk/2/JTreport/text/tc_fail2pass.txt │ │ │ │ │ +-rw-r--r-- 0 sbuild (999) sbuild (999) 19 2026-10-20 15:52:58.000000 jtreg-test-output/jdk/2/JTreport/text/fail2missing.txt │ │ │ │ │ +-rw-r--r-- 0 sbuild (999) sbuild (999) 552 2026-10-20 15:52:42.000000 jtreg-test-output/jdk/2/JTreport/text/cmdArgs.txt │ │ │ │ │ +-rw-r--r-- 0 sbuild (999) sbuild (999) 116 2026-10-20 15:52:58.000000 jtreg-test-output/jdk/2/JTreport/text/timeStats.txt │ │ │ │ │ +-rw-r--r-- 0 sbuild (999) sbuild (999) 132 2026-10-20 15:52:58.000000 jtreg-test-output/jdk/2/JTreport/text/testng.txt │ │ │ │ │ +-rw-r--r-- 0 sbuild (999) sbuild (999) 1023412 2026-10-20 15:52:58.000000 jtreg-test-output/jdk/2/JTreport/text/notRun.txt │ │ │ │ │ +-rw-r--r-- 0 sbuild (999) sbuild (999) 19 2026-10-20 15:52:58.000000 jtreg-test-output/jdk/2/JTreport/text/other_errors.txt │ │ │ │ │ +-rw-r--r-- 0 sbuild (999) sbuild (999) 18 2026-10-20 15:52:58.000000 jtreg-test-output/jdk/2/JTreport/text/fail2notrun.txt │ │ │ │ │ +-rw-r--r-- 0 sbuild (999) sbuild (999) 21 2026-10-20 15:52:58.000000 jtreg-test-output/jdk/2/JTreport/text/tc_newfailures.txt │ │ │ │ │ +-rw-r--r-- 0 sbuild (999) sbuild (999) 20 2026-10-20 15:52:58.000000 jtreg-test-output/jdk/2/JTreport/text/tc_fail2error.txt │ │ │ │ │ +-rw-r--r-- 0 sbuild (999) sbuild (999) 712 2026-10-20 15:52:58.000000 jtreg-test-output/jdk/2/JTreport/index.html │ │ │ │ │ +drwxr-xr-x 0 sbuild (999) sbuild (999) 0 2026-10-20 15:52:03.000000 jtreg-test-output/jdk/0/JTreport/ │ │ │ │ │ +-rw-r--r-- 0 sbuild (999) sbuild (999) 0 2026-10-20 15:52:03.000000 jtreg-test-output/jdk/0/JTreport/reportdir.dat │ │ │ │ │ +drwxr-xr-x 0 sbuild (999) sbuild (999) 0 2026-10-20 15:52:03.000000 jtreg-test-output/jdk/0/JTreport/html/ │ │ │ │ │ +-rw-r--r-- 0 sbuild (999) sbuild (999) 83174 2026-10-20 15:52:03.000000 jtreg-test-output/jdk/0/JTreport/html/excluded.html │ │ │ │ │ +-rw-r--r-- 0 sbuild (999) sbuild (999) 1250603 2026-10-20 15:52:03.000000 jtreg-test-output/jdk/0/JTreport/html/passed_gr.html │ │ │ │ │ +-rw-r--r-- 0 sbuild (999) sbuild (999) 307 2026-10-20 15:52:02.000000 jtreg-test-output/jdk/0/JTreport/html/report.css │ │ │ │ │ +-rw-r--r-- 0 sbuild (999) sbuild (999) 2020 2026-10-20 15:52:03.000000 jtreg-test-output/jdk/0/JTreport/html/failed.html │ │ │ │ │ +-rw-r--r-- 0 sbuild (999) sbuild (999) 1124333 2026-10-20 15:52:03.000000 jtreg-test-output/jdk/0/JTreport/html/report.html │ │ │ │ │ +-rw-r--r-- 0 sbuild (999) sbuild (999) 1249528 2026-10-20 15:52:03.000000 jtreg-test-output/jdk/0/JTreport/html/passed.html │ │ │ │ │ +-rw-r--r-- 0 sbuild (999) sbuild (999) 23926 2026-10-20 15:52:03.000000 jtreg-test-output/jdk/0/JTreport/html/config.html │ │ │ │ │ +-rw-r--r-- 0 sbuild (999) sbuild (999) 2750 2026-10-20 15:52:03.000000 jtreg-test-output/jdk/0/JTreport/html/failed_gr.html │ │ │ │ │ +-rw-r--r-- 0 sbuild (999) sbuild (999) 521 2026-10-20 15:52:03.000000 jtreg-test-output/jdk/0/JTreport/html/error_gr.html │ │ │ │ │ +-rw-r--r-- 0 sbuild (999) sbuild (999) 4241 2026-10-20 15:52:03.000000 jtreg-test-output/jdk/0/JTreport/html/env.html │ │ │ │ │ +-rw-r--r-- 0 sbuild (999) sbuild (999) 21066 2026-10-20 15:52:03.000000 jtreg-test-output/jdk/0/JTreport/html/notRun_gr.html │ │ │ │ │ +-rw-r--r-- 0 sbuild (999) sbuild (999) 1124333 2026-10-20 15:52:03.000000 jtreg-test-output/jdk/0/JTreport/html/index.html │ │ │ │ │ +-rw-r--r-- 0 sbuild (999) sbuild (999) 20721 2026-10-20 15:52:03.000000 jtreg-test-output/jdk/0/JTreport/html/notRun.html │ │ │ │ │ +-rw-r--r-- 0 sbuild (999) sbuild (999) 473 2026-10-20 15:52:03.000000 jtreg-test-output/jdk/0/JTreport/html/error.html │ │ │ │ │ +drwxr-xr-x 0 sbuild (999) sbuild (999) 0 2026-10-20 15:52:03.000000 jtreg-test-output/jdk/0/JTreport/text/ │ │ │ │ │ +-rw-r--r-- 0 sbuild (999) sbuild (999) 17 2026-10-20 15:52:03.000000 jtreg-test-output/jdk/0/JTreport/text/faiL2error.txt │ │ │ │ │ +-rw-r--r-- 0 sbuild (999) sbuild (999) 21 2026-10-20 15:52:03.000000 jtreg-test-output/jdk/0/JTreport/text/tc_fail2notrun.txt │ │ │ │ │ +-rw-r--r-- 0 sbuild (999) sbuild (999) 16 2026-10-20 15:52:03.000000 jtreg-test-output/jdk/0/JTreport/text/fail2pass.txt │ │ │ │ │ +-rw-r--r-- 0 sbuild (999) sbuild (999) 890881 2026-10-20 15:52:03.000000 jtreg-test-output/jdk/0/JTreport/text/summary.txt │ │ │ │ │ +-rw-r--r-- 0 sbuild (999) sbuild (999) 22 2026-10-20 15:52:03.000000 jtreg-test-output/jdk/0/JTreport/text/tc_fail2missing.txt │ │ │ │ │ +-rw-r--r-- 0 sbuild (999) sbuild (999) 85819 2026-10-20 15:52:03.000000 jtreg-test-output/jdk/0/JTreport/text/junit.txt │ │ │ │ │ +-rw-r--r-- 0 sbuild (999) sbuild (999) 16 2026-10-20 15:52:03.000000 jtreg-test-output/jdk/0/JTreport/text/fail2fail.txt │ │ │ │ │ +-rw-r--r-- 0 sbuild (999) sbuild (999) 173 2026-10-20 15:52:03.000000 jtreg-test-output/jdk/0/JTreport/text/stats.txt │ │ │ │ │ +-rw-r--r-- 0 sbuild (999) sbuild (999) 416 2026-10-20 15:52:03.000000 jtreg-test-output/jdk/0/JTreport/text/newfailures.txt │ │ │ │ │ +-rw-r--r-- 0 sbuild (999) sbuild (999) 19 2026-10-20 15:52:03.000000 jtreg-test-output/jdk/0/JTreport/text/tc_fail2pass.txt │ │ │ │ │ +-rw-r--r-- 0 sbuild (999) sbuild (999) 19 2026-10-20 15:52:03.000000 jtreg-test-output/jdk/0/JTreport/text/fail2missing.txt │ │ │ │ │ +-rw-r--r-- 0 sbuild (999) sbuild (999) 533 2026-10-20 12:10:01.000000 jtreg-test-output/jdk/0/JTreport/text/cmdArgs.txt │ │ │ │ │ +-rw-r--r-- 0 sbuild (999) sbuild (999) 947 2026-10-20 15:52:03.000000 jtreg-test-output/jdk/0/JTreport/text/timeStats.txt │ │ │ │ │ +-rw-r--r-- 0 sbuild (999) sbuild (999) 131926 2026-10-20 15:52:03.000000 jtreg-test-output/jdk/0/JTreport/text/testng.txt │ │ │ │ │ +-rw-r--r-- 0 sbuild (999) sbuild (999) 26859 2026-10-20 15:52:03.000000 jtreg-test-output/jdk/0/JTreport/text/notRun.txt │ │ │ │ │ +-rw-r--r-- 0 sbuild (999) sbuild (999) 19 2026-10-20 15:52:03.000000 jtreg-test-output/jdk/0/JTreport/text/other_errors.txt │ │ │ │ │ +-rw-r--r-- 0 sbuild (999) sbuild (999) 18 2026-10-20 15:52:03.000000 jtreg-test-output/jdk/0/JTreport/text/fail2notrun.txt │ │ │ │ │ +-rw-r--r-- 0 sbuild (999) sbuild (999) 21 2026-10-20 15:52:03.000000 jtreg-test-output/jdk/0/JTreport/text/tc_newfailures.txt │ │ │ │ │ +-rw-r--r-- 0 sbuild (999) sbuild (999) 20 2026-10-20 15:52:03.000000 jtreg-test-output/jdk/0/JTreport/text/tc_fail2error.txt │ │ │ │ │ +-rw-r--r-- 0 sbuild (999) sbuild (999) 712 2026-10-20 15:52:03.000000 jtreg-test-output/jdk/0/JTreport/index.html │ │ │ │ │ +lrwxrwxrwx 0 sbuild (999) sbuild (999) 0 2026-10-20 15:53:07.000000 jtreg-test-output/jdk/JTreport -> 2/JTreport │ │ │ │ │ +drwxr-xr-x 0 sbuild (999) sbuild (999) 0 2026-10-20 11:55:24.000000 jtreg-test-output/langtools/0/JTreport/ │ │ │ │ │ +-rw-r--r-- 0 sbuild (999) sbuild (999) 0 2026-10-20 11:55:24.000000 jtreg-test-output/langtools/0/JTreport/reportdir.dat │ │ │ │ │ +drwxr-xr-x 0 sbuild (999) sbuild (999) 0 2026-10-20 11:55:24.000000 jtreg-test-output/langtools/0/JTreport/html/ │ │ │ │ │ +-rw-r--r-- 0 sbuild (999) sbuild (999) 6196 2026-10-20 11:55:24.000000 jtreg-test-output/langtools/0/JTreport/html/excluded.html │ │ │ │ │ +-rw-r--r-- 0 sbuild (999) sbuild (999) 885493 2026-10-20 11:55:24.000000 jtreg-test-output/langtools/0/JTreport/html/passed_gr.html │ │ │ │ │ +-rw-r--r-- 0 sbuild (999) sbuild (999) 307 2026-10-20 11:55:24.000000 jtreg-test-output/langtools/0/JTreport/html/report.css │ │ │ │ │ +-rw-r--r-- 0 sbuild (999) sbuild (999) 466 2026-10-20 11:55:24.000000 jtreg-test-output/langtools/0/JTreport/html/failed.html │ │ │ │ │ +-rw-r--r-- 0 sbuild (999) sbuild (999) 541948 2026-10-20 11:55:24.000000 jtreg-test-output/langtools/0/JTreport/html/report.html │ │ │ │ │ +-rw-r--r-- 0 sbuild (999) sbuild (999) 885168 2026-10-20 11:55:24.000000 jtreg-test-output/langtools/0/JTreport/html/passed.html │ │ │ │ │ +-rw-r--r-- 0 sbuild (999) sbuild (999) 10727 2026-10-20 11:55:24.000000 jtreg-test-output/langtools/0/JTreport/html/config.html │ │ │ │ │ +-rw-r--r-- 0 sbuild (999) sbuild (999) 514 2026-10-20 11:55:24.000000 jtreg-test-output/langtools/0/JTreport/html/failed_gr.html │ │ │ │ │ +-rw-r--r-- 0 sbuild (999) sbuild (999) 522 2026-10-20 11:55:24.000000 jtreg-test-output/langtools/0/JTreport/html/error_gr.html │ │ │ │ │ +-rw-r--r-- 0 sbuild (999) sbuild (999) 4165 2026-10-20 11:55:24.000000 jtreg-test-output/langtools/0/JTreport/html/env.html │ │ │ │ │ +-rw-r--r-- 0 sbuild (999) sbuild (999) 2464 2026-10-20 11:55:24.000000 jtreg-test-output/langtools/0/JTreport/html/notRun_gr.html │ │ │ │ │ +-rw-r--r-- 0 sbuild (999) sbuild (999) 541948 2026-10-20 11:55:24.000000 jtreg-test-output/langtools/0/JTreport/html/index.html │ │ │ │ │ +-rw-r--r-- 0 sbuild (999) sbuild (999) 2175 2026-10-20 11:55:24.000000 jtreg-test-output/langtools/0/JTreport/html/notRun.html │ │ │ │ │ +-rw-r--r-- 0 sbuild (999) sbuild (999) 474 2026-10-20 11:55:24.000000 jtreg-test-output/langtools/0/JTreport/html/error.html │ │ │ │ │ +drwxr-xr-x 0 sbuild (999) sbuild (999) 0 2026-10-20 11:55:24.000000 jtreg-test-output/langtools/0/JTreport/text/ │ │ │ │ │ +-rw-r--r-- 0 sbuild (999) sbuild (999) 17 2026-10-20 11:55:24.000000 jtreg-test-output/langtools/0/JTreport/text/faiL2error.txt │ │ │ │ │ +-rw-r--r-- 0 sbuild (999) sbuild (999) 21 2026-10-20 11:55:24.000000 jtreg-test-output/langtools/0/JTreport/text/tc_fail2notrun.txt │ │ │ │ │ +-rw-r--r-- 0 sbuild (999) sbuild (999) 16 2026-10-20 11:55:24.000000 jtreg-test-output/langtools/0/JTreport/text/fail2pass.txt │ │ │ │ │ +-rw-r--r-- 0 sbuild (999) sbuild (999) 643622 2026-10-20 11:55:24.000000 jtreg-test-output/langtools/0/JTreport/text/summary.txt │ │ │ │ │ +-rw-r--r-- 0 sbuild (999) sbuild (999) 22 2026-10-20 11:55:24.000000 jtreg-test-output/langtools/0/JTreport/text/tc_fail2missing.txt │ │ │ │ │ +-rw-r--r-- 0 sbuild (999) sbuild (999) 18550 2026-10-20 11:55:24.000000 jtreg-test-output/langtools/0/JTreport/text/junit.txt │ │ │ │ │ +-rw-r--r-- 0 sbuild (999) sbuild (999) 16 2026-10-20 11:55:24.000000 jtreg-test-output/langtools/0/JTreport/text/fail2fail.txt │ │ │ │ │ +-rw-r--r-- 0 sbuild (999) sbuild (999) 120 2026-10-20 11:55:24.000000 jtreg-test-output/langtools/0/JTreport/text/stats.txt │ │ │ │ │ +-rw-r--r-- 0 sbuild (999) sbuild (999) 18 2026-10-20 11:55:24.000000 jtreg-test-output/langtools/0/JTreport/text/newfailures.txt │ │ │ │ │ +-rw-r--r-- 0 sbuild (999) sbuild (999) 19 2026-10-20 11:55:24.000000 jtreg-test-output/langtools/0/JTreport/text/tc_fail2pass.txt │ │ │ │ │ +-rw-r--r-- 0 sbuild (999) sbuild (999) 19 2026-10-20 11:55:24.000000 jtreg-test-output/langtools/0/JTreport/text/fail2missing.txt │ │ │ │ │ +-rw-r--r-- 0 sbuild (999) sbuild (999) 456 2026-10-20 11:17:45.000000 jtreg-test-output/langtools/0/JTreport/text/cmdArgs.txt │ │ │ │ │ +-rw-r--r-- 0 sbuild (999) sbuild (999) 454 2026-10-20 11:55:24.000000 jtreg-test-output/langtools/0/JTreport/text/timeStats.txt │ │ │ │ │ +-rw-r--r-- 0 sbuild (999) sbuild (999) 9538 2026-10-20 11:55:24.000000 jtreg-test-output/langtools/0/JTreport/text/testng.txt │ │ │ │ │ +-rw-r--r-- 0 sbuild (999) sbuild (999) 1921 2026-10-20 11:55:24.000000 jtreg-test-output/langtools/0/JTreport/text/notRun.txt │ │ │ │ │ +-rw-r--r-- 0 sbuild (999) sbuild (999) 19 2026-10-20 11:55:24.000000 jtreg-test-output/langtools/0/JTreport/text/other_errors.txt │ │ │ │ │ +-rw-r--r-- 0 sbuild (999) sbuild (999) 18 2026-10-20 11:55:24.000000 jtreg-test-output/langtools/0/JTreport/text/fail2notrun.txt │ │ │ │ │ +-rw-r--r-- 0 sbuild (999) sbuild (999) 21 2026-10-20 11:55:24.000000 jtreg-test-output/langtools/0/JTreport/text/tc_newfailures.txt │ │ │ │ │ +-rw-r--r-- 0 sbuild (999) sbuild (999) 20 2026-10-20 11:55:24.000000 jtreg-test-output/langtools/0/JTreport/text/tc_fail2error.txt │ │ │ │ │ +-rw-r--r-- 0 sbuild (999) sbuild (999) 724 2026-10-20 11:55:24.000000 jtreg-test-output/langtools/0/JTreport/index.html │ │ │ │ │ +lrwxrwxrwx 0 sbuild (999) sbuild (999) 0 2026-10-20 11:55:30.000000 jtreg-test-output/langtools/JTreport -> 0/JTreport │ │ │ │ ├── jtreg-test-output/jdk/2/JTreport/index.html │ │ │ │ │ @@ -3,15 +3,15 @@ │ │ │ │ │ │ │ │ │ │ │ │ │ │ │ │ │ │ │ │ │ │ │ │ │ Report Index │ │ │ │ │ │ │ │ │ │

/build/reproducible-path/openjdk-21-21.0.13~8ea/test/jdk

│ │ │ │ │ -Date of report : 08 October 2026 23:02:04 │ │ │ │ │ +Date of report : 20 October 2026 15:52:58 │ │ │ │ │ │ │ │ │ │

│ │ │ │ │ HTML Report │ │ │ │ │
Standard JT Harness HTML report. Can show a summary of the results, configuration information, and environment values.

│ │ │ │ │

│ │ │ │ │ Plain Text Report │ │ │ │ │
Standard JT Harness text report showing only test names and their result status string. Suitable for parsing by external program.

│ │ │ │ │ ├── html2text {} │ │ │ │ │ │ @@ -1,8 +1,8 @@ │ │ │ │ │ │ ************ //bbuuiilldd//rreepprroodduucciibbllee--ppaatthh//ooppeennjjddkk--2211--2211..00..1133~~88eeaa//tteesstt//jjddkk ************ │ │ │ │ │ │ -Date of report : 08 October 2026 23:02:04 │ │ │ │ │ │ +Date of report : 20 October 2026 15:52:58 │ │ │ │ │ │ _H_T_M_L_ _R_e_p_o_r_t │ │ │ │ │ │ Standard JT Harness HTML report. Can show a summary of the results, │ │ │ │ │ │ configuration information, and environment values. │ │ │ │ │ │ _P_l_a_i_n_ _T_e_x_t_ _R_e_p_o_r_t │ │ │ │ │ │ Standard JT Harness text report showing only test names and their result status │ │ │ │ │ │ string. Suitable for parsing by external program. │ │ │ │ ├── jtreg-test-output/jdk/2/JTreport/html/notRun_gr.html │ │ │ │ │ @@ -47648,16 +47648,16 @@ │ │ │ │ │ 000ba1f0: 6f72 6b20 636f 7272 6563 746c 790a 0a3c ork correctly..< │ │ │ │ │ 000ba200: 6c69 3e73 756e 2f73 6563 7572 6974 792f li>sun/security/ │ │ │ │ │ 000ba210: 736d 6172 7463 6172 6469 6f2f 5465 7374 smartcardio/Test │ │ │ │ │ 000ba220: 5472 616e 736d 6974 2e6a 6176 613a 2074 Transmit.java: t │ │ │ │ │ 000ba230: 6573 7420 7472 616e 736d 6974 2829 2077 est transmit() w │ │ │ │ │ 000ba240: 6f72 6b73 0a3c 2f75 6c3e 0a3c 6872 3e0a orks..
. │ │ │ │ │ 000ba250: 3c73 6d61 6c6c 3e52 6570 6f72 7420 6765 Report ge │ │ │ │ │ -000ba260: 6e65 7261 7465 6420 6f6e 204f 6374 2038 nerated on Oct 8 │ │ │ │ │ -000ba270: 2c20 3230 3236 2031 313a 3032 3a30 34e2 , 2026 11:02:04. │ │ │ │ │ +000ba260: 6e65 7261 7465 6420 6f6e 204f 6374 2032 nerated on Oct 2 │ │ │ │ │ +000ba270: 302c 2032 3032 3620 333a 3532 3a35 38e2 0, 2026 3:52:58. │ │ │ │ │ 000ba280: 80af 504d 0a3c 6272 3e55 7369 6e67 204a ..PM.
Using J │ │ │ │ │ 000ba290: 5420 4861 726e 6573 7320 362e 3020 6232 T Harness 6.0 b2 │ │ │ │ │ 000ba2a0: 363b 2062 7569 6c74 206f 6e20 4d61 7263 6; built on Marc │ │ │ │ │ 000ba2b0: 6820 3138 2c20 3230 3236 2c20 3132 3a30 h 18, 2026, 12:0 │ │ │ │ │ 000ba2c0: 303a 3030 e280 af41 4d20 5554 4320 7769 0:00...AM UTC wi │ │ │ │ │ 000ba2d0: 7468 206f 7065 6e6a 646b 2076 6572 7369 th openjdk versi │ │ │ │ │ 000ba2e0: 6f6e 2022 3235 2e30 2e33 2d65 6122 2032 on "25.0.3-ea" 2 │ │ │ │ │ ├── html2text {} │ │ │ │ │ │ @@ -13393,10 +13393,10 @@ │ │ │ │ │ │ ()/endExclusive() works │ │ │ │ │ │ * sun/security/smartcardio/TestMultiplePresent.java: test that │ │ │ │ │ │ CardTerminals.waitForCard() works │ │ │ │ │ │ * sun/security/smartcardio/TestPresent.java: test that the isCardPresent()/ │ │ │ │ │ │ waitForX() APIs work correctly │ │ │ │ │ │ * sun/security/smartcardio/TestTransmit.java: test transmit() works │ │ │ │ │ │ =============================================================================== │ │ │ │ │ │ -Report generated on Oct 8, 2026 11:02:04 PM │ │ │ │ │ │ +Report generated on Oct 20, 2026 3:52:58 PM │ │ │ │ │ │ Using JT Harness 6.0 b26; built on March 18, 2026, 12:00:00 AM UTC with openjdk │ │ │ │ │ │ version "25.0.3-ea" 2026-04-21 │ │ │ │ ├── jtreg-test-output/jdk/2/JTreport/html/notRun.html │ │ │ │ │ @@ -47631,16 +47631,16 @@ │ │ │ │ │ 000ba0e0: 722f 6d6f 6475 6c65 732f 7661 6c69 6461 r/modules/valida │ │ │ │ │ 000ba0f0: 7465 2f56 616c 6964 6174 654d 6f64 756c te/ValidateModul │ │ │ │ │ 000ba100: 6573 5465 7374 2e6a 6176 613a 2042 6173 esTest.java: Bas │ │ │ │ │ 000ba110: 6963 2074 6573 7420 666f 7220 6a61 7661 ic test for java │ │ │ │ │ 000ba120: 202d 2d76 616c 6964 6174 652d 6d6f 6475 --validate-modu │ │ │ │ │ 000ba130: 6c65 730a 3c62 720a 3e0a 3c68 723e 0a3c les..
.< │ │ │ │ │ 000ba140: 736d 616c 6c3e 5265 706f 7274 2067 656e small>Report gen │ │ │ │ │ -000ba150: 6572 6174 6564 206f 6e20 4f63 7420 382c erated on Oct 8, │ │ │ │ │ -000ba160: 2032 3032 3620 3131 3a30 323a 3034 e280 2026 11:02:04.. │ │ │ │ │ +000ba150: 6572 6174 6564 206f 6e20 4f63 7420 3230 erated on Oct 20 │ │ │ │ │ +000ba160: 2c20 3230 3236 2033 3a35 323a 3538 e280 , 2026 3:52:58.. │ │ │ │ │ 000ba170: af50 4d0a 3c62 723e 5573 696e 6720 4a54 .PM.
Using JT │ │ │ │ │ 000ba180: 2048 6172 6e65 7373 2036 2e30 2062 3236 Harness 6.0 b26 │ │ │ │ │ 000ba190: 3b20 6275 696c 7420 6f6e 204d 6172 6368 ; built on March │ │ │ │ │ 000ba1a0: 2031 382c 2032 3032 362c 2031 323a 3030 18, 2026, 12:00 │ │ │ │ │ 000ba1b0: 3a30 30e2 80af 414d 2055 5443 2077 6974 :00...AM UTC wit │ │ │ │ │ 000ba1c0: 6820 6f70 656e 6a64 6b20 7665 7273 696f h openjdk versio │ │ │ │ │ 000ba1d0: 6e20 2232 352e 302e 332d 6561 2220 3230 n "25.0.3-ea" 20 │ │ │ │ │ ├── html2text {} │ │ │ │ │ │ @@ -12773,10 +12773,10 @@ │ │ │ │ │ │ tools/launcher/modules/patch/systemmodules/PatchSystemModules.java: Patch │ │ │ │ │ │ java.base and user module with ModuleHashes attribute │ │ │ │ │ │ tools/launcher/modules/showmoduleresolution/ShowModuleResolutionTest.java: │ │ │ │ │ │ Basic test for java --show-module-resolution │ │ │ │ │ │ tools/launcher/modules/validate/ValidateModulesTest.java: Basic test for java - │ │ │ │ │ │ -validate-modules │ │ │ │ │ │ =============================================================================== │ │ │ │ │ │ -Report generated on Oct 8, 2026 11:02:04 PM │ │ │ │ │ │ +Report generated on Oct 20, 2026 3:52:58 PM │ │ │ │ │ │ Using JT Harness 6.0 b26; built on March 18, 2026, 12:00:00 AM UTC with openjdk │ │ │ │ │ │ version "25.0.3-ea" 2026-04-21 │ │ │ │ ├── jtreg-test-output/jdk/2/JTreport/html/error_gr.html │ │ │ │ │ @@ -6,9 +6,9 @@ │ │ │ │ │ │ │ │ │ │ JT Harness : Tests that had errors │ │ │ │ │ │ │ │ │ │ │ │ │ │ │ │ │ │ │ │

JT Harness : Tests that had errors

Tests are grouped by their final status message. │ │ │ │ │
│ │ │ │ │ -Report generated on Oct 8, 2026 11:02:04 PM │ │ │ │ │ +Report generated on Oct 20, 2026 3:52:58 PM │ │ │ │ │
Using JT Harness 6.0 b26; built on March 18, 2026, 12:00:00 AM UTC with openjdk version "25.0.3-ea" 2026-04-21
│ │ │ │ │ ├── html2text {} │ │ │ │ │ │ @@ -1,6 +1,6 @@ │ │ │ │ │ │ ************ JJTT HHaarrnneessss :: TTeessttss tthhaatt hhaadd eerrrroorrss ************ │ │ │ │ │ │ Tests are grouped by their final status message. │ │ │ │ │ │ =============================================================================== │ │ │ │ │ │ -Report generated on Oct 8, 2026 11:02:04 PM │ │ │ │ │ │ +Report generated on Oct 20, 2026 3:52:58 PM │ │ │ │ │ │ Using JT Harness 6.0 b26; built on March 18, 2026, 12:00:00 AM UTC with openjdk │ │ │ │ │ │ version "25.0.3-ea" 2026-04-21 │ │ │ │ ├── jtreg-test-output/jdk/2/JTreport/html/error.html │ │ │ │ │ @@ -6,9 +6,9 @@ │ │ │ │ │ │ │ │ │ │ JT Harness : Tests that had errors │ │ │ │ │ │ │ │ │ │ │ │ │ │ │ │ │ │ │ │

JT Harness : Tests that had errors

│ │ │ │ │
│ │ │ │ │ -Report generated on Oct 8, 2026 11:02:04 PM │ │ │ │ │ +Report generated on Oct 20, 2026 3:52:58 PM │ │ │ │ │
Using JT Harness 6.0 b26; built on March 18, 2026, 12:00:00 AM UTC with openjdk version "25.0.3-ea" 2026-04-21
│ │ │ │ │ ├── html2text {} │ │ │ │ │ │ @@ -1,5 +1,5 @@ │ │ │ │ │ │ ************ JJTT HHaarrnneessss :: TTeessttss tthhaatt hhaadd eerrrroorrss ************ │ │ │ │ │ │ =============================================================================== │ │ │ │ │ │ -Report generated on Oct 8, 2026 11:02:04 PM │ │ │ │ │ │ +Report generated on Oct 20, 2026 3:52:58 PM │ │ │ │ │ │ Using JT Harness 6.0 b26; built on March 18, 2026, 12:00:00 AM UTC with openjdk │ │ │ │ │ │ version "25.0.3-ea" 2026-04-21 │ │ │ │ ├── jtreg-test-output/jdk/2/JTreport/html/failed_gr.html │ │ │ │ │ @@ -56,9 +56,9 @@ │ │ │ │ │
  • │ │ │ │ │ java/net/MulticastSocket/SetLoopbackMode.java: Test MulticastSocket.setLoopbackMode │ │ │ │ │ │ │ │ │ │
  • │ │ │ │ │ java/net/MulticastSocket/SetLoopbackModeIPv4.java: Test MulticastSocket.setLoopbackMode with IPv4 addresses │ │ │ │ │ │ │ │ │ │
    │ │ │ │ │ -Report generated on Oct 8, 2026 11:02:04 PM │ │ │ │ │ +Report generated on Oct 20, 2026 3:52:58 PM │ │ │ │ │
    Using JT Harness 6.0 b26; built on March 18, 2026, 12:00:00 AM UTC with openjdk version "25.0.3-ea" 2026-04-21
    │ │ │ │ │ ├── html2text {} │ │ │ │ │ │ @@ -25,10 +25,10 @@ │ │ │ │ │ │ * _j_a_v_a_/_n_e_t_/_M_u_l_t_i_c_a_s_t_S_o_c_k_e_t_/_N_o_L_o_o_p_b_a_c_k_P_a_c_k_e_t_s_._j_a_v_a: Re-test IPv6 (and │ │ │ │ │ │ specifically MulticastSocket) with latest Linux & USAGI code │ │ │ │ │ │ * _j_a_v_a_/_n_e_t_/_M_u_l_t_i_c_a_s_t_S_o_c_k_e_t_/_S_e_t_L_o_o_p_b_a_c_k_M_o_d_e_._j_a_v_a: Test │ │ │ │ │ │ MulticastSocket.setLoopbackMode │ │ │ │ │ │ * _j_a_v_a_/_n_e_t_/_M_u_l_t_i_c_a_s_t_S_o_c_k_e_t_/_S_e_t_L_o_o_p_b_a_c_k_M_o_d_e_I_P_v_4_._j_a_v_a: Test │ │ │ │ │ │ MulticastSocket.setLoopbackMode with IPv4 addresses │ │ │ │ │ │ =============================================================================== │ │ │ │ │ │ -Report generated on Oct 8, 2026 11:02:04 PM │ │ │ │ │ │ +Report generated on Oct 20, 2026 3:52:58 PM │ │ │ │ │ │ Using JT Harness 6.0 b26; built on March 18, 2026, 12:00:00 AM UTC with openjdk │ │ │ │ │ │ version "25.0.3-ea" 2026-04-21 │ │ │ │ ├── jtreg-test-output/jdk/2/JTreport/html/failed.html │ │ │ │ │ @@ -33,9 +33,9 @@ │ │ │ │ │ java/net/SocketPermission/SocketPermissionTest.java: SocketPermission tests for legacy socket types. │ │ │ │ │
    │ │ │ │ │ sun/security/krb5/auto/Addresses.java: fix krb5 caddr │ │ │ │ │
    │ │ │ │ │
    │ │ │ │ │ -Report generated on Oct 8, 2026 11:02:04 PM │ │ │ │ │ +Report generated on Oct 20, 2026 3:52:58 PM │ │ │ │ │
    Using JT Harness 6.0 b26; built on March 18, 2026, 12:00:00 AM UTC with openjdk version "25.0.3-ea" 2026-04-21
    │ │ │ │ │ ├── html2text {} │ │ │ │ │ │ @@ -11,10 +11,10 @@ │ │ │ │ │ │ MulticastSocket.setLoopbackMode with IPv4 addresses │ │ │ │ │ │ _j_a_v_a_/_n_e_t_/_M_u_l_t_i_c_a_s_t_S_o_c_k_e_t_/_T_e_s_t_._j_a_v_a: IPv4 and IPv6 multicasting broken on Linux │ │ │ │ │ │ _j_a_v_a_/_n_e_t_/_S_o_c_k_e_t_O_p_t_i_o_n_/_O_p_t_i_o_n_s_T_e_s_t_._j_a_v_a: │ │ │ │ │ │ _j_a_v_a_/_n_e_t_/_S_o_c_k_e_t_P_e_r_m_i_s_s_i_o_n_/_S_o_c_k_e_t_P_e_r_m_i_s_s_i_o_n_T_e_s_t_._j_a_v_a: SocketPermission tests for │ │ │ │ │ │ legacy socket types. │ │ │ │ │ │ _s_u_n_/_s_e_c_u_r_i_t_y_/_k_r_b_5_/_a_u_t_o_/_A_d_d_r_e_s_s_e_s_._j_a_v_a: fix krb5 caddr │ │ │ │ │ │ =============================================================================== │ │ │ │ │ │ -Report generated on Oct 8, 2026 11:02:04 PM │ │ │ │ │ │ +Report generated on Oct 20, 2026 3:52:58 PM │ │ │ │ │ │ Using JT Harness 6.0 b26; built on March 18, 2026, 12:00:00 AM UTC with openjdk │ │ │ │ │ │ version "25.0.3-ea" 2026-04-21 │ │ │ │ ├── jtreg-test-output/jdk/2/JTreport/html/passed_gr.html │ │ │ │ │ @@ -241,77961 +241,77923 @@ │ │ │ │ │ 00000f00: 6c65 732e 6a74 7222 3e6a 646b 2f63 6c61 les.jtr">jdk/cla │ │ │ │ │ 00000f10: 7373 6669 6c65 2f65 7861 6d70 6c65 732f ssfile/examples/ │ │ │ │ │ 00000f20: 5472 616e 7366 6f72 6d45 7861 6d70 6c65 TransformExample │ │ │ │ │ 00000f30: 732e 6a61 7661 3c2f 613e 3a20 5465 7374 s.java: Test │ │ │ │ │ 00000f40: 696e 6720 436c 6173 7366 696c 6520 5472 ing Classfile Tr │ │ │ │ │ 00000f50: 616e 7366 6f72 6d45 7861 6d70 6c65 7320 ansformExamples │ │ │ │ │ 00000f60: 636f 6d70 696c 6174 696f 6e2e 0a3c 2f75 compilation....

    DEBUG: [ │ │ │ │ │ -00000f80: 4874 7470 436c 695b 2e2e 2e5d 4675 7475 HttpCli[...]Futu │ │ │ │ │ -00000f90: 7265 4036 3736 3466 6235 355b 436f 6d70 re@6764fb55[Comp │ │ │ │ │ -00000fa0: 6c65 7465 6420 6e6f 726d 616c 6c79 5d20 leted normally] │ │ │ │ │ -00000fb0: 2869 643d 3130 3930 292c 206f 6e43 6f6d (id=1090), onCom │ │ │ │ │ -00000fc0: 706c 6574 6552 6563 6569 7665 643a 2074 pleteReceived: t │ │ │ │ │ -00000fd0: 7275 652c 206f 6e45 7272 6f72 3a20 6e75 rue, onError: nu │ │ │ │ │ -00000fe0: 6c6c 5d2c 2072 6561 6442 7566 3a20 6a61 ll], readBuf: ja │ │ │ │ │ -00000ff0: 7661 2e6e 696f 2e48 6561 7042 7974 6542 va.nio.HeapByteB │ │ │ │ │ -00001000: 7566 6665 725b 706f 733d 3830 206c 696d uffer[pos=80 lim │ │ │ │ │ -00001010: 3d38 3020 6361 703d 3230 3438 5d2c 2063 =80 cap=2048], c │ │ │ │ │ -00001020: 6f75 6e74 3a20 3836 2c20 7363 6865 6475 ount: 86, schedu │ │ │ │ │ -00001030: 6c65 723a 2072 756e 6e69 6e67 2c20 7374 ler: running, st │ │ │ │ │ -00001040: 6174 7573 3a20 434c 4f53 4544 2c20 6861 atus: CLOSED, ha │ │ │ │ │ -00001050: 6e64 7368 616b 6553 7461 7465 3a20 302c ndshakeState: 0, │ │ │ │ │ -00001060: 2065 6e67 696e 653a 204e 4f54 5f48 414e engine: NOT_HAN │ │ │ │ │ -00001070: 4453 4841 4b49 4e47 3c2f 6834 3e0a 0a3c DSHAKING

    ..< │ │ │ │ │ -00001080: 756c 3e0a 3c6c 693e 0a3c 6120 6872 6566 ul>.
  • .java/net/ht │ │ │ │ │ -000010e0: 7470 636c 6965 6e74 2f53 706c 6974 5265 tpclient/SplitRe │ │ │ │ │ -000010f0: 7370 6f6e 7365 5353 4c4b 6565 7041 6c69 sponseSSLKeepAli │ │ │ │ │ -00001100: 7665 2e6a 6176 613c 2f61 3e3a 2020 0a3c ve.java: .< │ │ │ │ │ -00001110: 2f75 6c3e 0a0a 3c68 343e 4578 6563 7574 /ul>..

    Execut │ │ │ │ │ -00001120: 696f 6e20 6661 696c 6564 2061 7320 6578 ion failed as ex │ │ │ │ │ -00001130: 7065 6374 6564 3c2f 6834 3e0a 0a3c 756c pected

    ....

    Execution succe │ │ │ │ │ -00001820: 7373 6675 6c3c 2f68 343e 0a0a 3c75 6c3e ssful

    ..